{"text_format":"1","workbook":"xlsx","n_sheets":16,"sheets":["AVISO LEGAL","Balance nacional mensual","Balance nacional anual","Balance Peninsular mensual","Balance Peninsular anual","Balance Baleares mensual","Balance Baleares anual","Balance Canarias mensual","Balance Canarias anual","Balance Ceuta mensual","Balance Ceuta anual","Balance Melilla mensual","Balance Melilla anual","Balance","Mozart Reports","Año"],"not_rendered":{"charts":0,"images":1,"macros":1,"external_links":0,"defined_names":15,"comments":0,"pivot_tables":0},"unopened":[],"bounds":{"document_bytes":16777216,"sheet_cells":100000,"rows_first":2000,"rows_last":500,"rows_between":2000,"halvings":0,"cell_chars":16384,"cell_head_chars":4096},"cells_cut":0,"cells_raw":0,"read":"whole","date_system":"1900"}

{"sheet":"AVISO LEGAL","index":0,"n_rows":23,"n_cols":10,"rows_kept":23,"cut":false,"hidden":false,"merged":[]}
[]
[null,null,null,null,null,null,null,"Fecha de actualización:",null,"2018-10-10"]
[]
[]
[]
[]
[]
[]
[]
[]
[]
[]
[]
[]
[]
[]
[]
[]
[]
[]
[]
[]
[null,null,null,null,null,null,null,null,null,"www.ree.es"]

{"sheet":"Balance nacional mensual","index":1,"n_rows":105,"n_cols":15,"rows_kept":105,"cut":false,"hidden":false,"merged":[[39,1,39,14],[37,1,37,14],[36,1,36,11],[35,1,35,14],[5,2,5,9],[32,1,32,14],[33,1,33,14],[34,1,34,14],[31,1,31,9],[31,11,31,13]]}
[" mensual"]
[]
[]
[null,null,null,null,null,null,null,null,null,null,null,null,"Sistema eléctrico"]
[null,null,null,null,null,null,null,null,null,null,null,null,"Horizonte temporal"]
[null,null,null,null,null,null,null,null,null,null,null,null,"Periodo"]
[]
[null,null,"Ene.","Feb.","Mar.","Abr.","May.","Jun.","Jul.","Ago.","Sep.","Oct.","Nov.","Dic.",{"$f":"OFFSET(Año!C19,($A$104-1),0)","v":2018}]
[]
[null,"Hidráulica",{"$f":"OFFSET(Balance!C85,0,($A$104-1)*12)","v":2194.2032307859995},{"$f":"OFFSET(Balance!D85,0,($A$104-1)*12)","v":2388.6464533500002},{"$f":"OFFSET(Balance!E85,0,($A$104-1)*12)","v":4399.3186045560005},{"$f":"OFFSET(Balance!F85,0,($A$104-1)*12)","v":4716.7044032459999},{"$f":"OFFSET(Balance!G85,0,($A$104-1)*12)","v":3521.1033803240002},{"$f":"OFFSET(Balance!H85,0,($A$104-1)*12)","v":3711.1757685839998},{"$f":"OFFSET(Balance!I85,0,($A$104-1)*12)","v":3024.6335059859998},{"$f":"OFFSET(Balance!J85,0,($A$104-1)*12)","v":2104.2168184919997},{"$f":"OFFSET(Balance!K85,0,($A$104-1)*12)","v":1923.9189707620001},{"$f":"OFFSET(Balance!L85,0,($A$104-1)*12)","v":"-"},{"$f":"OFFSET(Balance!M85,0,($A$104-1)*12)","v":"-"},{"$f":"OFFSET(Balance!N85,0,($A$104-1)*12)","v":"-"},{"$f":"IF(SUM(C10:N10)=0,\"-\",SUM(C10:N10))","v":27983.921136085995}]
[null,"Turbinación bombeo",{"$f":"OFFSET(Balance!C86,0,($A$104-1)*12)","v":273.43523521399999},{"$f":"OFFSET(Balance!D86,0,($A$104-1)*12)","v":180.62302364999999},{"$f":"OFFSET(Balance!E86,0,($A$104-1)*12)","v":369.77771444399997},{"$f":"OFFSET(Balance!F86,0,($A$104-1)*12)","v":345.63732475400002},{"$f":"OFFSET(Balance!G86,0,($A$104-1)*12)","v":153.27436067600001},{"$f":"OFFSET(Balance!H86,0,($A$104-1)*12)","v":58.722846416000003},{"$f":"OFFSET(Balance!I86,0,($A$104-1)*12)","v":35.306144013999997},{"$f":"OFFSET(Balance!J86,0,($A$104-1)*12)","v":60.031041508000001},{"$f":"OFFSET(Balance!K86,0,($A$104-1)*12)","v":40.026753237999998},{"$f":"OFFSET(Balance!L86,0,($A$104-1)*12)","v":"-"},{"$f":"OFFSET(Balance!M86,0,($A$104-1)*12)","v":"-"},{"$f":"OFFSET(Balance!N86,0,($A$104-1)*12)","v":"-"},{"$f":"IF(SUM(C11:N11)=0,\"-\",SUM(C11:N11))","v":1516.8344439140001}]
[null,"Nuclear",{"$f":"OFFSET(Balance!C87,0,($A$104-1)*12)","v":5096.5286330000008},{"$f":"OFFSET(Balance!D87,0,($A$104-1)*12)","v":4592.3205680000001},{"$f":"OFFSET(Balance!E87,0,($A$104-1)*12)","v":4488.9170219999996},{"$f":"OFFSET(Balance!F87,0,($A$104-1)*12)","v":3812.588835},{"$f":"OFFSET(Balance!G87,0,($A$104-1)*12)","v":3728.673667},{"$f":"OFFSET(Balance!H87,0,($A$104-1)*12)","v":3591.5913509999996},{"$f":"OFFSET(Balance!I87,0,($A$104-1)*12)","v":4471.0236880000002},{"$f":"OFFSET(Balance!J87,0,($A$104-1)*12)","v":5135.7246780000005},{"$f":"OFFSET(Balance!K87,0,($A$104-1)*12)","v":5013.0349210000004},{"$f":"OFFSET(Balance!L87,0,($A$104-1)*12)","v":"-"},{"$f":"OFFSET(Balance!M87,0,($A$104-1)*12)","v":"-"},{"$f":"OFFSET(Balance!N87,0,($A$104-1)*12)","v":"-"},39930.403362999998]
[null,"Carbón",{"$f":"OFFSET(Balance!C88,0,($A$104-1)*12)","v":3218.6254900000004},{"$f":"OFFSET(Balance!D88,0,($A$104-1)*12)","v":3681.4806510000003},{"$f":"OFFSET(Balance!E88,0,($A$104-1)*12)","v":1510.503706},{"$f":"OFFSET(Balance!F88,0,($A$104-1)*12)","v":1543.646516},{"$f":"OFFSET(Balance!G88,0,($A$104-1)*12)","v":2439.662014},{"$f":"OFFSET(Balance!H88,0,($A$104-1)*12)","v":2478.5306300000002},{"$f":"OFFSET(Balance!I88,0,($A$104-1)*12)","v":3730.2416590000003},{"$f":"OFFSET(Balance!J88,0,($A$104-1)*12)","v":3753.9574069999999},{"$f":"OFFSET(Balance!K88,0,($A$104-1)*12)","v":4375.7800440000001},{"$f":"OFFSET(Balance!L88,0,($A$104-1)*12)","v":"-"},{"$f":"OFFSET(Balance!M88,0,($A$104-1)*12)","v":"-"},{"$f":"OFFSET(Balance!N88,0,($A$104-1)*12)","v":"-"},26732.428116999996]
[null,"Fuel + Gas",{"$f":"OFFSET(Balance!C89,0,($A$104-1)*12)","v":572.7209959999999},{"$f":"OFFSET(Balance!D89,0,($A$104-1)*12)","v":532.68544399999985},{"$f":"OFFSET(Balance!E89,0,($A$104-1)*12)","v":520.89136200000007},{"$f":"OFFSET(Balance!F89,0,($A$104-1)*12)","v":508.69381700000002},{"$f":"OFFSET(Balance!G89,0,($A$104-1)*12)","v":535.313086},{"$f":"OFFSET(Balance!H89,0,($A$104-1)*12)","v":556.93770700000005},{"$f":"OFFSET(Balance!I89,0,($A$104-1)*12)","v":616.82100700000001},{"$f":"OFFSET(Balance!J89,0,($A$104-1)*12)","v":657.91701899999987},{"$f":"OFFSET(Balance!K89,0,($A$104-1)*12)","v":590.32344500000022},{"$f":"OFFSET(Balance!L89,0,($A$104-1)*12)","v":"-"},{"$f":"OFFSET(Balance!M89,0,($A$104-1)*12)","v":"-"},{"$f":"OFFSET(Balance!N89,0,($A$104-1)*12)","v":"-"},5092.3038829999996]
[null,"Ciclo combinado (2)",{"$f":"OFFSET(Balance!C90,0,($A$104-1)*12)","v":2519.7350820000001},{"$f":"OFFSET(Balance!D90,0,($A$104-1)*12)","v":2214.076313},{"$f":"OFFSET(Balance!E90,0,($A$104-1)*12)","v":1548.3190380000001},{"$f":"OFFSET(Balance!F90,0,($A$104-1)*12)","v":1495.0459250000001},{"$f":"OFFSET(Balance!G90,0,($A$104-1)*12)","v":2262.7707700000001},{"$f":"OFFSET(Balance!H90,0,($A$104-1)*12)","v":2451.8301609999994},{"$f":"OFFSET(Balance!I90,0,($A$104-1)*12)","v":2513.1795780000002},{"$f":"OFFSET(Balance!J90,0,($A$104-1)*12)","v":2977.310293},{"$f":"OFFSET(Balance!K90,0,($A$104-1)*12)","v":2461.2389950000002},{"$f":"OFFSET(Balance!L90,0,($A$104-1)*12)","v":"-"},{"$f":"OFFSET(Balance!M90,0,($A$104-1)*12)","v":"-"},{"$f":"OFFSET(Balance!N90,0,($A$104-1)*12)","v":"-"},20443.506154999999]
[null,"Régimen ordinario",{"$f":"OFFSET(Balance!C91,0,($A$104-1)*12)","v":"-"},{"$f":"OFFSET(Balance!D91,0,($A$104-1)*12)","v":"-"},{"$f":"OFFSET(Balance!E91,0,($A$104-1)*12)","v":"-"},{"$f":"OFFSET(Balance!F91,0,($A$104-1)*12)","v":"-"},{"$f":"OFFSET(Balance!G91,0,($A$104-1)*12)","v":"-"},{"$f":"OFFSET(Balance!H91,0,($A$104-1)*12)","v":"-"},{"$f":"OFFSET(Balance!I91,0,($A$104-1)*12)","v":"-"},{"$f":"OFFSET(Balance!J91,0,($A$104-1)*12)","v":"-"},{"$f":"OFFSET(Balance!K91,0,($A$104-1)*12)","v":"-"},{"$f":"OFFSET(Balance!L91,0,($A$104-1)*12)","v":"-"},{"$f":"OFFSET(Balance!M91,0,($A$104-1)*12)","v":"-"},{"$f":"OFFSET(Balance!N91,0,($A$104-1)*12)","v":"-"},"-"]
[]
[null,"Hidroeólica",{"$f":"OFFSET(Balance!C92,0,($A$104-1)*12)","v":2.2577669999999999},{"$f":"OFFSET(Balance!D92,0,($A$104-1)*12)","v":1.754305},{"$f":"OFFSET(Balance!E92,0,($A$104-1)*12)","v":1.5995219999999999},{"$f":"OFFSET(Balance!F92,0,($A$104-1)*12)","v":2.2626460000000002},{"$f":"OFFSET(Balance!G92,0,($A$104-1)*12)","v":2.0342029999999998},{"$f":"OFFSET(Balance!H92,0,($A$104-1)*12)","v":2.3218040000000002},{"$f":"OFFSET(Balance!I92,0,($A$104-1)*12)","v":3.7162829999999998},{"$f":"OFFSET(Balance!J92,0,($A$104-1)*12)","v":2.859321},{"$f":"OFFSET(Balance!K92,0,($A$104-1)*12)","v":2.165861},{"$f":"OFFSET(Balance!L92,0,($A$104-1)*12)","v":"-"},{"$f":"OFFSET(Balance!M92,0,($A$104-1)*12)","v":"-"},{"$f":"OFFSET(Balance!N92,0,($A$104-1)*12)","v":"-"},{"$f":"IF(SUM(C18:N18)=0,\"-\",SUM(C18:N18))","v":20.971712}]
[null,"Resto hidráulica (3)",{"$f":"OFFSET(Balance!C93,0,($A$104-1)*12)","v":"-"},{"$f":"OFFSET(Balance!D93,0,($A$104-1)*12)","v":"-"},{"$f":"OFFSET(Balance!E93,0,($A$104-1)*12)","v":"-"},{"$f":"OFFSET(Balance!F93,0,($A$104-1)*12)","v":"-"},{"$f":"OFFSET(Balance!G93,0,($A$104-1)*12)","v":"-"},{"$f":"OFFSET(Balance!H93,0,($A$104-1)*12)","v":"-"},{"$f":"OFFSET(Balance!I93,0,($A$104-1)*12)","v":"-"},{"$f":"OFFSET(Balance!J93,0,($A$104-1)*12)","v":"-"},{"$f":"OFFSET(Balance!K93,0,($A$104-1)*12)","v":"-"},{"$f":"OFFSET(Balance!L93,0,($A$104-1)*12)","v":"-"},{"$f":"OFFSET(Balance!M93,0,($A$104-1)*12)","v":"-"},{"$f":"OFFSET(Balance!N93,0,($A$104-1)*12)","v":"-"},"-"]
[null,"Eólica",{"$f":"OFFSET(Balance!C94,0,($A$104-1)*12)","v":5343.1658960000004},{"$f":"OFFSET(Balance!D94,0,($A$104-1)*12)","v":4680.1140400000004},{"$f":"OFFSET(Balance!E94,0,($A$104-1)*12)","v":7701.0427059999993},{"$f":"OFFSET(Balance!F94,0,($A$104-1)*12)","v":4455.3973569999998},{"$f":"OFFSET(Balance!G94,0,($A$104-1)*12)","v":3309.464974},{"$f":"OFFSET(Balance!H94,0,($A$104-1)*12)","v":2628.2477280000003},{"$f":"OFFSET(Balance!I94,0,($A$104-1)*12)","v":2573.5779320000001},{"$f":"OFFSET(Balance!J94,0,($A$104-1)*12)","v":3129.0389970000001},{"$f":"OFFSET(Balance!K94,0,($A$104-1)*12)","v":2455.0871730000003},{"$f":"OFFSET(Balance!L94,0,($A$104-1)*12)","v":"-"},{"$f":"OFFSET(Balance!M94,0,($A$104-1)*12)","v":"-"},{"$f":"OFFSET(Balance!N94,0,($A$104-1)*12)","v":"-"},36275.136803000001]
[null,"Solar fotovoltaica",{"$f":"OFFSET(Balance!C95,0,($A$104-1)*12)","v":444.31957599999998},{"$f":"OFFSET(Balance!D95,0,($A$104-1)*12)","v":510.23763100000002},{"$f":"OFFSET(Balance!E95,0,($A$104-1)*12)","v":590.64223700000002},{"$f":"OFFSET(Balance!F95,0,($A$104-1)*12)","v":700.87219300000015},{"$f":"OFFSET(Balance!G95,0,($A$104-1)*12)","v":812.49557899999991},{"$f":"OFFSET(Balance!H95,0,($A$104-1)*12)","v":818.32591300000001},{"$f":"OFFSET(Balance!I95,0,($A$104-1)*12)","v":929.38433400000008},{"$f":"OFFSET(Balance!J95,0,($A$104-1)*12)","v":841.11832900000002},{"$f":"OFFSET(Balance!K95,0,($A$104-1)*12)","v":666.32017599999995},{"$f":"OFFSET(Balance!L95,0,($A$104-1)*12)","v":"-"},{"$f":"OFFSET(Balance!M95,0,($A$104-1)*12)","v":"-"},{"$f":"OFFSET(Balance!N95,0,($A$104-1)*12)","v":"-"},6313.7159680000004]
[null,"Solar térmica",{"$f":"OFFSET(Balance!C96,0,($A$104-1)*12)","v":112.387517},{"$f":"OFFSET(Balance!D96,0,($A$104-1)*12)","v":229.80815100000001},{"$f":"OFFSET(Balance!E96,0,($A$104-1)*12)","v":233.95594299999999},{"$f":"OFFSET(Balance!F96,0,($A$104-1)*12)","v":325.935092},{"$f":"OFFSET(Balance!G96,0,($A$104-1)*12)","v":477.20963399999999},{"$f":"OFFSET(Balance!H96,0,($A$104-1)*12)","v":551.29260299999999},{"$f":"OFFSET(Balance!I96,0,($A$104-1)*12)","v":858.89464800000007},{"$f":"OFFSET(Balance!J96,0,($A$104-1)*12)","v":688.557997},{"$f":"OFFSET(Balance!K96,0,($A$104-1)*12)","v":465.63993599999998},{"$f":"OFFSET(Balance!L96,0,($A$104-1)*12)","v":"-"},{"$f":"OFFSET(Balance!M96,0,($A$104-1)*12)","v":"-"},{"$f":"OFFSET(Balance!N96,0,($A$104-1)*12)","v":"-"},3943.681521]
[null,"Otras renovables",{"$f":"OFFSET(Balance!C97,0,($A$104-1)*12)","v":296.33144100000004},{"$f":"OFFSET(Balance!D97,0,($A$104-1)*12)","v":301.60146800000001},{"$f":"OFFSET(Balance!E97,0,($A$104-1)*12)","v":270.09188899999998},{"$f":"OFFSET(Balance!F97,0,($A$104-1)*12)","v":237.806487},{"$f":"OFFSET(Balance!G97,0,($A$104-1)*12)","v":291.74627799999996},{"$f":"OFFSET(Balance!H97,0,($A$104-1)*12)","v":304.38883600000003},{"$f":"OFFSET(Balance!I97,0,($A$104-1)*12)","v":324.14899300000002},{"$f":"OFFSET(Balance!J97,0,($A$104-1)*12)","v":317.27380400000004},{"$f":"OFFSET(Balance!K97,0,($A$104-1)*12)","v":320.02910299999996},{"$f":"OFFSET(Balance!L97,0,($A$104-1)*12)","v":"-"},{"$f":"OFFSET(Balance!M97,0,($A$104-1)*12)","v":"-"},{"$f":"OFFSET(Balance!N97,0,($A$104-1)*12)","v":"-"},2663.4182990000004]
[null,"Cogeneración",{"$f":"OFFSET(Balance!C98,0,($A$104-1)*12)","v":2483.6320450000003},{"$f":"OFFSET(Balance!D98,0,($A$104-1)*12)","v":2254.164393},{"$f":"OFFSET(Balance!E98,0,($A$104-1)*12)","v":2337.8219810000001},{"$f":"OFFSET(Balance!F98,0,($A$104-1)*12)","v":2355.5717629999999},{"$f":"OFFSET(Balance!G98,0,($A$104-1)*12)","v":2420.884775},{"$f":"OFFSET(Balance!H98,0,($A$104-1)*12)","v":2407.0033799999997},{"$f":"OFFSET(Balance!I98,0,($A$104-1)*12)","v":2435.6083699999999},{"$f":"OFFSET(Balance!J98,0,($A$104-1)*12)","v":2361.847334},{"$f":"OFFSET(Balance!K98,0,($A$104-1)*12)","v":2394.3984729999997},{"$f":"OFFSET(Balance!L98,0,($A$104-1)*12)","v":"-"},{"$f":"OFFSET(Balance!M98,0,($A$104-1)*12)","v":"-"},{"$f":"OFFSET(Balance!N98,0,($A$104-1)*12)","v":"-"},21450.932514]
[null,"Residuos no renovables",{"$f":"OFFSET(Balance!C99,0,($A$104-1)*12)","v":234.5740625},{"$f":"OFFSET(Balance!D99,0,($A$104-1)*12)","v":209.15052299999999},{"$f":"OFFSET(Balance!E99,0,($A$104-1)*12)","v":227.1195505},{"$f":"OFFSET(Balance!F99,0,($A$104-1)*12)","v":180.40752700000002},{"$f":"OFFSET(Balance!G99,0,($A$104-1)*12)","v":148.02814699999999},{"$f":"OFFSET(Balance!H99,0,($A$104-1)*12)","v":190.54532699999999},{"$f":"OFFSET(Balance!I99,0,($A$104-1)*12)","v":214.466498},{"$f":"OFFSET(Balance!J99,0,($A$104-1)*12)","v":210.08752750000002},{"$f":"OFFSET(Balance!K99,0,($A$104-1)*12)","v":202.9028615},{"$f":"OFFSET(Balance!L99,0,($A$104-1)*12)","v":"-"},{"$f":"OFFSET(Balance!M99,0,($A$104-1)*12)","v":"-"},{"$f":"OFFSET(Balance!N99,0,($A$104-1)*12)","v":"-"},1817.2820240000001]
[null,"Residuos renovables",{"$f":"OFFSET(Balance!C100,0,($A$104-1)*12)","v":77.266070499999998},{"$f":"OFFSET(Balance!D100,0,($A$104-1)*12)","v":67.136116999999999},{"$f":"OFFSET(Balance!E100,0,($A$104-1)*12)","v":77.633272500000004},{"$f":"OFFSET(Balance!F100,0,($A$104-1)*12)","v":77.872185000000002},{"$f":"OFFSET(Balance!G100,0,($A$104-1)*12)","v":35.345674000000002},{"$f":"OFFSET(Balance!H100,0,($A$104-1)*12)","v":65.936057000000005},{"$f":"OFFSET(Balance!I100,0,($A$104-1)*12)","v":79.704862999999989},{"$f":"OFFSET(Balance!J100,0,($A$104-1)*12)","v":81.187428499999996},{"$f":"OFFSET(Balance!K100,0,($A$104-1)*12)","v":78.622101499999999},{"$f":"OFFSET(Balance!L100,0,($A$104-1)*12)","v":"-"},{"$f":"OFFSET(Balance!M100,0,($A$104-1)*12)","v":"-"},{"$f":"OFFSET(Balance!N100,0,($A$104-1)*12)","v":"-"},{"$f":"IF(SUM(C26:N26)=0,\"-\",SUM(C26:N26))","v":640.70376899999997}]
[null,"Régimen especial",{"$f":"OFFSET(Balance!C101,0,($A$104-1)*12)","v":"-"},{"$f":"OFFSET(Balance!D101,0,($A$104-1)*12)","v":"-"},{"$f":"OFFSET(Balance!E101,0,($A$104-1)*12)","v":"-"},{"$f":"OFFSET(Balance!F101,0,($A$104-1)*12)","v":"-"},{"$f":"OFFSET(Balance!G101,0,($A$104-1)*12)","v":"-"},{"$f":"OFFSET(Balance!H101,0,($A$104-1)*12)","v":"-"},{"$f":"OFFSET(Balance!I101,0,($A$104-1)*12)","v":"-"},{"$f":"OFFSET(Balance!J101,0,($A$104-1)*12)","v":"-"},{"$f":"OFFSET(Balance!K101,0,($A$104-1)*12)","v":"-"},{"$f":"OFFSET(Balance!L101,0,($A$104-1)*12)","v":"-"},{"$f":"OFFSET(Balance!M101,0,($A$104-1)*12)","v":"-"},{"$f":"OFFSET(Balance!N101,0,($A$104-1)*12)","v":"-"},"-"]
[null,"Generación",{"$f":"OFFSET(Balance!C102,0,($A$104-1)*12)","v":22869.183042000001},{"$f":"OFFSET(Balance!D102,0,($A$104-1)*12)","v":21843.799081000001},{"$f":"OFFSET(Balance!E102,0,($A$104-1)*12)","v":24277.634547999998},{"$f":"OFFSET(Balance!F102,0,($A$104-1)*12)","v":20758.442070999998},{"$f":"OFFSET(Balance!G102,0,($A$104-1)*12)","v":20138.006541999999},{"$f":"OFFSET(Balance!H102,0,($A$104-1)*12)","v":19816.850111999996},{"$f":"OFFSET(Balance!I102,0,($A$104-1)*12)","v":21810.707503000005},{"$f":"OFFSET(Balance!J102,0,($A$104-1)*12)","v":22321.127995000003},{"$f":"OFFSET(Balance!K102,0,($A$104-1)*12)","v":20989.488814000004},{"$f":"OFFSET(Balance!L102,0,($A$104-1)*12)","v":"-"},{"$f":"OFFSET(Balance!M102,0,($A$104-1)*12)","v":"-"},{"$f":"OFFSET(Balance!N102,0,($A$104-1)*12)","v":"-"},{"$f":"IF(SUM(C28:N28)=0,\"-\",SUM(C28:N28))","v":194825.23970800001}]
[null,"Consumos en bombeo",{"$f":"OFFSET(Balance!C103,0,($A$104-1)*12)","v":-391.47835200000003},{"$f":"OFFSET(Balance!D103,0,($A$104-1)*12)","v":-253.86108900000002},{"$f":"OFFSET(Balance!E103,0,($A$104-1)*12)","v":-733.49642400000005},{"$f":"OFFSET(Balance!F103,0,($A$104-1)*12)","v":-560.06841218400007},{"$f":"OFFSET(Balance!G103,0,($A$104-1)*12)","v":-213.24354462900001},{"$f":"OFFSET(Balance!H103,0,($A$104-1)*12)","v":-83.652090872000002},{"$f":"OFFSET(Balance!I103,0,($A$104-1)*12)","v":-57.940257936000002},{"$f":"OFFSET(Balance!J103,0,($A$104-1)*12)","v":-68.902296153999998},{"$f":"OFFSET(Balance!K103,0,($A$104-1)*12)","v":-80.573028000000008},{"$f":"OFFSET(Balance!L103,0,($A$104-1)*12)","v":"-"},{"$f":"OFFSET(Balance!M103,0,($A$104-1)*12)","v":"-"},{"$f":"OFFSET(Balance!N103,0,($A$104-1)*12)","v":"-"},-2443.2154947749996]
[null,"Saldo intercambios internacionales (4)",{"$f":"OFFSET(Balance!C104,0,($A$104-1)*12)","v":1340.2982630000001},{"$f":"OFFSET(Balance!D104,0,($A$104-1)*12)","v":857.10299299999997},{"$f":"OFFSET(Balance!E104,0,($A$104-1)*12)","v":-273.62203199999999},{"$f":"OFFSET(Balance!F104,0,($A$104-1)*12)","v":882.59852599999999},{"$f":"OFFSET(Balance!G104,0,($A$104-1)*12)","v":1368.3609369999999},{"$f":"OFFSET(Balance!H104,0,($A$104-1)*12)","v":1863.9643000000001},{"$f":"OFFSET(Balance!I104,0,($A$104-1)*12)","v":1893.727091},{"$f":"OFFSET(Balance!J104,0,($A$104-1)*12)","v":1244.0220749999999},{"$f":"OFFSET(Balance!K104,0,($A$104-1)*12)","v":1124.4621510000002},{"$f":"OFFSET(Balance!L104,0,($A$104-1)*12)","v":"-"},{"$f":"OFFSET(Balance!M104,0,($A$104-1)*12)","v":"-"},{"$f":"OFFSET(Balance!N104,0,($A$104-1)*12)","v":"-"},10300.914304]
[null,"Demanda transporte (b.c.)",{"$f":"OFFSET(Balance!C105,0,($A$104-1)*12)","v":23818.002953000003},{"$f":"OFFSET(Balance!D105,0,($A$104-1)*12)","v":22447.040985},{"$f":"OFFSET(Balance!E105,0,($A$104-1)*12)","v":23270.516091999998},{"$f":"OFFSET(Balance!F105,0,($A$104-1)*12)","v":21080.972184816001},{"$f":"OFFSET(Balance!G105,0,($A$104-1)*12)","v":21293.123934371},{"$f":"OFFSET(Balance!H105,0,($A$104-1)*12)","v":21597.162321127995},{"$f":"OFFSET(Balance!I105,0,($A$104-1)*12)","v":23646.494336064006},{"$f":"OFFSET(Balance!J105,0,($A$104-1)*12)","v":23496.247773846004},{"$f":"OFFSET(Balance!K105,0,($A$104-1)*12)","v":22033.377937000005},{"$f":"OFFSET(Balance!L105,0,($A$104-1)*12)","v":"-"},{"$f":"OFFSET(Balance!M105,0,($A$104-1)*12)","v":"-"},{"$f":"OFFSET(Balance!N105,0,($A$104-1)*12)","v":"-"},{"$f":"IF(SUM(C31:N31)=0,\"-\",SUM(C31:N31))","v":202682.938517225}]
[null,"(1) Asignación de unidades de producción según combustible principal."]
[null,"(2) Incluye funcionamiento en ciclo abierto."]
[]
[null,"(3) Incluye todas aquellas unidades menores de 50 MW que no pertenecen a ninguna unidad de gestión hidráulica (UGH)."]
[null,"(4) Valor positivo: saldo importador; valor negativo: saldo exportador."]
[null,"(5) Hasta 2010 incluye residuos."]
[null,{"$f":"IF(MONTH('AVISO LEGAL'!J2)=1,CONCATENATE(\"Datos definitivos hasta el 31/03/2017. Datos provisionales del 01/04/2017 al \",TEXT(EOMONTH('AVISO LEGAL'!J2-60,0),\"dd/mm/aaaa\"),\". Datos programados del 01/12/\",YEAR('AVISO LEGAL'!J2)-1,\" al \",TEXT(EOMONTH('AVISO LEGAL'!J2-30,0),\"dd/mm/aaaa\"),\".\"),CONCATENATE(\"Datos definitivos hasta el 31/03/2017. Datos provisionales del 01/04/2017 al \",TEXT(EOMONTH('AVISO LEGAL'!J2-60,0),\"dd/mm/aaaa\"),\". Datos programados del 01/\",TEXT(MONTH('AVISO LEGAL'!J2)-1,\"00\"),\"/\",YEAR('AVISO LEGAL'!J2),\" al \",TEXT(EOMONTH('AVISO LEGAL'!J2-30,0),\"dd/mm/aaaa\"),\".\"))","v":"Datos definitivos hasta el 31/03/2017. Datos provisionales del 01/04/2017 al 31/08/2018. Datos programados del 01/09/2018 al 30/09/2018."}]
[]
[]
[]
[]
[]
[]
[]
[]
[]
[]
[]
[]
[]
[]
[]
[]
[]
[]
[]
[]
[]
[]
[]
[]
[]
[]
[]
[]
[]
[]
[]
[]
[]
[]
[]
[]
[]
[]
[]
[]
[]
[]
[]
[]
[]
[]
[]
[]
[]
[]
[]
[]
[]
[]
[]
[]
[]
[]
[]
[]
[]
[]
[]
[2]
[11]
[12]
[11]

{"sheet":"Balance nacional anual","index":2,"n_rows":40,"n_cols":9,"rows_kept":40,"cut":false,"hidden":false,"merged":[[36,1,36,11],[35,1,35,11],[31,1,31,11],[32,1,32,11],[33,1,33,11],[34,1,34,11]]}
[null,null,null,null,null,null,null,null,2]
[]
[]
[null,null,null,null,null,null,null,"Sistema eléctrico"]
[null,null,null,null,null,null,null,"Horizonte temporal"]
[null,null,null,null,null,null,null,"Periodo"]
[]
[null,null,{"$f":"OFFSET(Balance!C189,0,($I$1-1)*7)","v":2014},{"$f":"OFFSET(Balance!D189,0,($I$1-1)*7)","v":2015},{"$f":"OFFSET(Balance!E189,0,($I$1-1)*7)","v":2016},{"$f":"OFFSET(Balance!F189,0,($I$1-1)*7)","v":2017},{"$f":"OFFSET(Balance!G189,0,($I$1-1)*7)","v":2018},{"$f":"OFFSET(Balance!H189,0,($I$1-1)*7)","v":2019},{"$f":"OFFSET(Balance!I189,0,($I$1-1)*7)","v":2020}]
[]
[null,"Hidráulica",{"$f":"OFFSET(Balance!C190,0,($I$1-1)*7)","v":39181.985215204004},{"$f":"OFFSET(Balance!D190,0,($I$1-1)*7)","v":28382.579963850003},{"$f":"OFFSET(Balance!E190,0,($I$1-1)*7)","v":36114.888326772001},{"$f":"OFFSET(Balance!F190,0,($I$1-1)*7)","v":18449.166495660003},{"$f":"OFFSET(Balance!G190,0,($I$1-1)*7)","v":27983.921136085999},{"$f":"OFFSET(Balance!H190,0,($I$1-1)*7)","v":"-"},{"$f":"OFFSET(Balance!I190,0,($I$1-1)*7)","v":"-"}]
[null,"Turbinación bombeo",{"$f":"OFFSET(Balance!C191,0,($I$1-1)*7)","v":3415.9960267959996},{"$f":"OFFSET(Balance!D191,0,($I$1-1)*7)","v":2895.3657881499998},{"$f":"OFFSET(Balance!E191,0,($I$1-1)*7)","v":3134.3289102280005},{"$f":"OFFSET(Balance!F191,0,($I$1-1)*7)","v":2248.9644183400001},{"$f":"OFFSET(Balance!G191,0,($I$1-1)*7)","v":1516.8344439140001},{"$f":"OFFSET(Balance!H191,0,($I$1-1)*7)","v":"-"},{"$f":"OFFSET(Balance!I191,0,($I$1-1)*7)","v":"-"}]
[null,"Nuclear",{"$f":"OFFSET(Balance!C192,0,($I$1-1)*7)","v":54781.281335},{"$f":"OFFSET(Balance!D192,0,($I$1-1)*7)","v":54661.803305000009},{"$f":"OFFSET(Balance!E192,0,($I$1-1)*7)","v":56021.682058999999},{"$f":"OFFSET(Balance!F192,0,($I$1-1)*7)","v":55539.561502000004},{"$f":"OFFSET(Balance!G192,0,($I$1-1)*7)","v":39930.403362999998},{"$f":"OFFSET(Balance!H192,0,($I$1-1)*7)","v":"-"},{"$f":"OFFSET(Balance!I192,0,($I$1-1)*7)","v":"-"}]
[null,"Carbón",{"$f":"OFFSET(Balance!C193,0,($I$1-1)*7)","v":43246.056496999998},{"$f":"OFFSET(Balance!D193,0,($I$1-1)*7)","v":52616.477597999998},{"$f":"OFFSET(Balance!E193,0,($I$1-1)*7)","v":37313.777751000001},{"$f":"OFFSET(Balance!F193,0,($I$1-1)*7)","v":45020.615777999999},{"$f":"OFFSET(Balance!G193,0,($I$1-1)*7)","v":26732.428116999999},{"$f":"OFFSET(Balance!H193,0,($I$1-1)*7)","v":"-"},{"$f":"OFFSET(Balance!I193,0,($I$1-1)*7)","v":"-"}]
[null,"Fuel + Gas",{"$f":"OFFSET(Balance!C194,0,($I$1-1)*7)","v":6241.8218880000004},{"$f":"OFFSET(Balance!D194,0,($I$1-1)*7)","v":6483.8144279999979},{"$f":"OFFSET(Balance!E194,0,($I$1-1)*7)","v":6754.6440300000004},{"$f":"OFFSET(Balance!F194,0,($I$1-1)*7)","v":7001.4682789999979},{"$f":"OFFSET(Balance!G194,0,($I$1-1)*7)","v":5092.3038830000005},{"$f":"OFFSET(Balance!H194,0,($I$1-1)*7)","v":"-"},{"$f":"OFFSET(Balance!I194,0,($I$1-1)*7)","v":"-"}]
[null,"Ciclo combinado (2)",{"$f":"OFFSET(Balance!C195,0,($I$1-1)*7)","v":24780.733440999997},{"$f":"OFFSET(Balance!D195,0,($I$1-1)*7)","v":29027.289334999998},{"$f":"OFFSET(Balance!E195,0,($I$1-1)*7)","v":29006.482093999999},{"$f":"OFFSET(Balance!F195,0,($I$1-1)*7)","v":37065.792493000001},{"$f":"OFFSET(Balance!G195,0,($I$1-1)*7)","v":20443.506155000003},{"$f":"OFFSET(Balance!H195,0,($I$1-1)*7)","v":"-"},{"$f":"OFFSET(Balance!I195,0,($I$1-1)*7)","v":"-"}]
[null,"Régimen ordinario",{"$f":"OFFSET(Balance!C196,0,($I$1-1)*7)","v":0},{"$f":"OFFSET(Balance!D196,0,($I$1-1)*7)","v":0},{"$f":"OFFSET(Balance!E196,0,($I$1-1)*7)","v":0},{"$f":"OFFSET(Balance!F196,0,($I$1-1)*7)","v":0},{"$f":"OFFSET(Balance!G196,0,($I$1-1)*7)","v":0},{"$f":"OFFSET(Balance!H196,0,($I$1-1)*7)","v":0},{"$f":"OFFSET(Balance!I196,0,($I$1-1)*7)","v":0}]
[]
[null,"Hidroeólica",{"$f":"OFFSET(Balance!C197,0,($I$1-1)*7)","v":0.72883699999999996},{"$f":"OFFSET(Balance!D197,0,($I$1-1)*7)","v":8.2074240000000014},{"$f":"OFFSET(Balance!E197,0,($I$1-1)*7)","v":17.891935999999998},{"$f":"OFFSET(Balance!F197,0,($I$1-1)*7)","v":20.233057000000002},{"$f":"OFFSET(Balance!G197,0,($I$1-1)*7)","v":20.971712},{"$f":"OFFSET(Balance!H197,0,($I$1-1)*7)","v":"-"},{"$f":"OFFSET(Balance!I197,0,($I$1-1)*7)","v":"-"}]
[null,"Resto hidráulica (3)",{"$f":"OFFSET(Balance!C198,0,($I$1-1)*7)","v":0},{"$f":"OFFSET(Balance!D198,0,($I$1-1)*7)","v":0},{"$f":"OFFSET(Balance!E198,0,($I$1-1)*7)","v":0},{"$f":"OFFSET(Balance!F198,0,($I$1-1)*7)","v":0},{"$f":"OFFSET(Balance!G198,0,($I$1-1)*7)","v":0},{"$f":"OFFSET(Balance!H198,0,($I$1-1)*7)","v":0},{"$f":"OFFSET(Balance!I198,0,($I$1-1)*7)","v":0}]
[null,"Eólica",{"$f":"OFFSET(Balance!C199,0,($I$1-1)*7)","v":51032.030848000009},{"$f":"OFFSET(Balance!D199,0,($I$1-1)*7)","v":48117.887515999995},{"$f":"OFFSET(Balance!E199,0,($I$1-1)*7)","v":47696.660308999999},{"$f":"OFFSET(Balance!F199,0,($I$1-1)*7)","v":47907.283440000007},{"$f":"OFFSET(Balance!G199,0,($I$1-1)*7)","v":36275.136803000001},{"$f":"OFFSET(Balance!H199,0,($I$1-1)*7)","v":"-"},{"$f":"OFFSET(Balance!I199,0,($I$1-1)*7)","v":"-"}]
[null,"Solar fotovoltaica",{"$f":"OFFSET(Balance!C200,0,($I$1-1)*7)","v":8207.9261310000002},{"$f":"OFFSET(Balance!D200,0,($I$1-1)*7)","v":8243.5609049999985},{"$f":"OFFSET(Balance!E200,0,($I$1-1)*7)","v":7977.4671849999995},{"$f":"OFFSET(Balance!F200,0,($I$1-1)*7)","v":8397.1067059999987},{"$f":"OFFSET(Balance!G200,0,($I$1-1)*7)","v":6313.7159680000004},{"$f":"OFFSET(Balance!H200,0,($I$1-1)*7)","v":"-"},{"$f":"OFFSET(Balance!I200,0,($I$1-1)*7)","v":"-"}]
[null,"Solar térmica",{"$f":"OFFSET(Balance!C201,0,($I$1-1)*7)","v":4958.9149259999995},{"$f":"OFFSET(Balance!D201,0,($I$1-1)*7)","v":5085.235514},{"$f":"OFFSET(Balance!E201,0,($I$1-1)*7)","v":5071.2017019999994},{"$f":"OFFSET(Balance!F201,0,($I$1-1)*7)","v":5347.9181920000001},{"$f":"OFFSET(Balance!G201,0,($I$1-1)*7)","v":3943.681521},{"$f":"OFFSET(Balance!H201,0,($I$1-1)*7)","v":"-"},{"$f":"OFFSET(Balance!I201,0,($I$1-1)*7)","v":"-"}]
[null,"Térmica renovable(5)/Otras renovables",{"$f":"OFFSET(Balance!C202,0,($I$1-1)*7)","v":3816.3157169999999},{"$f":"OFFSET(Balance!D202,0,($I$1-1)*7)","v":3432.5919209999997},{"$f":"OFFSET(Balance!E202,0,($I$1-1)*7)","v":3425.6648279999999},{"$f":"OFFSET(Balance!F202,0,($I$1-1)*7)","v":3609.9418260000002},{"$f":"OFFSET(Balance!G202,0,($I$1-1)*7)","v":2663.4182989999999},{"$f":"OFFSET(Balance!H202,0,($I$1-1)*7)","v":"-"},{"$f":"OFFSET(Balance!I202,0,($I$1-1)*7)","v":"-"}]
[null,"Cogeneración y resto(5)/Cogeneración",{"$f":"OFFSET(Balance!C203,0,($I$1-1)*7)","v":24153.243881999999},{"$f":"OFFSET(Balance!D203,0,($I$1-1)*7)","v":25200.877766000005},{"$f":"OFFSET(Balance!E203,0,($I$1-1)*7)","v":25908.643558999996},{"$f":"OFFSET(Balance!F203,0,($I$1-1)*7)","v":28211.540875000002},{"$f":"OFFSET(Balance!G203,0,($I$1-1)*7)","v":21450.932514},{"$f":"OFFSET(Balance!H203,0,($I$1-1)*7)","v":"-"},{"$f":"OFFSET(Balance!I203,0,($I$1-1)*7)","v":"-"}]
[null,"Residuos no renovables",{"$f":"OFFSET(Balance!C204,0,($I$1-1)*7)","v":1965.8770435000001},{"$f":"OFFSET(Balance!D204,0,($I$1-1)*7)","v":2480.1089684999997},{"$f":"OFFSET(Balance!E204,0,($I$1-1)*7)","v":2606.9637644999998},{"$f":"OFFSET(Balance!F204,0,($I$1-1)*7)","v":2607.9695430000002},{"$f":"OFFSET(Balance!G204,0,($I$1-1)*7)","v":1817.2820240000001},{"$f":"OFFSET(Balance!H204,0,($I$1-1)*7)","v":"-"},{"$f":"OFFSET(Balance!I204,0,($I$1-1)*7)","v":"-"}]
[null,"Residuos renovables",{"$f":"OFFSET(Balance!C205,0,($I$1-1)*7)","v":678.0715725},{"$f":"OFFSET(Balance!D205,0,($I$1-1)*7)","v":818.04970249999997},{"$f":"OFFSET(Balance!E205,0,($I$1-1)*7)","v":785.39502949999996},{"$f":"OFFSET(Balance!F205,0,($I$1-1)*7)","v":877.00608699999998},{"$f":"OFFSET(Balance!G205,0,($I$1-1)*7)","v":640.70376899999997},{"$f":"OFFSET(Balance!H205,0,($I$1-1)*7)","v":"-"},{"$f":"OFFSET(Balance!I205,0,($I$1-1)*7)","v":"-"}]
[null,"Régimen especial",{"$f":"OFFSET(Balance!C206,0,($I$1-1)*7)","v":0},{"$f":"OFFSET(Balance!D206,0,($I$1-1)*7)","v":0},{"$f":"OFFSET(Balance!E206,0,($I$1-1)*7)","v":0},{"$f":"OFFSET(Balance!F206,0,($I$1-1)*7)","v":0},{"$f":"OFFSET(Balance!G206,0,($I$1-1)*7)","v":0},{"$f":"OFFSET(Balance!H206,0,($I$1-1)*7)","v":0},{"$f":"OFFSET(Balance!I206,0,($I$1-1)*7)","v":0}]
[null,"Generación",{"$f":"OFFSET(Balance!C207,0,($I$1-1)*7)","v":266460.98335999995},{"$f":"OFFSET(Balance!D207,0,($I$1-1)*7)","v":267453.85013500002},{"$f":"OFFSET(Balance!E207,0,($I$1-1)*7)","v":261835.69148399998},{"$f":"OFFSET(Balance!F207,0,($I$1-1)*7)","v":262304.568692},{"$f":"OFFSET(Balance!G207,0,($I$1-1)*7)","v":194825.23970800004},{"$f":"OFFSET(Balance!H207,0,($I$1-1)*7)","v":"-"},{"$f":"OFFSET(Balance!I207,0,($I$1-1)*7)","v":"-"}]
[null,"Consumos en bombeo",{"$f":"OFFSET(Balance!C208,0,($I$1-1)*7)","v":-5385.7688595580003},{"$f":"OFFSET(Balance!D208,0,($I$1-1)*7)","v":-4512.2514306059993},{"$f":"OFFSET(Balance!E208,0,($I$1-1)*7)","v":-4827.5850676680011},{"$f":"OFFSET(Balance!F208,0,($I$1-1)*7)","v":-3607.5809876580001},{"$f":"OFFSET(Balance!G208,0,($I$1-1)*7)","v":-2443.2154947749996},{"$f":"OFFSET(Balance!H208,0,($I$1-1)*7)","v":"-"},{"$f":"OFFSET(Balance!I208,0,($I$1-1)*7)","v":"-"}]
[null,"Saldo intercambios internacionales (4)",{"$f":"OFFSET(Balance!C209,0,($I$1-1)*7)","v":-3406.1240240000002},{"$f":"OFFSET(Balance!D209,0,($I$1-1)*7)","v":-133.16316299999994},{"$f":"OFFSET(Balance!E209,0,($I$1-1)*7)","v":7658.0436910000008},{"$f":"OFFSET(Balance!F209,0,($I$1-1)*7)","v":9168.9935229999992},{"$f":"OFFSET(Balance!G209,0,($I$1-1)*7)","v":10300.914304},{"$f":"OFFSET(Balance!H209,0,($I$1-1)*7)","v":"-"},{"$f":"OFFSET(Balance!I209,0,($I$1-1)*7)","v":"-"}]
[null,"Demanda transporte (b.c.)",{"$f":"OFFSET(Balance!C210,0,($I$1-1)*7)","v":257669.09047644195},{"$f":"OFFSET(Balance!D210,0,($I$1-1)*7)","v":262808.43554139399},{"$f":"OFFSET(Balance!E210,0,($I$1-1)*7)","v":264666.15010733198},{"$f":"OFFSET(Balance!F210,0,($I$1-1)*7)","v":267865.98122734198},{"$f":"OFFSET(Balance!G210,0,($I$1-1)*7)","v":202682.93851722503},{"$f":"OFFSET(Balance!H210,0,($I$1-1)*7)","v":"-"},{"$f":"OFFSET(Balance!I210,0,($I$1-1)*7)","v":"-"}]
[null,"(1) Asignación de unidades de producción según combustible principal."]
[null,"(2) Incluye funcionamiento en ciclo abierto."]
[]
[null,"(3) Incluye todas aquellas unidades menores de 50 MW que no pertenecen a ninguna unidad de gestión hidráulica (UGH) hasta 2010."]
[null,"(4) Valor positivo: saldo importador; valor negativo: saldo exportador."]
[null,"(5) Hasta 2010 e incluye residuos."]
[]
[null,{"$f":"IF(MONTH(FACT)=1,\"\",CONCATENATE(\"Para el año \",YEAR(FACT), \" valores acumulados hasta \",TEXT(FACT-30,\"mmmm\"),\" de \",YEAR(FACT),\".\"))","v":"Para el año 2018 valores acumulados hasta septiembre de 2018."}]
[null,{"$f":"'Balance nacional mensual'!B38","v":"Datos definitivos hasta el 31/03/2017. Datos provisionales del 01/04/2017 al 31/08/2018. Datos programados del 01/09/2018 al 30/09/2018."}]

{"sheet":"Balance Peninsular mensual","index":3,"n_rows":39,"n_cols":15,"rows_kept":39,"cut":false,"hidden":false,"merged":[[38,1,38,11],[37,1,37,11],[36,1,36,14],[33,1,33,14],[5,2,5,9],[31,1,31,14],[32,1,32,14],[35,1,35,12],[34,1,34,11]]}
[null,null,null,null,null,null,null,null,null,null,null,null,null,null,29]
[]
[]
[null,null,null,null,null,null,null,null,null,null,null,null,"Sistema eléctrico"]
[null,null,null,null,null,null,null,null,null,null,null,null,"Horizonte temporal"]
[null,null,null,null,null,null,null,null,null,null,null,null,"Periodo"]
[]
[null,null,"Ene.","Feb.","Mar.","Abr.","May.","Jun.","Jul.","Ago.","Sep.","Oct.","Nov.","Dic.",{"$f":"OFFSET(Año!C2,($O$1-1),0)","v":2018}]
[]
[null,"Hidráulica",{"$f":"OFFSET(Balance!C3,0,($O$1-1)*12)","v":2193.9237987859997},{"$f":"OFFSET(Balance!D3,0,($O$1-1)*12)","v":2388.6122803500002},{"$f":"OFFSET(Balance!E3,0,($O$1-1)*12)","v":4399.0090775560002},{"$f":"OFFSET(Balance!F3,0,($O$1-1)*12)","v":4716.4282802460002},{"$f":"OFFSET(Balance!G3,0,($O$1-1)*12)","v":3520.7950463240004},{"$f":"OFFSET(Balance!H3,0,($O$1-1)*12)","v":3710.881286584},{"$f":"OFFSET(Balance!I3,0,($O$1-1)*12)","v":3024.3379099859999},{"$f":"OFFSET(Balance!J3,0,($O$1-1)*12)","v":2103.9091784919997},{"$f":"OFFSET(Balance!K3,0,($O$1-1)*12)","v":1923.630571762},{"$f":"OFFSET(Balance!L3,0,($O$1-1)*12)","v":"-"},{"$f":"OFFSET(Balance!M3,0,($O$1-1)*12)","v":"-"},{"$f":"OFFSET(Balance!N3,0,($O$1-1)*12)","v":"-"},{"$f":"IF(SUM(C10:N10)=0,\"-\",SUM(C10:N10))","v":27981.527430086}]
[null,"Turbinación bombeo",{"$f":"OFFSET(Balance!C4,0,($O$1-1)*12)","v":273.43523521399999},{"$f":"OFFSET(Balance!D4,0,($O$1-1)*12)","v":180.62302364999999},{"$f":"OFFSET(Balance!E4,0,($O$1-1)*12)","v":369.77771444399997},{"$f":"OFFSET(Balance!F4,0,($O$1-1)*12)","v":345.63732475400002},{"$f":"OFFSET(Balance!G4,0,($O$1-1)*12)","v":153.27436067600001},{"$f":"OFFSET(Balance!H4,0,($O$1-1)*12)","v":58.722846416000003},{"$f":"OFFSET(Balance!I4,0,($O$1-1)*12)","v":35.306144013999997},{"$f":"OFFSET(Balance!J4,0,($O$1-1)*12)","v":60.031041508000001},{"$f":"OFFSET(Balance!K4,0,($O$1-1)*12)","v":40.026753237999998},{"$f":"OFFSET(Balance!L4,0,($O$1-1)*12)","v":"-"},{"$f":"OFFSET(Balance!M4,0,($O$1-1)*12)","v":"-"},{"$f":"OFFSET(Balance!N4,0,($O$1-1)*12)","v":"-"},{"$f":"IF(SUM(C11:N11)=0,\"-\",SUM(C11:N11))","v":1516.8344439140001}]
[null,"Nuclear",{"$f":"OFFSET(Balance!C5,0,($O$1-1)*12)","v":5096.5286330000008},{"$f":"OFFSET(Balance!D5,0,($O$1-1)*12)","v":4592.3205680000001},{"$f":"OFFSET(Balance!E5,0,($O$1-1)*12)","v":4488.9170219999996},{"$f":"OFFSET(Balance!F5,0,($O$1-1)*12)","v":3812.588835},{"$f":"OFFSET(Balance!G5,0,($O$1-1)*12)","v":3728.673667},{"$f":"OFFSET(Balance!H5,0,($O$1-1)*12)","v":3591.5913509999996},{"$f":"OFFSET(Balance!I5,0,($O$1-1)*12)","v":4471.0236880000002},{"$f":"OFFSET(Balance!J5,0,($O$1-1)*12)","v":5135.7246780000005},{"$f":"OFFSET(Balance!K5,0,($O$1-1)*12)","v":5013.0349210000004},{"$f":"OFFSET(Balance!L5,0,($O$1-1)*12)","v":"-"},{"$f":"OFFSET(Balance!M5,0,($O$1-1)*12)","v":"-"},{"$f":"OFFSET(Balance!N5,0,($O$1-1)*12)","v":"-"},{"$f":"IF(SUM(C12:N12)=0,\"-\",SUM(C12:N12))","v":39930.403362999998}]
[null,"Carbón",{"$f":"OFFSET(Balance!C6,0,($O$1-1)*12)","v":3020.0704610000003},{"$f":"OFFSET(Balance!D6,0,($O$1-1)*12)","v":3488.6857170000003},{"$f":"OFFSET(Balance!E6,0,($O$1-1)*12)","v":1310.6821359999999},{"$f":"OFFSET(Balance!F6,0,($O$1-1)*12)","v":1360.590295},{"$f":"OFFSET(Balance!G6,0,($O$1-1)*12)","v":2254.3341909999999},{"$f":"OFFSET(Balance!H6,0,($O$1-1)*12)","v":2273.6508990000002},{"$f":"OFFSET(Balance!I6,0,($O$1-1)*12)","v":3488.1731800000002},{"$f":"OFFSET(Balance!J6,0,($O$1-1)*12)","v":3496.6442969999998},{"$f":"OFFSET(Balance!K6,0,($O$1-1)*12)","v":4125.149649},{"$f":"OFFSET(Balance!L6,0,($O$1-1)*12)","v":"-"},{"$f":"OFFSET(Balance!M6,0,($O$1-1)*12)","v":"-"},{"$f":"OFFSET(Balance!N6,0,($O$1-1)*12)","v":"-"},24817.980824999999]
[null,"Fuel + Gas",{"$f":"OFFSET(Balance!C7,0,($O$1-1)*12)","v":0},{"$f":"OFFSET(Balance!D7,0,($O$1-1)*12)","v":0},{"$f":"OFFSET(Balance!E7,0,($O$1-1)*12)","v":0},{"$f":"OFFSET(Balance!F7,0,($O$1-1)*12)","v":0},{"$f":"OFFSET(Balance!G7,0,($O$1-1)*12)","v":-9.9999999999999995E-7},{"$f":"OFFSET(Balance!H7,0,($O$1-1)*12)","v":0},{"$f":"OFFSET(Balance!I7,0,($O$1-1)*12)","v":9.9999999999999995E-7},{"$f":"OFFSET(Balance!J7,0,($O$1-1)*12)","v":-9.9999999999999995E-7},{"$f":"OFFSET(Balance!K7,0,($O$1-1)*12)","v":0},{"$f":"OFFSET(Balance!L7,0,($O$1-1)*12)","v":"-"},{"$f":"OFFSET(Balance!M7,0,($O$1-1)*12)","v":"-"},{"$f":"OFFSET(Balance!N7,0,($O$1-1)*12)","v":"-"},-9.9999999999999995E-7]
[null,"Ciclo combinado (2)",{"$f":"OFFSET(Balance!C8,0,($O$1-1)*12)","v":2254.6323689999999},{"$f":"OFFSET(Balance!D8,0,($O$1-1)*12)","v":1950.724201},{"$f":"OFFSET(Balance!E8,0,($O$1-1)*12)","v":1248.0405949999999},{"$f":"OFFSET(Balance!F8,0,($O$1-1)*12)","v":1200.6612050000001},{"$f":"OFFSET(Balance!G8,0,($O$1-1)*12)","v":1968.4294669999999},{"$f":"OFFSET(Balance!H8,0,($O$1-1)*12)","v":2180.1267059999996},{"$f":"OFFSET(Balance!I8,0,($O$1-1)*12)","v":2229.279387},{"$f":"OFFSET(Balance!J8,0,($O$1-1)*12)","v":2663.0555370000002},{"$f":"OFFSET(Balance!K8,0,($O$1-1)*12)","v":2148.659568},{"$f":"OFFSET(Balance!L8,0,($O$1-1)*12)","v":"-"},{"$f":"OFFSET(Balance!M8,0,($O$1-1)*12)","v":"-"},{"$f":"OFFSET(Balance!N8,0,($O$1-1)*12)","v":"-"},17843.609035000001]
[null,"Régimen ordinario",{"$f":"OFFSET(Balance!C9,0,($O$1-1)*12)","v":"-"},{"$f":"OFFSET(Balance!D9,0,($O$1-1)*12)","v":"-"},{"$f":"OFFSET(Balance!E9,0,($O$1-1)*12)","v":"-"},{"$f":"OFFSET(Balance!F9,0,($O$1-1)*12)","v":"-"},{"$f":"OFFSET(Balance!G9,0,($O$1-1)*12)","v":"-"},{"$f":"OFFSET(Balance!H9,0,($O$1-1)*12)","v":"-"},{"$f":"OFFSET(Balance!I9,0,($O$1-1)*12)","v":"-"},{"$f":"OFFSET(Balance!J9,0,($O$1-1)*12)","v":"-"},{"$f":"OFFSET(Balance!K9,0,($O$1-1)*12)","v":"-"},{"$f":"OFFSET(Balance!L9,0,($O$1-1)*12)","v":"-"},{"$f":"OFFSET(Balance!M9,0,($O$1-1)*12)","v":"-"},{"$f":"OFFSET(Balance!N9,0,($O$1-1)*12)","v":"-"},{"$f":"SUM(O10:O15)","v":112090.355096}]
[]
[null,"Resto hidráulica (3)",{"$f":"OFFSET(Balance!C10,0,($O$1-1)*12)","v":"-"},{"$f":"OFFSET(Balance!D10,0,($O$1-1)*12)","v":"-"},{"$f":"OFFSET(Balance!E10,0,($O$1-1)*12)","v":"-"},{"$f":"OFFSET(Balance!F10,0,($O$1-1)*12)","v":"-"},{"$f":"OFFSET(Balance!G10,0,($O$1-1)*12)","v":"-"},{"$f":"OFFSET(Balance!H10,0,($O$1-1)*12)","v":"-"},{"$f":"OFFSET(Balance!I10,0,($O$1-1)*12)","v":"-"},{"$f":"OFFSET(Balance!J10,0,($O$1-1)*12)","v":"-"},{"$f":"OFFSET(Balance!K10,0,($O$1-1)*12)","v":"-"},{"$f":"OFFSET(Balance!L10,0,($O$1-1)*12)","v":"-"},{"$f":"OFFSET(Balance!M10,0,($O$1-1)*12)","v":"-"},{"$f":"OFFSET(Balance!N10,0,($O$1-1)*12)","v":"-"},"-"]
[null,"Eólica",{"$f":"OFFSET(Balance!C11,0,($O$1-1)*12)","v":5286.0049170000002},{"$f":"OFFSET(Balance!D11,0,($O$1-1)*12)","v":4633.5825560000003},{"$f":"OFFSET(Balance!E11,0,($O$1-1)*12)","v":7650.1390379999993},{"$f":"OFFSET(Balance!F11,0,($O$1-1)*12)","v":4409.5657819999997},{"$f":"OFFSET(Balance!G11,0,($O$1-1)*12)","v":3253.8841389999998},{"$f":"OFFSET(Balance!H11,0,($O$1-1)*12)","v":2571.6879290000002},{"$f":"OFFSET(Balance!I11,0,($O$1-1)*12)","v":2478.2899400000001},{"$f":"OFFSET(Balance!J11,0,($O$1-1)*12)","v":3063.7690170000001},{"$f":"OFFSET(Balance!K11,0,($O$1-1)*12)","v":2403.2007760000001},{"$f":"OFFSET(Balance!L11,0,($O$1-1)*12)","v":"-"},{"$f":"OFFSET(Balance!M11,0,($O$1-1)*12)","v":"-"},{"$f":"OFFSET(Balance!N11,0,($O$1-1)*12)","v":"-"},35750.124093999999]
[null,"Solar fotovoltaica",{"$f":"OFFSET(Balance!C12,0,($O$1-1)*12)","v":418.21396899999996},{"$f":"OFFSET(Balance!D12,0,($O$1-1)*12)","v":487.03556300000002},{"$f":"OFFSET(Balance!E12,0,($O$1-1)*12)","v":555.35785499999997},{"$f":"OFFSET(Balance!F12,0,($O$1-1)*12)","v":664.1976360000001},{"$f":"OFFSET(Balance!G12,0,($O$1-1)*12)","v":777.59795799999995},{"$f":"OFFSET(Balance!H12,0,($O$1-1)*12)","v":779.94395099999997},{"$f":"OFFSET(Balance!I12,0,($O$1-1)*12)","v":886.33224600000005},{"$f":"OFFSET(Balance!J12,0,($O$1-1)*12)","v":802.00636800000007},{"$f":"OFFSET(Balance!K12,0,($O$1-1)*12)","v":633.08384599999999},{"$f":"OFFSET(Balance!L12,0,($O$1-1)*12)","v":"-"},{"$f":"OFFSET(Balance!M12,0,($O$1-1)*12)","v":"-"},{"$f":"OFFSET(Balance!N12,0,($O$1-1)*12)","v":"-"},6003.7693920000002]
[null,"Solar térmica",{"$f":"OFFSET(Balance!C13,0,($O$1-1)*12)","v":112.387517},{"$f":"OFFSET(Balance!D13,0,($O$1-1)*12)","v":229.80815100000001},{"$f":"OFFSET(Balance!E13,0,($O$1-1)*12)","v":233.95594299999999},{"$f":"OFFSET(Balance!F13,0,($O$1-1)*12)","v":325.935092},{"$f":"OFFSET(Balance!G13,0,($O$1-1)*12)","v":477.20963399999999},{"$f":"OFFSET(Balance!H13,0,($O$1-1)*12)","v":551.29260299999999},{"$f":"OFFSET(Balance!I13,0,($O$1-1)*12)","v":858.89464800000007},{"$f":"OFFSET(Balance!J13,0,($O$1-1)*12)","v":688.557997},{"$f":"OFFSET(Balance!K13,0,($O$1-1)*12)","v":465.63993599999998},{"$f":"OFFSET(Balance!L13,0,($O$1-1)*12)","v":"-"},{"$f":"OFFSET(Balance!M13,0,($O$1-1)*12)","v":"-"},{"$f":"OFFSET(Balance!N13,0,($O$1-1)*12)","v":"-"},3943.681521]
[null,"Otras renovables (4)",{"$f":"OFFSET(Balance!C14,0,($O$1-1)*12)","v":295.34965500000004},{"$f":"OFFSET(Balance!D14,0,($O$1-1)*12)","v":300.78865500000001},{"$f":"OFFSET(Balance!E14,0,($O$1-1)*12)","v":269.07042999999999},{"$f":"OFFSET(Balance!F14,0,($O$1-1)*12)","v":237.13678899999999},{"$f":"OFFSET(Balance!G14,0,($O$1-1)*12)","v":290.86799699999995},{"$f":"OFFSET(Balance!H14,0,($O$1-1)*12)","v":303.747793},{"$f":"OFFSET(Balance!I14,0,($O$1-1)*12)","v":323.38886200000002},{"$f":"OFFSET(Balance!J14,0,($O$1-1)*12)","v":316.40050000000002},{"$f":"OFFSET(Balance!K14,0,($O$1-1)*12)","v":319.22702399999997},{"$f":"OFFSET(Balance!L14,0,($O$1-1)*12)","v":"-"},{"$f":"OFFSET(Balance!M14,0,($O$1-1)*12)","v":"-"},{"$f":"OFFSET(Balance!N14,0,($O$1-1)*12)","v":"-"},2655.9777049999998]
[null,"Cogeneración",{"$f":"OFFSET(Balance!C15,0,($O$1-1)*12)","v":2480.4490580000002},{"$f":"OFFSET(Balance!D15,0,($O$1-1)*12)","v":2251.080739},{"$f":"OFFSET(Balance!E15,0,($O$1-1)*12)","v":2335.5272960000002},{"$f":"OFFSET(Balance!F15,0,($O$1-1)*12)","v":2353.5895970000001},{"$f":"OFFSET(Balance!G15,0,($O$1-1)*12)","v":2418.3062},{"$f":"OFFSET(Balance!H15,0,($O$1-1)*12)","v":2403.6461379999996},{"$f":"OFFSET(Balance!I15,0,($O$1-1)*12)","v":2432.0428059999999},{"$f":"OFFSET(Balance!J15,0,($O$1-1)*12)","v":2358.3318760000002},{"$f":"OFFSET(Balance!K15,0,($O$1-1)*12)","v":2391.9619229999998},{"$f":"OFFSET(Balance!L15,0,($O$1-1)*12)","v":"-"},{"$f":"OFFSET(Balance!M15,0,($O$1-1)*12)","v":"-"},{"$f":"OFFSET(Balance!N15,0,($O$1-1)*12)","v":"-"},21424.935633000001]
[null,"Residuos no renovables",{"$f":"OFFSET(Balance!C16,0,($O$1-1)*12)","v":226.5715625},{"$f":"OFFSET(Balance!D16,0,($O$1-1)*12)","v":204.21008799999998},{"$f":"OFFSET(Balance!E16,0,($O$1-1)*12)","v":215.3954785},{"$f":"OFFSET(Balance!F16,0,($O$1-1)*12)","v":169.464494},{"$f":"OFFSET(Balance!G16,0,($O$1-1)*12)","v":137.027331},{"$f":"OFFSET(Balance!H16,0,($O$1-1)*12)","v":175.41569099999998},{"$f":"OFFSET(Balance!I16,0,($O$1-1)*12)","v":199.57543200000001},{"$f":"OFFSET(Balance!J16,0,($O$1-1)*12)","v":194.65527350000002},{"$f":"OFFSET(Balance!K16,0,($O$1-1)*12)","v":189.018788},{"$f":"OFFSET(Balance!L16,0,($O$1-1)*12)","v":"-"},{"$f":"OFFSET(Balance!M16,0,($O$1-1)*12)","v":"-"},{"$f":"OFFSET(Balance!N16,0,($O$1-1)*12)","v":"-"},1711.3341385000001]
[null,"Residuos renovables",{"$f":"OFFSET(Balance!C17,0,($O$1-1)*12)","v":69.2635705},{"$f":"OFFSET(Balance!D17,0,($O$1-1)*12)","v":62.195681999999998},{"$f":"OFFSET(Balance!E17,0,($O$1-1)*12)","v":65.909200500000011},{"$f":"OFFSET(Balance!F17,0,($O$1-1)*12)","v":66.929152000000002},{"$f":"OFFSET(Balance!G17,0,($O$1-1)*12)","v":24.344857999999999},{"$f":"OFFSET(Balance!H17,0,($O$1-1)*12)","v":50.806421},{"$f":"OFFSET(Balance!I17,0,($O$1-1)*12)","v":64.813796999999994},{"$f":"OFFSET(Balance!J17,0,($O$1-1)*12)","v":65.755174499999995},{"$f":"OFFSET(Balance!K17,0,($O$1-1)*12)","v":64.738028},{"$f":"OFFSET(Balance!L17,0,($O$1-1)*12)","v":"-"},{"$f":"OFFSET(Balance!M17,0,($O$1-1)*12)","v":"-"},{"$f":"OFFSET(Balance!N17,0,($O$1-1)*12)","v":"-"},{"$f":"IF(SUM(C25:N25)=0,\"-\",SUM(C25:N25))","v":534.75588349999998}]
[null,"Régimen especial",{"$f":"OFFSET(Balance!C18,0,($O$1-1)*12)","v":"-"},{"$f":"OFFSET(Balance!D18,0,($O$1-1)*12)","v":"-"},{"$f":"OFFSET(Balance!E18,0,($O$1-1)*12)","v":"-"},{"$f":"OFFSET(Balance!F18,0,($O$1-1)*12)","v":"-"},{"$f":"OFFSET(Balance!G18,0,($O$1-1)*12)","v":"-"},{"$f":"OFFSET(Balance!H18,0,($O$1-1)*12)","v":"-"},{"$f":"OFFSET(Balance!I18,0,($O$1-1)*12)","v":"-"},{"$f":"OFFSET(Balance!J18,0,($O$1-1)*12)","v":"-"},{"$f":"OFFSET(Balance!K18,0,($O$1-1)*12)","v":"-"},{"$f":"OFFSET(Balance!L18,0,($O$1-1)*12)","v":"-"},{"$f":"OFFSET(Balance!M18,0,($O$1-1)*12)","v":"-"},{"$f":"OFFSET(Balance!N18,0,($O$1-1)*12)","v":"-"},{"$f":"SUM(O18:O23)","v":69778.488344999991}]
[null,"Generación",{"$f":"OFFSET(Balance!C19,0,($O$1-1)*12)","v":21726.830746},{"$f":"OFFSET(Balance!D19,0,($O$1-1)*12)","v":20769.667224000001},{"$f":"OFFSET(Balance!E19,0,($O$1-1)*12)","v":23141.781786},{"$f":"OFFSET(Balance!F19,0,($O$1-1)*12)","v":19662.724482000001},{"$f":"OFFSET(Balance!G19,0,($O$1-1)*12)","v":19004.744848000002},{"$f":"OFFSET(Balance!H19,0,($O$1-1)*12)","v":18651.513615},{"$f":"OFFSET(Balance!I19,0,($O$1-1)*12)","v":20491.458041000002},{"$f":"OFFSET(Balance!J19,0,($O$1-1)*12)","v":20948.840936999997},{"$f":"OFFSET(Balance!K19,0,($O$1-1)*12)","v":19717.371784000003},{"$f":"OFFSET(Balance!L19,0,($O$1-1)*12)","v":"-"},{"$f":"OFFSET(Balance!M19,0,($O$1-1)*12)","v":"-"},{"$f":"OFFSET(Balance!N19,0,($O$1-1)*12)","v":"-"},{"$f":"IF(SUM(C27:N27)=0,\"-\",SUM(C27:N27))","v":184114.93346299999}]
[null,"Consumos en bombeo",{"$f":"OFFSET(Balance!C20,0,($O$1-1)*12)","v":-391.47835200000003},{"$f":"OFFSET(Balance!D20,0,($O$1-1)*12)","v":-253.86108900000002},{"$f":"OFFSET(Balance!E20,0,($O$1-1)*12)","v":-733.49642400000005},{"$f":"OFFSET(Balance!F20,0,($O$1-1)*12)","v":-560.06841218400007},{"$f":"OFFSET(Balance!G20,0,($O$1-1)*12)","v":-213.24354462900001},{"$f":"OFFSET(Balance!H20,0,($O$1-1)*12)","v":-83.652090872000002},{"$f":"OFFSET(Balance!I20,0,($O$1-1)*12)","v":-57.940257936000002},{"$f":"OFFSET(Balance!J20,0,($O$1-1)*12)","v":-68.902296153999998},{"$f":"OFFSET(Balance!K20,0,($O$1-1)*12)","v":-80.573028000000008},{"$f":"OFFSET(Balance!L20,0,($O$1-1)*12)","v":"-"},{"$f":"OFFSET(Balance!M20,0,($O$1-1)*12)","v":"-"},{"$f":"OFFSET(Balance!N20,0,($O$1-1)*12)","v":"-"},-2443.2154947749996]
[null,"Enlace Península-Baleares (6)",{"$f":"OFFSET(Balance!C21,0,($O$1-1)*12)","v":-86.203828999999999},{"$f":"OFFSET(Balance!D21,0,($O$1-1)*12)","v":-99.993399000000011},{"$f":"OFFSET(Balance!E21,0,($O$1-1)*12)","v":-89.996875000000003},{"$f":"OFFSET(Balance!F21,0,($O$1-1)*12)","v":-66.467520000000007},{"$f":"OFFSET(Balance!G21,0,($O$1-1)*12)","v":-89.565090999999995},{"$f":"OFFSET(Balance!H21,0,($O$1-1)*12)","v":-108.62363499999999},{"$f":"OFFSET(Balance!I21,0,($O$1-1)*12)","v":-161.79160300000001},{"$f":"OFFSET(Balance!J21,0,($O$1-1)*12)","v":-153.133589},{"$f":"OFFSET(Balance!K21,0,($O$1-1)*12)","v":-107.931268},{"$f":"OFFSET(Balance!L21,0,($O$1-1)*12)","v":"-"},{"$f":"OFFSET(Balance!M21,0,($O$1-1)*12)","v":"-"},{"$f":"OFFSET(Balance!N21,0,($O$1-1)*12)","v":"-"},{"$f":"IF(SUM(C29:N29)=0,\"-\",SUM(C29:N29))","v":-963.70680900000002}]
[null,"Saldo intercambios internacionales (7)",{"$f":"OFFSET(Balance!C22,0,($O$1-1)*12)","v":1340.2982630000001},{"$f":"OFFSET(Balance!D22,0,($O$1-1)*12)","v":857.10299299999997},{"$f":"OFFSET(Balance!E22,0,($O$1-1)*12)","v":-273.62203199999999},{"$f":"OFFSET(Balance!F22,0,($O$1-1)*12)","v":882.59852599999999},{"$f":"OFFSET(Balance!G22,0,($O$1-1)*12)","v":1368.3609369999999},{"$f":"OFFSET(Balance!H22,0,($O$1-1)*12)","v":1863.9643000000001},{"$f":"OFFSET(Balance!I22,0,($O$1-1)*12)","v":1893.727091},{"$f":"OFFSET(Balance!J22,0,($O$1-1)*12)","v":1244.0220749999999},{"$f":"OFFSET(Balance!K22,0,($O$1-1)*12)","v":1124.4621510000002},{"$f":"OFFSET(Balance!L22,0,($O$1-1)*12)","v":"-"},{"$f":"OFFSET(Balance!M22,0,($O$1-1)*12)","v":"-"},{"$f":"OFFSET(Balance!N22,0,($O$1-1)*12)","v":"-"},10300.914304]
[null,"Demanda transporte (b.c.)",{"$f":"OFFSET(Balance!C23,0,($O$1-1)*12)","v":22589.446828},{"$f":"OFFSET(Balance!D23,0,($O$1-1)*12)","v":21272.915728999997},{"$f":"OFFSET(Balance!E23,0,($O$1-1)*12)","v":22044.666454999999},{"$f":"OFFSET(Balance!F23,0,($O$1-1)*12)","v":19918.787075816002},{"$f":"OFFSET(Balance!G23,0,($O$1-1)*12)","v":20070.297149370999},{"$f":"OFFSET(Balance!H23,0,($O$1-1)*12)","v":20323.202189128002},{"$f":"OFFSET(Balance!I23,0,($O$1-1)*12)","v":22165.453271063998},{"$f":"OFFSET(Balance!J23,0,($O$1-1)*12)","v":21970.827126846001},{"$f":"OFFSET(Balance!K23,0,($O$1-1)*12)","v":20653.329639},{"$f":"OFFSET(Balance!L23,0,($O$1-1)*12)","v":"-"},{"$f":"OFFSET(Balance!M23,0,($O$1-1)*12)","v":"-"},{"$f":"OFFSET(Balance!N23,0,($O$1-1)*12)","v":"-"},{"$f":"IF(SUM(C31:N31)=0,\"-\",SUM(C31:N31))","v":191008.92546322502}]
[null,"(1) Asignación de unidades de producción según combustible principal."]
[null,"(2) Incluye funcionamiento en ciclo abierto."]
[null,"(3) Incluye todas aquellas unidades menores de 50 MW que no pertenecen a ninguna unidad de gestión hidráulica (UGH)."]
[null,"(4) Otras renovables incluyen biogás, biomasa, hidráulica marina y geotérmica. Los valores incluyen residuos hasta el 31/12/2014."]
[null,"(5) Hasta 2010 incluye residuos."]
[null,"(6) Valor positivo: entrada de energía en el sistema; valor negativo: salida de energía del sistema. Enlace funcionando al mínimo técnico de seguridad hasta el 13/08/2012. "]
[null,"(7) Valor positivo: saldo importador; valor negativo: saldo exportador."]
[null,{"$f":"'Balance nacional mensual'!B38","v":"Datos definitivos hasta el 31/03/2017. Datos provisionales del 01/04/2017 al 31/08/2018. Datos programados del 01/09/2018 al 30/09/2018."}]

{"sheet":"Balance Peninsular anual","index":4,"n_rows":40,"n_cols":12,"rows_kept":40,"cut":false,"hidden":false,"merged":[[37,1,37,9],[35,1,35,9],[31,1,31,9],[32,1,32,9],[33,1,33,9],[34,1,34,9],[36,1,36,9]]}
[null,null,null,null,null,null,null,null,null,4,null,1]
[]
[]
[null,null,null,null,null,null,null,"  Sistema eléctrico"]
[null,null,null,null,null,null,null,"  Horizonte temporal"]
[null,null,null,null,null,null,null,"  Periodo"]
[]
[null,null,{"$f":"OFFSET(Balance!C107,0,($J$1-1)*8)","v":2014},{"$f":"OFFSET(Balance!D107,0,($J$1-1)*8)","v":2015},{"$f":"OFFSET(Balance!E107,0,($J$1-1)*8)","v":2016},{"$f":"OFFSET(Balance!F107,0,($J$1-1)*8)","v":2017},{"$f":"OFFSET(Balance!G107,0,($J$1-1)*8)","v":2018},{"$f":"OFFSET(Balance!H107,0,($J$1-1)*8)","v":2019},{"$f":"OFFSET(Balance!I107,0,($J$1-1)*8)","v":2020},{"$f":"OFFSET(Balance!J107,0,($J$1-1)*8)","v":2021}]
[]
[null,"Hidráulica",{"$f":"OFFSET(Balance!C108,0,($J$1-1)*8)","v":39178.524159204004},{"$f":"OFFSET(Balance!D108,0,($J$1-1)*8)","v":28379.011570850002},{"$f":"OFFSET(Balance!E108,0,($J$1-1)*8)","v":36111.434365772002},{"$f":"OFFSET(Balance!F108,0,($J$1-1)*8)","v":18445.894516660002},{"$f":"OFFSET(Balance!G108,0,($J$1-1)*8)","v":27981.527430086},{"$f":"OFFSET(Balance!H108,0,($J$1-1)*8)","v":"-"},{"$f":"OFFSET(Balance!I108,0,($J$1-1)*8)","v":"-"},{"$f":"OFFSET(Balance!J108,0,($J$1-1)*8)","v":"-"}]
[null,"Turbinación bombeo",{"$f":"OFFSET(Balance!C109,0,($J$1-1)*8)","v":3415.9960267959996},{"$f":"OFFSET(Balance!D109,0,($J$1-1)*8)","v":2895.3657881499998},{"$f":"OFFSET(Balance!E109,0,($J$1-1)*8)","v":3134.3289102280005},{"$f":"OFFSET(Balance!F109,0,($J$1-1)*8)","v":2248.9644183400001},{"$f":"OFFSET(Balance!G109,0,($J$1-1)*8)","v":1516.8344439140001},{"$f":"OFFSET(Balance!H109,0,($J$1-1)*8)","v":"-"},{"$f":"OFFSET(Balance!I109,0,($J$1-1)*8)","v":"-"},{"$f":"OFFSET(Balance!J109,0,($J$1-1)*8)","v":"-"}]
[null,"Nuclear",{"$f":"OFFSET(Balance!C110,0,($J$1-1)*8)","v":54781.281335},{"$f":"OFFSET(Balance!D110,0,($J$1-1)*8)","v":54661.803305000009},{"$f":"OFFSET(Balance!E110,0,($J$1-1)*8)","v":56021.682058999999},{"$f":"OFFSET(Balance!F110,0,($J$1-1)*8)","v":55539.561502000004},{"$f":"OFFSET(Balance!G110,0,($J$1-1)*8)","v":39930.403362999998},{"$f":"OFFSET(Balance!H110,0,($J$1-1)*8)","v":"-"},{"$f":"OFFSET(Balance!I110,0,($J$1-1)*8)","v":"-"},{"$f":"OFFSET(Balance!J110,0,($J$1-1)*8)","v":"-"}]
[null,"Carbón",{"$f":"OFFSET(Balance!C111,0,($J$1-1)*8)","v":41058.278770999998},{"$f":"OFFSET(Balance!D111,0,($J$1-1)*8)","v":50754.794511},{"$f":"OFFSET(Balance!E111,0,($J$1-1)*8)","v":35010.909780000002},{"$f":"OFFSET(Balance!F111,0,($J$1-1)*8)","v":42422.113335000002},{"$f":"OFFSET(Balance!G111,0,($J$1-1)*8)","v":24817.980824999999},{"$f":"OFFSET(Balance!H111,0,($J$1-1)*8)","v":"-"},{"$f":"OFFSET(Balance!I111,0,($J$1-1)*8)","v":"-"},{"$f":"OFFSET(Balance!J111,0,($J$1-1)*8)","v":"-"}]
[null,"Fuel + Gas",{"$f":"OFFSET(Balance!C112,0,($J$1-1)*8)","v":-0.81973099999999999},{"$f":"OFFSET(Balance!D112,0,($J$1-1)*8)","v":1.6618000000000001E-2},{"$f":"OFFSET(Balance!E112,0,($J$1-1)*8)","v":2.3499999999999999E-4},{"$f":"OFFSET(Balance!F112,0,($J$1-1)*8)","v":-9.9999999999999995E-7},{"$f":"OFFSET(Balance!G112,0,($J$1-1)*8)","v":-9.9999999999999995E-7},{"$f":"OFFSET(Balance!H112,0,($J$1-1)*8)","v":"-"},{"$f":"OFFSET(Balance!I112,0,($J$1-1)*8)","v":"-"},{"$f":"OFFSET(Balance!J112,0,($J$1-1)*8)","v":"-"}]
[null,"Ciclo combinado (2)",{"$f":"OFFSET(Balance!C113,0,($J$1-1)*8)","v":21120.508624999999},{"$f":"OFFSET(Balance!D113,0,($J$1-1)*8)","v":25034.545559999999},{"$f":"OFFSET(Balance!E113,0,($J$1-1)*8)","v":25463.066257999999},{"$f":"OFFSET(Balance!F113,0,($J$1-1)*8)","v":33647.985853999999},{"$f":"OFFSET(Balance!G113,0,($J$1-1)*8)","v":17843.609035000001},{"$f":"OFFSET(Balance!H113,0,($J$1-1)*8)","v":"-"},{"$f":"OFFSET(Balance!I113,0,($J$1-1)*8)","v":"-"},{"$f":"OFFSET(Balance!J113,0,($J$1-1)*8)","v":"-"}]
[null,"Régimen ordinario",{"$f":"OFFSET(Balance!C114,0,($J$1-1)*8)","v":" "},{"$f":"OFFSET(Balance!D114,0,($J$1-1)*8)","v":" "},{"$f":"OFFSET(Balance!E114,0,($J$1-1)*8)","v":" "},{"$f":"OFFSET(Balance!F114,0,($J$1-1)*8)","v":" "},{"$f":"OFFSET(Balance!G114,0,($J$1-1)*8)","v":" "},{"$f":"OFFSET(Balance!H114,0,($J$1-1)*8)","v":" "},{"$f":"OFFSET(Balance!I114,0,($J$1-1)*8)","v":" "},{"$f":"OFFSET(Balance!J114,0,($J$1-1)*8)","v":" "}]
[]
[null,"Resto hidráulica (3)",{"$f":"OFFSET(Balance!C115,0,($J$1-1)*8)","v":" "},{"$f":"OFFSET(Balance!D115,0,($J$1-1)*8)","v":" "},{"$f":"OFFSET(Balance!E115,0,($J$1-1)*8)","v":" "},{"$f":"OFFSET(Balance!F115,0,($J$1-1)*8)","v":" "},{"$f":"OFFSET(Balance!G115,0,($J$1-1)*8)","v":" "},{"$f":"OFFSET(Balance!H115,0,($J$1-1)*8)","v":" "},{"$f":"OFFSET(Balance!I115,0,($J$1-1)*8)","v":" "},{"$f":"OFFSET(Balance!J115,0,($J$1-1)*8)","v":" "}]
[null,"Eólica",{"$f":"OFFSET(Balance!C116,0,($J$1-1)*8)","v":50636.662464000008},{"$f":"OFFSET(Balance!D116,0,($J$1-1)*8)","v":47715.882144999996},{"$f":"OFFSET(Balance!E116,0,($J$1-1)*8)","v":47298.163668000001},{"$f":"OFFSET(Balance!F116,0,($J$1-1)*8)","v":47508.431816000004},{"$f":"OFFSET(Balance!G116,0,($J$1-1)*8)","v":35750.124093999999},{"$f":"OFFSET(Balance!H116,0,($J$1-1)*8)","v":"-"},{"$f":"OFFSET(Balance!I116,0,($J$1-1)*8)","v":"-"},{"$f":"OFFSET(Balance!J116,0,($J$1-1)*8)","v":"-"}]
[null,"Solar fotovoltaica",{"$f":"OFFSET(Balance!C117,0,($J$1-1)*8)","v":7802.7909199999995},{"$f":"OFFSET(Balance!D117,0,($J$1-1)*8)","v":7845.3145369999993},{"$f":"OFFSET(Balance!E117,0,($J$1-1)*8)","v":7579.2182119999998},{"$f":"OFFSET(Balance!F117,0,($J$1-1)*8)","v":8000.0706869999985},{"$f":"OFFSET(Balance!G117,0,($J$1-1)*8)","v":6003.7693920000002},{"$f":"OFFSET(Balance!H117,0,($J$1-1)*8)","v":"-"},{"$f":"OFFSET(Balance!I117,0,($J$1-1)*8)","v":"-"},{"$f":"OFFSET(Balance!J117,0,($J$1-1)*8)","v":"-"}]
[null,"Solar térmica",{"$f":"OFFSET(Balance!C118,0,($J$1-1)*8)","v":4958.9149259999995},{"$f":"OFFSET(Balance!D118,0,($J$1-1)*8)","v":5085.235514},{"$f":"OFFSET(Balance!E118,0,($J$1-1)*8)","v":5071.2017019999994},{"$f":"OFFSET(Balance!F118,0,($J$1-1)*8)","v":5347.9181920000001},{"$f":"OFFSET(Balance!G118,0,($J$1-1)*8)","v":3943.681521},{"$f":"OFFSET(Balance!H118,0,($J$1-1)*8)","v":"-"},{"$f":"OFFSET(Balance!I118,0,($J$1-1)*8)","v":"-"},{"$f":"OFFSET(Balance!J118,0,($J$1-1)*8)","v":"-"}]
[null,"Térmica renovable(4)/Otras renovables",{"$f":"OFFSET(Balance!C119,0,($J$1-1)*8)","v":3805.563474},{"$f":"OFFSET(Balance!D119,0,($J$1-1)*8)","v":3422.5667469999999},{"$f":"OFFSET(Balance!E119,0,($J$1-1)*8)","v":3415.0193380000001},{"$f":"OFFSET(Balance!F119,0,($J$1-1)*8)","v":3598.7498260000002},{"$f":"OFFSET(Balance!G119,0,($J$1-1)*8)","v":2655.9777049999998},{"$f":"OFFSET(Balance!H119,0,($J$1-1)*8)","v":"-"},{"$f":"OFFSET(Balance!I119,0,($J$1-1)*8)","v":"-"},{"$f":"OFFSET(Balance!J119,0,($J$1-1)*8)","v":"-"}]
[null,"Cogeneración y resto(4)/Cogeneración",{"$f":"OFFSET(Balance!C120,0,($J$1-1)*8)","v":24128.021298},{"$f":"OFFSET(Balance!D120,0,($J$1-1)*8)","v":25169.328039000004},{"$f":"OFFSET(Balance!E120,0,($J$1-1)*8)","v":25873.942241999997},{"$f":"OFFSET(Balance!F120,0,($J$1-1)*8)","v":28175.296641000001},{"$f":"OFFSET(Balance!G120,0,($J$1-1)*8)","v":21424.935633000001},{"$f":"OFFSET(Balance!H120,0,($J$1-1)*8)","v":"-"},{"$f":"OFFSET(Balance!I120,0,($J$1-1)*8)","v":"-"},{"$f":"OFFSET(Balance!J120,0,($J$1-1)*8)","v":"-"}]
[null,"Residuos no renovables",{"$f":"OFFSET(Balance!C121,0,($J$1-1)*8)","v":1833.3435570000001},{"$f":"OFFSET(Balance!D121,0,($J$1-1)*8)","v":2324.7147409999998},{"$f":"OFFSET(Balance!E121,0,($J$1-1)*8)","v":2471.3086454999998},{"$f":"OFFSET(Balance!F121,0,($J$1-1)*8)","v":2459.1138890000002},{"$f":"OFFSET(Balance!G121,0,($J$1-1)*8)","v":1711.3341385000001},{"$f":"OFFSET(Balance!H121,0,($J$1-1)*8)","v":"-"},{"$f":"OFFSET(Balance!I121,0,($J$1-1)*8)","v":"-"},{"$f":"OFFSET(Balance!J121,0,($J$1-1)*8)","v":"-"}]
[null,"Residuos renovables",{"$f":"OFFSET(Balance!C122,0,($J$1-1)*8)","v":545.53808600000002},{"$f":"OFFSET(Balance!D122,0,($J$1-1)*8)","v":662.65547500000002},{"$f":"OFFSET(Balance!E122,0,($J$1-1)*8)","v":649.73991049999995},{"$f":"OFFSET(Balance!F122,0,($J$1-1)*8)","v":728.15043300000002},{"$f":"OFFSET(Balance!G122,0,($J$1-1)*8)","v":534.75588349999998},{"$f":"OFFSET(Balance!H122,0,($J$1-1)*8)","v":"-"},{"$f":"OFFSET(Balance!I122,0,($J$1-1)*8)","v":"-"},{"$f":"OFFSET(Balance!J122,0,($J$1-1)*8)","v":"-"}]
[null,"Régimen especial",{"$f":"OFFSET(Balance!C123,0,($J$1-1)*8)","v":" "},{"$f":"OFFSET(Balance!D123,0,($J$1-1)*8)","v":" "},{"$f":"OFFSET(Balance!E123,0,($J$1-1)*8)","v":" "},{"$f":"OFFSET(Balance!F123,0,($J$1-1)*8)","v":" "},{"$f":"OFFSET(Balance!G123,0,($J$1-1)*8)","v":" "},{"$f":"OFFSET(Balance!H123,0,($J$1-1)*8)","v":" "},{"$f":"OFFSET(Balance!I123,0,($J$1-1)*8)","v":" "},{"$f":"OFFSET(Balance!J123,0,($J$1-1)*8)","v":" "}]
[null,"Generación",{"$f":"OFFSET(Balance!C124,0,($J$1-1)*8)","v":253264.60391099998},{"$f":"OFFSET(Balance!D124,0,($J$1-1)*8)","v":253951.23455100003},{"$f":"OFFSET(Balance!E124,0,($J$1-1)*8)","v":248100.01532599999},{"$f":"OFFSET(Balance!F124,0,($J$1-1)*8)","v":248122.25110900003},{"$f":"OFFSET(Balance!G124,0,($J$1-1)*8)","v":184114.93346299999},{"$f":"OFFSET(Balance!H124,0,($J$1-1)*8)","v":"-"},{"$f":"OFFSET(Balance!I124,0,($J$1-1)*8)","v":"-"},{"$f":"OFFSET(Balance!J124,0,($J$1-1)*8)","v":"-"}]
[null,"Consumos en bombeo",{"$f":"OFFSET(Balance!C125,0,($J$1-1)*8)","v":-5385.7688595580003},{"$f":"OFFSET(Balance!D125,0,($J$1-1)*8)","v":-4512.2514306059993},{"$f":"OFFSET(Balance!E125,0,($J$1-1)*8)","v":-4827.5850676680011},{"$f":"OFFSET(Balance!F125,0,($J$1-1)*8)","v":-3607.5809876580001},{"$f":"OFFSET(Balance!G125,0,($J$1-1)*8)","v":-2443.2154947749996},{"$f":"OFFSET(Balance!H125,0,($J$1-1)*8)","v":"-"},{"$f":"OFFSET(Balance!I125,0,($J$1-1)*8)","v":"-"},{"$f":"OFFSET(Balance!J125,0,($J$1-1)*8)","v":"-"}]
[null,"Enlace Península-Baleares (6)",{"$f":"OFFSET(Balance!C126,0,($J$1-1)*8)","v":-1298.258934},{"$f":"OFFSET(Balance!D126,0,($J$1-1)*8)","v":-1335.7925440000001},{"$f":"OFFSET(Balance!E126,0,($J$1-1)*8)","v":-1250.5839679999999},{"$f":"OFFSET(Balance!F126,0,($J$1-1)*8)","v":-1179.306642},{"$f":"OFFSET(Balance!G126,0,($J$1-1)*8)","v":-963.70680900000002},{"$f":"OFFSET(Balance!H126,0,($J$1-1)*8)","v":"-"},{"$f":"OFFSET(Balance!I126,0,($J$1-1)*8)","v":"-"},{"$f":"OFFSET(Balance!J126,0,($J$1-1)*8)","v":"-"}]
[null,"Saldo intercambios internacionales (7)",{"$f":"OFFSET(Balance!C127,0,($J$1-1)*8)","v":-3406.1240240000002},{"$f":"OFFSET(Balance!D127,0,($J$1-1)*8)","v":-133.16316299999994},{"$f":"OFFSET(Balance!E127,0,($J$1-1)*8)","v":7658.0436910000008},{"$f":"OFFSET(Balance!F127,0,($J$1-1)*8)","v":9168.9935229999992},{"$f":"OFFSET(Balance!G127,0,($J$1-1)*8)","v":10300.914304},{"$f":"OFFSET(Balance!H127,0,($J$1-1)*8)","v":"-"},{"$f":"OFFSET(Balance!I127,0,($J$1-1)*8)","v":"-"},{"$f":"OFFSET(Balance!J127,0,($J$1-1)*8)","v":"-"}]
[null,"Demanda transporte (b.c.)",{"$f":"OFFSET(Balance!C128,0,($J$1-1)*8)","v":243174.45209344197},{"$f":"OFFSET(Balance!D128,0,($J$1-1)*8)","v":247970.02741339404},{"$f":"OFFSET(Balance!E128,0,($J$1-1)*8)","v":249679.889981332},{"$f":"OFFSET(Balance!F128,0,($J$1-1)*8)","v":252504.35700234203},{"$f":"OFFSET(Balance!G128,0,($J$1-1)*8)","v":191008.92546322499},{"$f":"OFFSET(Balance!H128,0,($J$1-1)*8)","v":"-"},{"$f":"OFFSET(Balance!I128,0,($J$1-1)*8)","v":"-"},{"$f":"OFFSET(Balance!J128,0,($J$1-1)*8)","v":"-"}]
[null,"(1) Asignación de unidades de producción según combustible principal."]
[null,"(2) Incluye funcionamiento en ciclo abierto."]
[null,"(3) Incluye todas aquellas unidades menores de 50 MW que no pertenecen a ninguna unidad de gestión hidráulica (UGH)."]
[null,"(4) Incluye residuos hasta el 31/12/2010."]
[null,"(5) Incluye biogás, biomasa, hidráulica marina y geotérmica."]
[null,"(6) Valor positivo: entrada de energía en el sistema; valor negativo: salida de energía del sistema. Enlace funcionando al mínimo técnico de seguridad hasta el 13/08/2012. "]
[null,"(7) Valor positivo: saldo importador; valor negativo: saldo exportador."]
[null,{"$f":"IF(MONTH(FACT)=1,\"\",CONCATENATE(\"Para el año \",YEAR(FACT), \" valores acumulados hasta \",TEXT(FACT-30,\"mmmm\"),\" de \",YEAR(FACT),\".\"))","v":"Para el año 2018 valores acumulados hasta septiembre de 2018."}]
[null,{"$f":"'Balance nacional mensual'!B38","v":"Datos definitivos hasta el 31/03/2017. Datos provisionales del 01/04/2017 al 31/08/2018. Datos programados del 01/09/2018 al 30/09/2018."}]

{"sheet":"Balance Baleares mensual","index":5,"n_rows":33,"n_cols":15,"rows_kept":33,"cut":false,"hidden":false,"merged":[[32,1,32,8],[31,1,31,14],[27,1,27,14],[28,1,28,14],[29,1,29,14],[30,1,30,12]]}
[null,null,null,null,null,null,null,null,null,null,null,null,null,null,13]
[]
[]
[null,null,null,null,null,null,null,null,null,null,null,null,"Sistema eléctrico"]
[null,null,null,null,null,null,null,null,null,null,null,null,"Horizonte temporal"]
[null,null,null,null,null,null,null,null,null,null,null,null,"Periodo"]
[]
[null,null,"Ene.","Feb.","Mar.","Abr.","May.","Jun.","Jul.","Ago.","Sep.","Oct.","Nov.","Dic.",{"$f":"OFFSET(Año!C18,($O$1-1),0)","v":2018}]
[]
[null,"Carbón",{"$f":"OFFSET(Balance!C26,0,($O$1-1)*12)","v":198555.02900000001},{"$f":"OFFSET(Balance!D26,0,($O$1-1)*12)","v":192794.93400000001},{"$f":"OFFSET(Balance!E26,0,($O$1-1)*12)","v":199821.57},{"$f":"OFFSET(Balance!F26,0,($O$1-1)*12)","v":183056.22099999999},{"$f":"OFFSET(Balance!G26,0,($O$1-1)*12)","v":185327.823},{"$f":"OFFSET(Balance!H26,0,($O$1-1)*12)","v":204879.731},{"$f":"OFFSET(Balance!I26,0,($O$1-1)*12)","v":242068.47899999999},{"$f":"OFFSET(Balance!J26,0,($O$1-1)*12)","v":257313.11},{"$f":"OFFSET(Balance!K26,0,($O$1-1)*12)","v":250630.39499999999},{"$f":"OFFSET(Balance!L26,0,($O$1-1)*12)","v":"-"},{"$f":"OFFSET(Balance!M26,0,($O$1-1)*12)","v":"-"},{"$f":"OFFSET(Balance!N26,0,($O$1-1)*12)","v":"-"},{"$f":"IF(SUM(C10:N10)=0,\"-\",SUM(C10:N10))","v":1914447.2919999999}]
[null,"Motores diesel",{"$f":"OFFSET(Balance!C27,0,($O$1-1)*12)","v":35080.182000000001},{"$f":"OFFSET(Balance!D27,0,($O$1-1)*12)","v":38969.616000000002},{"$f":"OFFSET(Balance!E27,0,($O$1-1)*12)","v":35928.451999999997},{"$f":"OFFSET(Balance!F27,0,($O$1-1)*12)","v":37207.235000000001},{"$f":"OFFSET(Balance!G27,0,($O$1-1)*12)","v":51279.923000000003},{"$f":"OFFSET(Balance!H27,0,($O$1-1)*12)","v":59423.205000000002},{"$f":"OFFSET(Balance!I27,0,($O$1-1)*12)","v":82636.36},{"$f":"OFFSET(Balance!J27,0,($O$1-1)*12)","v":89525.766000000003},{"$f":"OFFSET(Balance!K27,0,($O$1-1)*12)","v":72079.990000000005},{"$f":"OFFSET(Balance!L27,0,($O$1-1)*12)","v":"-"},{"$f":"OFFSET(Balance!M27,0,($O$1-1)*12)","v":"-"},{"$f":"OFFSET(Balance!N27,0,($O$1-1)*12)","v":"-"},502130.72899999999]
[null,"Turbina de gas",{"$f":"OFFSET(Balance!C28,0,($O$1-1)*12)","v":59852.256000000001},{"$f":"OFFSET(Balance!D28,0,($O$1-1)*12)","v":59882.574999999997},{"$f":"OFFSET(Balance!E28,0,($O$1-1)*12)","v":61051.561000000002},{"$f":"OFFSET(Balance!F28,0,($O$1-1)*12)","v":57191.896000000001},{"$f":"OFFSET(Balance!G28,0,($O$1-1)*12)","v":66096.778000000006},{"$f":"OFFSET(Balance!H28,0,($O$1-1)*12)","v":77051.413},{"$f":"OFFSET(Balance!I28,0,($O$1-1)*12)","v":95847.725999999995},{"$f":"OFFSET(Balance!J28,0,($O$1-1)*12)","v":91166.569000000003},{"$f":"OFFSET(Balance!K28,0,($O$1-1)*12)","v":75102.127999999997},{"$f":"OFFSET(Balance!L28,0,($O$1-1)*12)","v":"-"},{"$f":"OFFSET(Balance!M28,0,($O$1-1)*12)","v":"-"},{"$f":"OFFSET(Balance!N28,0,($O$1-1)*12)","v":"-"},643242.902]
[null,"Fuel + Gas",{"$f":"OFFSET(Balance!C29,0,($O$1-1)*12)","v":94932.437999999995},{"$f":"OFFSET(Balance!D29,0,($O$1-1)*12)","v":98852.190999999992},{"$f":"OFFSET(Balance!E29,0,($O$1-1)*12)","v":96980.013000000006},{"$f":"OFFSET(Balance!F29,0,($O$1-1)*12)","v":94399.130999999994},{"$f":"OFFSET(Balance!G29,0,($O$1-1)*12)","v":117376.701},{"$f":"OFFSET(Balance!H29,0,($O$1-1)*12)","v":136474.61800000002},{"$f":"OFFSET(Balance!I29,0,($O$1-1)*12)","v":178484.08600000001},{"$f":"OFFSET(Balance!J29,0,($O$1-1)*12)","v":180692.33500000002},{"$f":"OFFSET(Balance!K29,0,($O$1-1)*12)","v":147182.11800000002},{"$f":"OFFSET(Balance!L29,0,($O$1-1)*12)","v":"-"},{"$f":"OFFSET(Balance!M29,0,($O$1-1)*12)","v":"-"},{"$f":"OFFSET(Balance!N29,0,($O$1-1)*12)","v":"-"},{"$f":"SUM(O11:O12)","v":1145373.6310000001}]
[null,"Ciclo combinado (2)",{"$f":"OFFSET(Balance!C30,0,($O$1-1)*12)","v":31201.088},{"$f":"OFFSET(Balance!D30,0,($O$1-1)*12)","v":48135.34},{"$f":"OFFSET(Balance!E30,0,($O$1-1)*12)","v":39439.262000000002},{"$f":"OFFSET(Balance!F30,0,($O$1-1)*12)","v":48047.036999999997},{"$f":"OFFSET(Balance!G30,0,($O$1-1)*12)","v":45724.514000000003},{"$f":"OFFSET(Balance!H30,0,($O$1-1)*12)","v":36755.218999999997},{"$f":"OFFSET(Balance!I30,0,($O$1-1)*12)","v":53754.595000000001},{"$f":"OFFSET(Balance!J30,0,($O$1-1)*12)","v":62465.703999999998},{"$f":"OFFSET(Balance!K30,0,($O$1-1)*12)","v":31104.753000000001},{"$f":"OFFSET(Balance!L30,0,($O$1-1)*12)","v":"-"},{"$f":"OFFSET(Balance!M30,0,($O$1-1)*12)","v":"-"},{"$f":"OFFSET(Balance!N30,0,($O$1-1)*12)","v":"-"},{"$f":"IF(SUM(C14:N14)=0,\"-\",SUM(C14:N14))","v":396627.5120000001}]
[null,"Generación auxiliar (3)",{"$f":"OFFSET(Balance!C31,0,($O$1-1)*12)","v":0},{"$f":"OFFSET(Balance!D31,0,($O$1-1)*12)","v":0},{"$f":"OFFSET(Balance!E31,0,($O$1-1)*12)","v":0},{"$f":"OFFSET(Balance!F31,0,($O$1-1)*12)","v":0},{"$f":"OFFSET(Balance!G31,0,($O$1-1)*12)","v":258.18900000000002},{"$f":"OFFSET(Balance!H31,0,($O$1-1)*12)","v":1406.8510000000001},{"$f":"OFFSET(Balance!I31,0,($O$1-1)*12)","v":3408.7330000000002},{"$f":"OFFSET(Balance!J31,0,($O$1-1)*12)","v":5196.1239999999998},{"$f":"OFFSET(Balance!K31,0,($O$1-1)*12)","v":2265.3319999999999},{"$f":"OFFSET(Balance!L31,0,($O$1-1)*12)","v":"-"},{"$f":"OFFSET(Balance!M31,0,($O$1-1)*12)","v":"-"},{"$f":"OFFSET(Balance!N31,0,($O$1-1)*12)","v":"-"},{"$f":"IF(SUM(C15:N15)=0,\"-\",SUM(C15:N15))","v":12535.229000000001}]
[null,"Régimen ordinario",{"$f":"OFFSET(Balance!C32,0,($O$1-1)*12)","v":"-"},{"$f":"OFFSET(Balance!D32,0,($O$1-1)*12)","v":"-"},{"$f":"OFFSET(Balance!E32,0,($O$1-1)*12)","v":"-"},{"$f":"OFFSET(Balance!F32,0,($O$1-1)*12)","v":"-"},{"$f":"OFFSET(Balance!G32,0,($O$1-1)*12)","v":"-"},{"$f":"OFFSET(Balance!H32,0,($O$1-1)*12)","v":"-"},{"$f":"OFFSET(Balance!I32,0,($O$1-1)*12)","v":"-"},{"$f":"OFFSET(Balance!J32,0,($O$1-1)*12)","v":"-"},{"$f":"OFFSET(Balance!K32,0,($O$1-1)*12)","v":"-"},{"$f":"OFFSET(Balance!L32,0,($O$1-1)*12)","v":"-"},{"$f":"OFFSET(Balance!M32,0,($O$1-1)*12)","v":"-"},{"$f":"OFFSET(Balance!N32,0,($O$1-1)*12)","v":"-"},{"$f":"SUM(O10,O13:O15)","v":3468983.6639999999}]
[]
[null,"Eólica",{"$f":"OFFSET(Balance!C33,0,($O$1-1)*12)","v":252.64},{"$f":"OFFSET(Balance!D33,0,($O$1-1)*12)","v":324.012},{"$f":"OFFSET(Balance!E33,0,($O$1-1)*12)","v":405.92399999999998},{"$f":"OFFSET(Balance!F33,0,($O$1-1)*12)","v":282.64999999999998},{"$f":"OFFSET(Balance!G33,0,($O$1-1)*12)","v":228.893},{"$f":"OFFSET(Balance!H33,0,($O$1-1)*12)","v":138.68199999999999},{"$f":"OFFSET(Balance!I33,0,($O$1-1)*12)","v":139.32900000000001},{"$f":"OFFSET(Balance!J33,0,($O$1-1)*12)","v":192.208},{"$f":"OFFSET(Balance!K33,0,($O$1-1)*12)","v":198.17599999999999},{"$f":"OFFSET(Balance!L33,0,($O$1-1)*12)","v":"-"},{"$f":"OFFSET(Balance!M33,0,($O$1-1)*12)","v":"-"},{"$f":"OFFSET(Balance!N33,0,($O$1-1)*12)","v":"-"},2162.5140000000001]
[null,"Solar fotovoltaica",{"$f":"OFFSET(Balance!C34,0,($O$1-1)*12)","v":7038.0169999999998},{"$f":"OFFSET(Balance!D34,0,($O$1-1)*12)","v":5329.54},{"$f":"OFFSET(Balance!E34,0,($O$1-1)*12)","v":10195.877},{"$f":"OFFSET(Balance!F34,0,($O$1-1)*12)","v":11476.928},{"$f":"OFFSET(Balance!G34,0,($O$1-1)*12)","v":11838.781999999999},{"$f":"OFFSET(Balance!H34,0,($O$1-1)*12)","v":12382.848},{"$f":"OFFSET(Balance!I34,0,($O$1-1)*12)","v":13421.057000000001},{"$f":"OFFSET(Balance!J34,0,($O$1-1)*12)","v":11261.584999999999},{"$f":"OFFSET(Balance!K34,0,($O$1-1)*12)","v":9045.8340000000007},{"$f":"OFFSET(Balance!L34,0,($O$1-1)*12)","v":"-"},{"$f":"OFFSET(Balance!M34,0,($O$1-1)*12)","v":"-"},{"$f":"OFFSET(Balance!N34,0,($O$1-1)*12)","v":"-"},91990.467999999993]
[null,"Otras renovables ",{"$f":"OFFSET(Balance!C35,0,($O$1-1)*12)","v":219.363},{"$f":"OFFSET(Balance!D35,0,($O$1-1)*12)","v":166.24},{"$f":"OFFSET(Balance!E35,0,($O$1-1)*12)","v":184.16499999999999},{"$f":"OFFSET(Balance!F35,0,($O$1-1)*12)","v":130.80099999999999},{"$f":"OFFSET(Balance!G35,0,($O$1-1)*12)","v":127.68},{"$f":"OFFSET(Balance!H35,0,($O$1-1)*12)","v":110.02800000000001},{"$f":"OFFSET(Balance!I35,0,($O$1-1)*12)","v":57.737000000000002},{"$f":"OFFSET(Balance!J35,0,($O$1-1)*12)","v":56.851999999999997},{"$f":"OFFSET(Balance!K35,0,($O$1-1)*12)","v":19.170000000000002},{"$f":"OFFSET(Balance!L35,0,($O$1-1)*12)","v":"-"},{"$f":"OFFSET(Balance!M35,0,($O$1-1)*12)","v":"-"},{"$f":"OFFSET(Balance!N35,0,($O$1-1)*12)","v":"-"},1072.0360000000001]
[null,"Cogeneración",{"$f":"OFFSET(Balance!C36,0,($O$1-1)*12)","v":3182.9870000000001},{"$f":"OFFSET(Balance!D36,0,($O$1-1)*12)","v":3083.654},{"$f":"OFFSET(Balance!E36,0,($O$1-1)*12)","v":2294.6849999999999},{"$f":"OFFSET(Balance!F36,0,($O$1-1)*12)","v":1982.1659999999999},{"$f":"OFFSET(Balance!G36,0,($O$1-1)*12)","v":2578.5749999999998},{"$f":"OFFSET(Balance!H36,0,($O$1-1)*12)","v":3357.2420000000002},{"$f":"OFFSET(Balance!I36,0,($O$1-1)*12)","v":3565.5639999999999},{"$f":"OFFSET(Balance!J36,0,($O$1-1)*12)","v":3515.4580000000001},{"$f":"OFFSET(Balance!K36,0,($O$1-1)*12)","v":2436.5500000000002},{"$f":"OFFSET(Balance!L36,0,($O$1-1)*12)","v":"-"},{"$f":"OFFSET(Balance!M36,0,($O$1-1)*12)","v":"-"},{"$f":"OFFSET(Balance!N36,0,($O$1-1)*12)","v":"-"},25996.880999999998]
[null,"Residuos no renovables",{"$f":"OFFSET(Balance!C37,0,($O$1-1)*12)","v":7481.4245000000001},{"$f":"OFFSET(Balance!D37,0,($O$1-1)*12)","v":4455.9544999999998},{"$f":"OFFSET(Balance!E37,0,($O$1-1)*12)","v":11199.851500000001},{"$f":"OFFSET(Balance!F37,0,($O$1-1)*12)","v":10486.738499999999},{"$f":"OFFSET(Balance!G37,0,($O$1-1)*12)","v":10524.592000000001},{"$f":"OFFSET(Balance!H37,0,($O$1-1)*12)","v":14709.154500000001},{"$f":"OFFSET(Balance!I37,0,($O$1-1)*12)","v":14429.119000000001},{"$f":"OFFSET(Balance!J37,0,($O$1-1)*12)","v":14961.362499999999},{"$f":"OFFSET(Balance!K37,0,($O$1-1)*12)","v":13453.5695},{"$f":"OFFSET(Balance!L37,0,($O$1-1)*12)","v":"-"},{"$f":"OFFSET(Balance!M37,0,($O$1-1)*12)","v":"-"},{"$f":"OFFSET(Balance!N37,0,($O$1-1)*12)","v":"-"},{"$f":"IF(SUM(C22:N22)=0,\"-\",SUM(C22:N22))","v":101701.76650000001}]
[null,"Residuos renovables",{"$f":"OFFSET(Balance!C38,0,($O$1-1)*12)","v":7481.4245000000001},{"$f":"OFFSET(Balance!D38,0,($O$1-1)*12)","v":4455.9544999999998},{"$f":"OFFSET(Balance!E38,0,($O$1-1)*12)","v":11199.851500000001},{"$f":"OFFSET(Balance!F38,0,($O$1-1)*12)","v":10486.738499999999},{"$f":"OFFSET(Balance!G38,0,($O$1-1)*12)","v":10524.592000000001},{"$f":"OFFSET(Balance!H38,0,($O$1-1)*12)","v":14709.154500000001},{"$f":"OFFSET(Balance!I38,0,($O$1-1)*12)","v":14429.119000000001},{"$f":"OFFSET(Balance!J38,0,($O$1-1)*12)","v":14961.362499999999},{"$f":"OFFSET(Balance!K38,0,($O$1-1)*12)","v":13453.5695},{"$f":"OFFSET(Balance!L38,0,($O$1-1)*12)","v":"-"},{"$f":"OFFSET(Balance!M38,0,($O$1-1)*12)","v":"-"},{"$f":"OFFSET(Balance!N38,0,($O$1-1)*12)","v":"-"},{"$f":"IF(SUM(C23:N23)=0,\"-\",SUM(C23:N23))","v":101701.76650000001}]
[null,"Régimen especial",{"$f":"OFFSET(Balance!C39,0,($O$1-1)*12)","v":"-"},{"$f":"OFFSET(Balance!D39,0,($O$1-1)*12)","v":"-"},{"$f":"OFFSET(Balance!E39,0,($O$1-1)*12)","v":"-"},{"$f":"OFFSET(Balance!F39,0,($O$1-1)*12)","v":"-"},{"$f":"OFFSET(Balance!G39,0,($O$1-1)*12)","v":"-"},{"$f":"OFFSET(Balance!H39,0,($O$1-1)*12)","v":"-"},{"$f":"OFFSET(Balance!I39,0,($O$1-1)*12)","v":"-"},{"$f":"OFFSET(Balance!J39,0,($O$1-1)*12)","v":"-"},{"$f":"OFFSET(Balance!K39,0,($O$1-1)*12)","v":"-"},{"$f":"OFFSET(Balance!L39,0,($O$1-1)*12)","v":"-"},{"$f":"OFFSET(Balance!M39,0,($O$1-1)*12)","v":"-"},{"$f":"OFFSET(Balance!N39,0,($O$1-1)*12)","v":"-"},{"$f":"SUM(O18:O23)","v":324625.43200000003}]
[null,"Generación",{"$f":"OFFSET(Balance!C40,0,($O$1-1)*12)","v":350344.41100000002},{"$f":"OFFSET(Balance!D40,0,($O$1-1)*12)","v":357597.82},{"$f":"OFFSET(Balance!E40,0,($O$1-1)*12)","v":371721.19900000002},{"$f":"OFFSET(Balance!F40,0,($O$1-1)*12)","v":360348.41100000002},{"$f":"OFFSET(Balance!G40,0,($O$1-1)*12)","v":384510.34100000001},{"$f":"OFFSET(Balance!H40,0,($O$1-1)*12)","v":424923.52799999999},{"$f":"OFFSET(Balance!I40,0,($O$1-1)*12)","v":523757.81800000003},{"$f":"OFFSET(Balance!J40,0,($O$1-1)*12)","v":550616.10100000002},{"$f":"OFFSET(Balance!K40,0,($O$1-1)*12)","v":469789.467},{"$f":"OFFSET(Balance!L40,0,($O$1-1)*12)","v":"-"},{"$f":"OFFSET(Balance!M40,0,($O$1-1)*12)","v":"-"},{"$f":"OFFSET(Balance!N40,0,($O$1-1)*12)","v":"-"},{"$f":"SUM(O16:O17,O24)","v":3793609.0959999999}]
[null,"Enlace Península-Baleares (5)",{"$f":"OFFSET(Balance!C41,0,($O$1-1)*12)","v":86203.828999999998},{"$f":"OFFSET(Balance!D41,0,($O$1-1)*12)","v":99993.399000000005},{"$f":"OFFSET(Balance!E41,0,($O$1-1)*12)","v":89996.875},{"$f":"OFFSET(Balance!F41,0,($O$1-1)*12)","v":66467.520000000004},{"$f":"OFFSET(Balance!G41,0,($O$1-1)*12)","v":89565.091},{"$f":"OFFSET(Balance!H41,0,($O$1-1)*12)","v":108623.63499999999},{"$f":"OFFSET(Balance!I41,0,($O$1-1)*12)","v":161791.603},{"$f":"OFFSET(Balance!J41,0,($O$1-1)*12)","v":153133.58900000001},{"$f":"OFFSET(Balance!K41,0,($O$1-1)*12)","v":107931.268},{"$f":"OFFSET(Balance!L41,0,($O$1-1)*12)","v":"-"},{"$f":"OFFSET(Balance!M41,0,($O$1-1)*12)","v":"-"},{"$f":"OFFSET(Balance!N41,0,($O$1-1)*12)","v":"-"},963706.80900000012]
[null,"Demanda transporte (b.c.)",{"$f":"OFFSET(Balance!C42,0,($O$1-1)*12)","v":436548.24},{"$f":"OFFSET(Balance!D42,0,($O$1-1)*12)","v":457591.21899999998},{"$f":"OFFSET(Balance!E42,0,($O$1-1)*12)","v":461718.07400000002},{"$f":"OFFSET(Balance!F42,0,($O$1-1)*12)","v":426815.93099999998},{"$f":"OFFSET(Balance!G42,0,($O$1-1)*12)","v":474075.43199999997},{"$f":"OFFSET(Balance!H42,0,($O$1-1)*12)","v":533547.16299999994},{"$f":"OFFSET(Balance!I42,0,($O$1-1)*12)","v":685549.42099999997},{"$f":"OFFSET(Balance!J42,0,($O$1-1)*12)","v":703749.69},{"$f":"OFFSET(Balance!K42,0,($O$1-1)*12)","v":577720.73499999999},{"$f":"OFFSET(Balance!L42,0,($O$1-1)*12)","v":"-"},{"$f":"OFFSET(Balance!M42,0,($O$1-1)*12)","v":"-"},{"$f":"OFFSET(Balance!N42,0,($O$1-1)*12)","v":"-"},{"$f":"SUM(O25:O26)","v":4757315.9050000003}]
[null,"(1) Asignación de unidades de producción según combustible principal."]
[null,"(2) Incluye funcionamiento en ciclo abierto."]
[null,"(3) Grupos de emergencia que se instalan de forma transitoria en determinadas zonas para cubrir un déficit de generación."]
[null,"(4) Hasta 2010 incluye residuos."]
[null,"(5) Valor positivo: entrada de energía en el sistema; valor negativo: salida de energía del sistema. Enlace funcionando al mínimo técnico de seguridad hasta el 13/08/2012. "]
[null,{"$f":"'Balance nacional mensual'!B38","v":"Datos definitivos hasta el 31/03/2017. Datos provisionales del 01/04/2017 al 31/08/2018. Datos programados del 01/09/2018 al 30/09/2018."}]

{"sheet":"Balance Baleares anual","index":6,"n_rows":35,"n_cols":10,"rows_kept":35,"cut":false,"hidden":false,"merged":[[27,1,27,11],[28,1,28,11],[29,1,29,11],[32,1,32,11],[30,1,30,14],[31,1,31,14]]}
[null,null,null,null,null,null,null,null,null,2]
[]
[]
[null,null,null,null,null,null,null,null,"Sistema eléctrico"]
[null,null,null,null,null,null,null,null,"Horizonte temporal"]
[null,null,null,null,null,null,null,null,"Periodo"]
[]
[null,null,{"$f":"OFFSET(Balance!C130,0,($J$1-1)*8)","v":2014},{"$f":"OFFSET(Balance!D130,0,($J$1-1)*8)","v":2015},{"$f":"OFFSET(Balance!E130,0,($J$1-1)*8)","v":2016},{"$f":"OFFSET(Balance!F130,0,($J$1-1)*8)","v":2017},{"$f":"OFFSET(Balance!G130,0,($J$1-1)*8)","v":2018},{"$f":"OFFSET(Balance!H130,0,($J$1-1)*8)","v":2019},{"$f":"OFFSET(Balance!I130,0,($J$1-1)*8)","v":2020},{"$f":"OFFSET(Balance!J130,0,($J$1-1)*8)","v":2021}]
[]
[null,"Carbón",{"$f":"OFFSET(Balance!C131,0,($J$1-1)*8)","v":2187777.7260000003},{"$f":"OFFSET(Balance!D131,0,($J$1-1)*8)","v":1861683.0870000001},{"$f":"OFFSET(Balance!E131,0,($J$1-1)*8)","v":2302867.9710000004},{"$f":"OFFSET(Balance!F131,0,($J$1-1)*8)","v":2598502.4430000004},{"$f":"OFFSET(Balance!G131,0,($J$1-1)*8)","v":1914447.2919999999},{"$f":"OFFSET(Balance!H131,0,($J$1-1)*8)","v":"-"},{"$f":"OFFSET(Balance!I131,0,($J$1-1)*8)","v":"-"},{"$f":"OFFSET(Balance!J131,0,($J$1-1)*8)","v":"-"}]
[null,"Motores diesel",{"$f":"OFFSET(Balance!C132,0,($J$1-1)*8)","v":666783.55999999994},{"$f":"OFFSET(Balance!D132,0,($J$1-1)*8)","v":724983.97100000002},{"$f":"OFFSET(Balance!E132,0,($J$1-1)*8)","v":961260.82},{"$f":"OFFSET(Balance!F132,0,($J$1-1)*8)","v":795987.56},{"$f":"OFFSET(Balance!G132,0,($J$1-1)*8)","v":502130.72899999999},{"$f":"OFFSET(Balance!H132,0,($J$1-1)*8)","v":"-"},{"$f":"OFFSET(Balance!I132,0,($J$1-1)*8)","v":"-"},{"$f":"OFFSET(Balance!J132,0,($J$1-1)*8)","v":"-"}]
[null,"Turbina de gas",{"$f":"OFFSET(Balance!C133,0,($J$1-1)*8)","v":585387.88199999998},{"$f":"OFFSET(Balance!D133,0,($J$1-1)*8)","v":586589.29900000012},{"$f":"OFFSET(Balance!E133,0,($J$1-1)*8)","v":339758.26499999996},{"$f":"OFFSET(Balance!F133,0,($J$1-1)*8)","v":556524.57400000002},{"$f":"OFFSET(Balance!G133,0,($J$1-1)*8)","v":643242.902},{"$f":"OFFSET(Balance!H133,0,($J$1-1)*8)","v":"-"},{"$f":"OFFSET(Balance!I133,0,($J$1-1)*8)","v":"-"},{"$f":"OFFSET(Balance!J133,0,($J$1-1)*8)","v":"-"}]
[null,"Fuel + Gas",{"$f":"OFFSET(Balance!C134,0,($J$1-1)*8)","v":1252171.4419999998},{"$f":"OFFSET(Balance!D134,0,($J$1-1)*8)","v":1311573.27},{"$f":"OFFSET(Balance!E134,0,($J$1-1)*8)","v":1301019.085},{"$f":"OFFSET(Balance!F134,0,($J$1-1)*8)","v":1352512.1339999998},{"$f":"OFFSET(Balance!G134,0,($J$1-1)*8)","v":1145373.6310000001},{"$f":"OFFSET(Balance!H134,0,($J$1-1)*8)","v":"-"},{"$f":"OFFSET(Balance!I134,0,($J$1-1)*8)","v":"-"},{"$f":"OFFSET(Balance!J134,0,($J$1-1)*8)","v":"-"}]
[null,"Ciclo combinado (2)",{"$f":"OFFSET(Balance!C135,0,($J$1-1)*8)","v":419633.12},{"$f":"OFFSET(Balance!D135,0,($J$1-1)*8)","v":804686.98600000003},{"$f":"OFFSET(Balance!E135,0,($J$1-1)*8)","v":535082.09499999997},{"$f":"OFFSET(Balance!F135,0,($J$1-1)*8)","v":420429.35599999997},{"$f":"OFFSET(Balance!G135,0,($J$1-1)*8)","v":396627.5120000001},{"$f":"OFFSET(Balance!H135,0,($J$1-1)*8)","v":"-"},{"$f":"OFFSET(Balance!I135,0,($J$1-1)*8)","v":"-"},{"$f":"OFFSET(Balance!J135,0,($J$1-1)*8)","v":"-"}]
[null,"Generación auxiliar (3)",{"$f":"OFFSET(Balance!C136,0,($J$1-1)*8)","v":7694.0940000000001},{"$f":"OFFSET(Balance!D136,0,($J$1-1)*8)","v":10578.49},{"$f":"OFFSET(Balance!E136,0,($J$1-1)*8)","v":10092.819},{"$f":"OFFSET(Balance!F136,0,($J$1-1)*8)","v":14746.465},{"$f":"OFFSET(Balance!G136,0,($J$1-1)*8)","v":12535.229000000001},{"$f":"OFFSET(Balance!H136,0,($J$1-1)*8)","v":"-"},{"$f":"OFFSET(Balance!I136,0,($J$1-1)*8)","v":"-"},{"$f":"OFFSET(Balance!J136,0,($J$1-1)*8)","v":"-"}]
[null,"Régimen ordinario",{"$f":"OFFSET(Balance!C137,0,($J$1-1)*8)","v":" "},{"$f":"OFFSET(Balance!D137,0,($J$1-1)*8)","v":" "},{"$f":"OFFSET(Balance!E137,0,($J$1-1)*8)","v":" "},{"$f":"OFFSET(Balance!F137,0,($J$1-1)*8)","v":" "},{"$f":"OFFSET(Balance!G137,0,($J$1-1)*8)","v":" "},{"$f":"OFFSET(Balance!H137,0,($J$1-1)*8)","v":" "},{"$f":"OFFSET(Balance!I137,0,($J$1-1)*8)","v":" "},{"$f":"OFFSET(Balance!J137,0,($J$1-1)*8)","v":" "}]
[]
[null,"Eólica",{"$f":"OFFSET(Balance!C138,0,($J$1-1)*8)","v":5839.5779999999995},{"$f":"OFFSET(Balance!D138,0,($J$1-1)*8)","v":5318.2280000000001},{"$f":"OFFSET(Balance!E138,0,($J$1-1)*8)","v":5416.058},{"$f":"OFFSET(Balance!F138,0,($J$1-1)*8)","v":2924.2759999999998},{"$f":"OFFSET(Balance!G138,0,($J$1-1)*8)","v":2162.5140000000001},{"$f":"OFFSET(Balance!H138,0,($J$1-1)*8)","v":"-"},{"$f":"OFFSET(Balance!I138,0,($J$1-1)*8)","v":"-"},{"$f":"OFFSET(Balance!J138,0,($J$1-1)*8)","v":"-"}]
[null,"Solar fotovoltaica",{"$f":"OFFSET(Balance!C139,0,($J$1-1)*8)","v":122765.68900000001},{"$f":"OFFSET(Balance!D139,0,($J$1-1)*8)","v":122619.80299999999},{"$f":"OFFSET(Balance!E139,0,($J$1-1)*8)","v":120507.53},{"$f":"OFFSET(Balance!F139,0,($J$1-1)*8)","v":123336.93899999998},{"$f":"OFFSET(Balance!G139,0,($J$1-1)*8)","v":91990.467999999993},{"$f":"OFFSET(Balance!H139,0,($J$1-1)*8)","v":"-"},{"$f":"OFFSET(Balance!I139,0,($J$1-1)*8)","v":"-"},{"$f":"OFFSET(Balance!J139,0,($J$1-1)*8)","v":"-"}]
[null,"Térmica renovable(4)/Otras renovables",{"$f":"OFFSET(Balance!C140,0,($J$1-1)*8)","v":1945.6589999999999},{"$f":"OFFSET(Balance!D140,0,($J$1-1)*8)","v":1971.549},{"$f":"OFFSET(Balance!E140,0,($J$1-1)*8)","v":1309.7150000000001},{"$f":"OFFSET(Balance!F140,0,($J$1-1)*8)","v":1626.7410000000002},{"$f":"OFFSET(Balance!G140,0,($J$1-1)*8)","v":1072.0360000000001},{"$f":"OFFSET(Balance!H140,0,($J$1-1)*8)","v":"-"},{"$f":"OFFSET(Balance!I140,0,($J$1-1)*8)","v":"-"},{"$f":"OFFSET(Balance!J140,0,($J$1-1)*8)","v":"-"}]
[null,"Cogeneración y resto(4)/Cogeneración",{"$f":"OFFSET(Balance!C141,0,($J$1-1)*8)","v":25222.583999999995},{"$f":"OFFSET(Balance!D141,0,($J$1-1)*8)","v":31549.726999999995},{"$f":"OFFSET(Balance!E141,0,($J$1-1)*8)","v":34701.317000000003},{"$f":"OFFSET(Balance!F141,0,($J$1-1)*8)","v":36244.234000000004},{"$f":"OFFSET(Balance!G141,0,($J$1-1)*8)","v":25996.880999999998},{"$f":"OFFSET(Balance!H141,0,($J$1-1)*8)","v":"-"},{"$f":"OFFSET(Balance!I141,0,($J$1-1)*8)","v":"-"},{"$f":"OFFSET(Balance!J141,0,($J$1-1)*8)","v":"-"}]
[null,"Residuos no renovables",{"$f":"OFFSET(Balance!C142,0,($J$1-1)*8)","v":128084.32949999999},{"$f":"OFFSET(Balance!D142,0,($J$1-1)*8)","v":151097.72949999999},{"$f":"OFFSET(Balance!E142,0,($J$1-1)*8)","v":130805.0665},{"$f":"OFFSET(Balance!F142,0,($J$1-1)*8)","v":143878.66800000001},{"$f":"OFFSET(Balance!G142,0,($J$1-1)*8)","v":101701.76650000001},{"$f":"OFFSET(Balance!H142,0,($J$1-1)*8)","v":"-"},{"$f":"OFFSET(Balance!I142,0,($J$1-1)*8)","v":"-"},{"$f":"OFFSET(Balance!J142,0,($J$1-1)*8)","v":"-"}]
[null,"Residuos renovables",{"$f":"OFFSET(Balance!C143,0,($J$1-1)*8)","v":128084.32949999999},{"$f":"OFFSET(Balance!D143,0,($J$1-1)*8)","v":151097.72949999999},{"$f":"OFFSET(Balance!E143,0,($J$1-1)*8)","v":130805.0665},{"$f":"OFFSET(Balance!F143,0,($J$1-1)*8)","v":143878.66800000001},{"$f":"OFFSET(Balance!G143,0,($J$1-1)*8)","v":101701.76650000001},{"$f":"OFFSET(Balance!H143,0,($J$1-1)*8)","v":"-"},{"$f":"OFFSET(Balance!I143,0,($J$1-1)*8)","v":"-"},{"$f":"OFFSET(Balance!J143,0,($J$1-1)*8)","v":"-"}]
[null,"Régimen especial",{"$f":"OFFSET(Balance!C144,0,($J$1-1)*8)","v":" "},{"$f":"OFFSET(Balance!D144,0,($J$1-1)*8)","v":" "},{"$f":"OFFSET(Balance!E144,0,($J$1-1)*8)","v":" "},{"$f":"OFFSET(Balance!F144,0,($J$1-1)*8)","v":" "},{"$f":"OFFSET(Balance!G144,0,($J$1-1)*8)","v":" "},{"$f":"OFFSET(Balance!H144,0,($J$1-1)*8)","v":" "},{"$f":"OFFSET(Balance!I144,0,($J$1-1)*8)","v":" "},{"$f":"OFFSET(Balance!J144,0,($J$1-1)*8)","v":" "}]
[null,"Generación",{"$f":"OFFSET(Balance!C145,0,($J$1-1)*8)","v":4279218.551},{"$f":"OFFSET(Balance!D145,0,($J$1-1)*8)","v":4452176.5990000004},{"$f":"OFFSET(Balance!E145,0,($J$1-1)*8)","v":4572606.7230000002},{"$f":"OFFSET(Balance!F145,0,($J$1-1)*8)","v":4838079.9239999996},{"$f":"OFFSET(Balance!G145,0,($J$1-1)*8)","v":3793609.0959999994},{"$f":"OFFSET(Balance!H145,0,($J$1-1)*8)","v":"-"},{"$f":"OFFSET(Balance!I145,0,($J$1-1)*8)","v":"-"},{"$f":"OFFSET(Balance!J145,0,($J$1-1)*8)","v":"-"}]
[null,"Enlace Península-Baleares (5)",{"$f":"OFFSET(Balance!C146,0,($J$1-1)*8)","v":1298258.9339999999},{"$f":"OFFSET(Balance!D146,0,($J$1-1)*8)","v":1335792.544},{"$f":"OFFSET(Balance!E146,0,($J$1-1)*8)","v":1250583.9679999999},{"$f":"OFFSET(Balance!F146,0,($J$1-1)*8)","v":1179306.642},{"$f":"OFFSET(Balance!G146,0,($J$1-1)*8)","v":963706.80900000012},{"$f":"OFFSET(Balance!H146,0,($J$1-1)*8)","v":"-"},{"$f":"OFFSET(Balance!I146,0,($J$1-1)*8)","v":"-"},{"$f":"OFFSET(Balance!J146,0,($J$1-1)*8)","v":"-"}]
[null,"Demanda transporte (b.c.)",{"$f":"OFFSET(Balance!C147,0,($J$1-1)*8)","v":5577477.4849999994},{"$f":"OFFSET(Balance!D147,0,($J$1-1)*8)","v":5787969.1430000002},{"$f":"OFFSET(Balance!E147,0,($J$1-1)*8)","v":5823190.6909999996},{"$f":"OFFSET(Balance!F147,0,($J$1-1)*8)","v":6017386.5659999996},{"$f":"OFFSET(Balance!G147,0,($J$1-1)*8)","v":4757315.9049999993},{"$f":"OFFSET(Balance!H147,0,($J$1-1)*8)","v":"-"},{"$f":"OFFSET(Balance!I147,0,($J$1-1)*8)","v":"-"},{"$f":"OFFSET(Balance!J147,0,($J$1-1)*8)","v":"-"}]
[null,"(1) Asignación de unidades de producción según combustible principal."]
[null,"(2) Incluye funcionamiento en ciclo abierto."]
[null,"(3) Grupos de emergencia que se instalan de forma transitoria en determinadas zonas para cubrir un déficit de generación."]
[null,"(4) Hasta 2014 e incluye residuos hasta 2010."]
[null,"(4) Incluye residuos hasta 2010."]
[null,"(5) Valor positivo: entrada de energía en el sistema; valor negativo: salida de energía del sistema. Enlace funcionando al mínimo técnico de seguridad hasta el 13/08/2012. "]
[null,{"$f":"IF(MONTH(FACT)=1,\"\",CONCATENATE(\"Para el año \",YEAR(FACT), \" valores acumulados hasta \",TEXT(FACT-30,\"mmmm\"),\" de \",YEAR(FACT),\".\"))","v":"Para el año 2018 valores acumulados hasta septiembre de 2018."}]
[null,{"$f":"'Balance nacional mensual'!B38","v":"Datos definitivos hasta el 31/03/2017. Datos provisionales del 01/04/2017 al 31/08/2018. Datos programados del 01/09/2018 al 30/09/2018."}]

{"sheet":"Balance Canarias mensual","index":7,"n_rows":32,"n_cols":15,"rows_kept":32,"cut":false,"hidden":false,"merged":[[28,1,28,14],[29,1,29,14],[30,1,30,14],[27,1,27,14],[31,1,31,10]]}
[null,null,null,null,null,null,null,null,null,null,null,null,null,null,13]
[]
[]
[null,null,null,null,null,null,null,null,null,null,null,null,"Sistema eléctrico"]
[null,null,null,null,null,null,null,null,null,null,null,null,"Horizonte temporal"]
[null,null,null,null,null,null,null,null,null,null,null,null,"Periodo"]
[]
[null,null,"Ene.","Feb.","Mar.","Abr.","May.","Jun.","Jul.","Ago.","Sep.","Oct.","Nov.","Dic.",{"$f":"OFFSET(Año!C18,($O$1-1),0)","v":2018}]
[]
[null,"Hidráulica",{"$f":"OFFSET(Balance!C45,0,($O$1-1)*12)","v":279.43200000000002},{"$f":"OFFSET(Balance!D45,0,($O$1-1)*12)","v":34.173000000000002},{"$f":"OFFSET(Balance!E45,0,($O$1-1)*12)","v":309.52699999999999},{"$f":"OFFSET(Balance!F45,0,($O$1-1)*12)","v":276.12299999999999},{"$f":"OFFSET(Balance!G45,0,($O$1-1)*12)","v":308.334},{"$f":"OFFSET(Balance!H45,0,($O$1-1)*12)","v":294.48200000000003},{"$f":"OFFSET(Balance!I45,0,($O$1-1)*12)","v":295.596},{"$f":"OFFSET(Balance!J45,0,($O$1-1)*12)","v":307.64},{"$f":"OFFSET(Balance!K45,0,($O$1-1)*12)","v":288.399},{"$f":"OFFSET(Balance!L45,0,($O$1-1)*12)","v":"-"},{"$f":"OFFSET(Balance!M45,0,($O$1-1)*12)","v":"-"},{"$f":"OFFSET(Balance!N45,0,($O$1-1)*12)","v":"-"},{"$f":"IF(SUM(C10:N10)=0,\"-\",SUM(C10:N10))","v":2393.7060000000001}]
[null,"Motores diesel",{"$f":"OFFSET(Balance!C46,0,($O$1-1)*12)","v":184470.95499999999},{"$f":"OFFSET(Balance!D46,0,($O$1-1)*12)","v":165518.859},{"$f":"OFFSET(Balance!E46,0,($O$1-1)*12)","v":176176.58600000001},{"$f":"OFFSET(Balance!F46,0,($O$1-1)*12)","v":171464.6},{"$f":"OFFSET(Balance!G46,0,($O$1-1)*12)","v":172148.367},{"$f":"OFFSET(Balance!H46,0,($O$1-1)*12)","v":162836.70600000001},{"$f":"OFFSET(Balance!I46,0,($O$1-1)*12)","v":173812.74900000001},{"$f":"OFFSET(Balance!J46,0,($O$1-1)*12)","v":196430.05100000001},{"$f":"OFFSET(Balance!K46,0,($O$1-1)*12)","v":187122.56099999999},{"$f":"OFFSET(Balance!L46,0,($O$1-1)*12)","v":"-"},{"$f":"OFFSET(Balance!M46,0,($O$1-1)*12)","v":"-"},{"$f":"OFFSET(Balance!N46,0,($O$1-1)*12)","v":"-"},{"$f":"IF(SUM(C11:N11)=0,\"-\",SUM(C11:N11))","v":1589981.4339999999}]
[null,"Turbina de gas",{"$f":"OFFSET(Balance!C47,0,($O$1-1)*12)","v":27249.141},{"$f":"OFFSET(Balance!D47,0,($O$1-1)*12)","v":24751.364000000001},{"$f":"OFFSET(Balance!E47,0,($O$1-1)*12)","v":19300.776000000002},{"$f":"OFFSET(Balance!F47,0,($O$1-1)*12)","v":22020.656999999999},{"$f":"OFFSET(Balance!G47,0,($O$1-1)*12)","v":27236.414000000001},{"$f":"OFFSET(Balance!H47,0,($O$1-1)*12)","v":24035.203000000001},{"$f":"OFFSET(Balance!I47,0,($O$1-1)*12)","v":19071.615000000002},{"$f":"OFFSET(Balance!J47,0,($O$1-1)*12)","v":22472.683000000001},{"$f":"OFFSET(Balance!K47,0,($O$1-1)*12)","v":28508.218000000001},{"$f":"OFFSET(Balance!L47,0,($O$1-1)*12)","v":"-"},{"$f":"OFFSET(Balance!M47,0,($O$1-1)*12)","v":"-"},{"$f":"OFFSET(Balance!N47,0,($O$1-1)*12)","v":"-"},{"$f":"IF(SUM(C12:N12)=0,\"-\",SUM(C12:N12))","v":214646.07099999997}]
[null,"Turbina de vapor",{"$f":"OFFSET(Balance!C48,0,($O$1-1)*12)","v":230384.78400000001},{"$f":"OFFSET(Balance!D48,0,($O$1-1)*12)","v":210409.16099999999},{"$f":"OFFSET(Balance!E48,0,($O$1-1)*12)","v":195203.052},{"$f":"OFFSET(Balance!F48,0,($O$1-1)*12)","v":189558.611},{"$f":"OFFSET(Balance!G48,0,($O$1-1)*12)","v":186409.18599999999},{"$f":"OFFSET(Balance!H48,0,($O$1-1)*12)","v":200030.84899999999},{"$f":"OFFSET(Balance!I48,0,($O$1-1)*12)","v":206693.728},{"$f":"OFFSET(Balance!J48,0,($O$1-1)*12)","v":214943.94899999999},{"$f":"OFFSET(Balance!K48,0,($O$1-1)*12)","v":188605.34400000001},{"$f":"OFFSET(Balance!L48,0,($O$1-1)*12)","v":"-"},{"$f":"OFFSET(Balance!M48,0,($O$1-1)*12)","v":"-"},{"$f":"OFFSET(Balance!N48,0,($O$1-1)*12)","v":"-"},{"$f":"IF(SUM(C13:N13)=0,\"-\",SUM(C13:N13))","v":1822238.6639999999}]
[null,"Fuel + Gas",{"$f":"OFFSET(Balance!C49,0,($O$1-1)*12)","v":442104.88},{"$f":"OFFSET(Balance!D49,0,($O$1-1)*12)","v":400679.38399999996},{"$f":"OFFSET(Balance!E49,0,($O$1-1)*12)","v":390680.41399999999},{"$f":"OFFSET(Balance!F49,0,($O$1-1)*12)","v":383043.86800000002},{"$f":"OFFSET(Balance!G49,0,($O$1-1)*12)","v":385793.96699999995},{"$f":"OFFSET(Balance!H49,0,($O$1-1)*12)","v":386902.75800000003},{"$f":"OFFSET(Balance!I49,0,($O$1-1)*12)","v":399578.092},{"$f":"OFFSET(Balance!J49,0,($O$1-1)*12)","v":433846.68299999996},{"$f":"OFFSET(Balance!K49,0,($O$1-1)*12)","v":404236.12300000002},{"$f":"OFFSET(Balance!L49,0,($O$1-1)*12)","v":"-"},{"$f":"OFFSET(Balance!M49,0,($O$1-1)*12)","v":"-"},{"$f":"OFFSET(Balance!N49,0,($O$1-1)*12)","v":"-"},{"$f":"IF(SUM(C14:N14)=0,\"-\",SUM(C14:N14))","v":3626866.1690000002}]
[null,"Ciclo combinado (2)",{"$f":"OFFSET(Balance!C50,0,($O$1-1)*12)","v":233901.625},{"$f":"OFFSET(Balance!D50,0,($O$1-1)*12)","v":215216.772},{"$f":"OFFSET(Balance!E50,0,($O$1-1)*12)","v":260839.18100000001},{"$f":"OFFSET(Balance!F50,0,($O$1-1)*12)","v":246337.68299999999},{"$f":"OFFSET(Balance!G50,0,($O$1-1)*12)","v":248616.78899999999},{"$f":"OFFSET(Balance!H50,0,($O$1-1)*12)","v":234948.236},{"$f":"OFFSET(Balance!I50,0,($O$1-1)*12)","v":230145.59599999999},{"$f":"OFFSET(Balance!J50,0,($O$1-1)*12)","v":251789.052},{"$f":"OFFSET(Balance!K50,0,($O$1-1)*12)","v":281474.674},{"$f":"OFFSET(Balance!L50,0,($O$1-1)*12)","v":"-"},{"$f":"OFFSET(Balance!M50,0,($O$1-1)*12)","v":"-"},{"$f":"OFFSET(Balance!N50,0,($O$1-1)*12)","v":"-"},2203269.6079999995]
[null,"Generación auxiliar (3)",{"$f":"OFFSET(Balance!C51,0,($O$1-1)*12)","v":0},{"$f":"OFFSET(Balance!D51,0,($O$1-1)*12)","v":0},{"$f":"OFFSET(Balance!E51,0,($O$1-1)*12)","v":0},{"$f":"OFFSET(Balance!F51,0,($O$1-1)*12)","v":0},{"$f":"OFFSET(Balance!G51,0,($O$1-1)*12)","v":0},{"$f":"OFFSET(Balance!H51,0,($O$1-1)*12)","v":0},{"$f":"OFFSET(Balance!I51,0,($O$1-1)*12)","v":0},{"$f":"OFFSET(Balance!J51,0,($O$1-1)*12)","v":0},{"$f":"OFFSET(Balance!K51,0,($O$1-1)*12)","v":0},{"$f":"OFFSET(Balance!L51,0,($O$1-1)*12)","v":"-"},{"$f":"OFFSET(Balance!M51,0,($O$1-1)*12)","v":"-"},{"$f":"OFFSET(Balance!N51,0,($O$1-1)*12)","v":"-"},"-"]
[null,"Régimen ordinario",{"$f":"OFFSET(Balance!C52,0,($O$1-1)*12)","v":"-"},{"$f":"OFFSET(Balance!D52,0,($O$1-1)*12)","v":"-"},{"$f":"OFFSET(Balance!E52,0,($O$1-1)*12)","v":"-"},{"$f":"OFFSET(Balance!F52,0,($O$1-1)*12)","v":"-"},{"$f":"OFFSET(Balance!G52,0,($O$1-1)*12)","v":"-"},{"$f":"OFFSET(Balance!H52,0,($O$1-1)*12)","v":"-"},{"$f":"OFFSET(Balance!I52,0,($O$1-1)*12)","v":"-"},{"$f":"OFFSET(Balance!J52,0,($O$1-1)*12)","v":"-"},{"$f":"OFFSET(Balance!K52,0,($O$1-1)*12)","v":"-"},{"$f":"OFFSET(Balance!L52,0,($O$1-1)*12)","v":"-"},{"$f":"OFFSET(Balance!M52,0,($O$1-1)*12)","v":"-"},{"$f":"OFFSET(Balance!N52,0,($O$1-1)*12)","v":"-"},{"$f":"IF(SUM(C17:N17)=0,\"-\",SUM(C17:N17))","v":"-"}]
[]
[null,"Hidroeólica",{"$f":"OFFSET(Balance!C53,0,($O$1-1)*12)","v":2257.7669999999998},{"$f":"OFFSET(Balance!D53,0,($O$1-1)*12)","v":1754.3050000000001},{"$f":"OFFSET(Balance!E53,0,($O$1-1)*12)","v":1599.5219999999999},{"$f":"OFFSET(Balance!F53,0,($O$1-1)*12)","v":2262.6460000000002},{"$f":"OFFSET(Balance!G53,0,($O$1-1)*12)","v":2034.203},{"$f":"OFFSET(Balance!H53,0,($O$1-1)*12)","v":2321.8040000000001},{"$f":"OFFSET(Balance!I53,0,($O$1-1)*12)","v":3716.2829999999999},{"$f":"OFFSET(Balance!J53,0,($O$1-1)*12)","v":2859.3209999999999},{"$f":"OFFSET(Balance!K53,0,($O$1-1)*12)","v":2165.8609999999999},{"$f":"OFFSET(Balance!L53,0,($O$1-1)*12)","v":"-"},{"$f":"OFFSET(Balance!M53,0,($O$1-1)*12)","v":"-"},{"$f":"OFFSET(Balance!N53,0,($O$1-1)*12)","v":"-"},{"$f":"IF(SUM(C19:N19)=0,\"-\",SUM(C19:N19))","v":20971.712}]
[null,"Hidráulica",{"$f":"OFFSET(Balance!C54,0,($O$1-1)*12)","v":"-"},{"$f":"OFFSET(Balance!D54,0,($O$1-1)*12)","v":"-"},{"$f":"OFFSET(Balance!E54,0,($O$1-1)*12)","v":"-"},{"$f":"OFFSET(Balance!F54,0,($O$1-1)*12)","v":"-"},{"$f":"OFFSET(Balance!G54,0,($O$1-1)*12)","v":"-"},{"$f":"OFFSET(Balance!H54,0,($O$1-1)*12)","v":"-"},{"$f":"OFFSET(Balance!I54,0,($O$1-1)*12)","v":"-"},{"$f":"OFFSET(Balance!J54,0,($O$1-1)*12)","v":"-"},{"$f":"OFFSET(Balance!K54,0,($O$1-1)*12)","v":"-"},{"$f":"OFFSET(Balance!L54,0,($O$1-1)*12)","v":"-"},{"$f":"OFFSET(Balance!M54,0,($O$1-1)*12)","v":"-"},{"$f":"OFFSET(Balance!N54,0,($O$1-1)*12)","v":"-"},{"$f":"IF(SUM(C20:N20)=0,\"-\",SUM(C20:N20))","v":"-"}]
[null,"Eólica",{"$f":"OFFSET(Balance!C55,0,($O$1-1)*12)","v":56908.339},{"$f":"OFFSET(Balance!D55,0,($O$1-1)*12)","v":46207.472000000002},{"$f":"OFFSET(Balance!E55,0,($O$1-1)*12)","v":50497.743999999999},{"$f":"OFFSET(Balance!F55,0,($O$1-1)*12)","v":45548.925000000003},{"$f":"OFFSET(Balance!G55,0,($O$1-1)*12)","v":55351.942000000003},{"$f":"OFFSET(Balance!H55,0,($O$1-1)*12)","v":56421.116999999998},{"$f":"OFFSET(Balance!I55,0,($O$1-1)*12)","v":95148.663},{"$f":"OFFSET(Balance!J55,0,($O$1-1)*12)","v":65077.771999999997},{"$f":"OFFSET(Balance!K55,0,($O$1-1)*12)","v":51688.220999999998},{"$f":"OFFSET(Balance!L55,0,($O$1-1)*12)","v":"-"},{"$f":"OFFSET(Balance!M55,0,($O$1-1)*12)","v":"-"},{"$f":"OFFSET(Balance!N55,0,($O$1-1)*12)","v":"-"},522850.19500000001]
[null,"Solar fotovoltaica",{"$f":"OFFSET(Balance!C56,0,($O$1-1)*12)","v":19063.384999999998},{"$f":"OFFSET(Balance!D56,0,($O$1-1)*12)","v":17866.653999999999},{"$f":"OFFSET(Balance!E56,0,($O$1-1)*12)","v":25080.915000000001},{"$f":"OFFSET(Balance!F56,0,($O$1-1)*12)","v":25190.73},{"$f":"OFFSET(Balance!G56,0,($O$1-1)*12)","v":23051.194},{"$f":"OFFSET(Balance!H56,0,($O$1-1)*12)","v":25992.826000000001},{"$f":"OFFSET(Balance!I56,0,($O$1-1)*12)","v":29624.827000000001},{"$f":"OFFSET(Balance!J56,0,($O$1-1)*12)","v":27841.746999999999},{"$f":"OFFSET(Balance!K56,0,($O$1-1)*12)","v":24190.495999999999},{"$f":"OFFSET(Balance!L56,0,($O$1-1)*12)","v":"-"},{"$f":"OFFSET(Balance!M56,0,($O$1-1)*12)","v":"-"},{"$f":"OFFSET(Balance!N56,0,($O$1-1)*12)","v":"-"},217902.77399999998]
[null,"Otras renovables",{"$f":"OFFSET(Balance!C57,0,($O$1-1)*12)","v":762.423},{"$f":"OFFSET(Balance!D57,0,($O$1-1)*12)","v":646.57299999999998},{"$f":"OFFSET(Balance!E57,0,($O$1-1)*12)","v":837.29399999999998},{"$f":"OFFSET(Balance!F57,0,($O$1-1)*12)","v":538.89700000000005},{"$f":"OFFSET(Balance!G57,0,($O$1-1)*12)","v":750.601},{"$f":"OFFSET(Balance!H57,0,($O$1-1)*12)","v":531.01499999999999},{"$f":"OFFSET(Balance!I57,0,($O$1-1)*12)","v":702.39400000000001},{"$f":"OFFSET(Balance!J57,0,($O$1-1)*12)","v":816.452},{"$f":"OFFSET(Balance!K57,0,($O$1-1)*12)","v":782.90899999999999},{"$f":"OFFSET(Balance!L57,0,($O$1-1)*12)","v":"-"},{"$f":"OFFSET(Balance!M57,0,($O$1-1)*12)","v":"-"},{"$f":"OFFSET(Balance!N57,0,($O$1-1)*12)","v":"-"},6368.558]
[null,"Cogeneración",{"$f":"OFFSET(Balance!C58,0,($O$1-1)*12)","v":"-"},{"$f":"OFFSET(Balance!D58,0,($O$1-1)*12)","v":"-"},{"$f":"OFFSET(Balance!E58,0,($O$1-1)*12)","v":"-"},{"$f":"OFFSET(Balance!F58,0,($O$1-1)*12)","v":"-"},{"$f":"OFFSET(Balance!G58,0,($O$1-1)*12)","v":"-"},{"$f":"OFFSET(Balance!H58,0,($O$1-1)*12)","v":"-"},{"$f":"OFFSET(Balance!I58,0,($O$1-1)*12)","v":"-"},{"$f":"OFFSET(Balance!J58,0,($O$1-1)*12)","v":"-"},{"$f":"OFFSET(Balance!K58,0,($O$1-1)*12)","v":"-"},{"$f":"OFFSET(Balance!L58,0,($O$1-1)*12)","v":"-"},{"$f":"OFFSET(Balance!M58,0,($O$1-1)*12)","v":"-"},{"$f":"OFFSET(Balance!N58,0,($O$1-1)*12)","v":"-"},"-"]
[null,"Régimen especial",{"$f":"OFFSET(Balance!C59,0,($O$1-1)*12)","v":"-"},{"$f":"OFFSET(Balance!D59,0,($O$1-1)*12)","v":"-"},{"$f":"OFFSET(Balance!E59,0,($O$1-1)*12)","v":"-"},{"$f":"OFFSET(Balance!F59,0,($O$1-1)*12)","v":"-"},{"$f":"OFFSET(Balance!G59,0,($O$1-1)*12)","v":"-"},{"$f":"OFFSET(Balance!H59,0,($O$1-1)*12)","v":"-"},{"$f":"OFFSET(Balance!I59,0,($O$1-1)*12)","v":"-"},{"$f":"OFFSET(Balance!J59,0,($O$1-1)*12)","v":"-"},{"$f":"OFFSET(Balance!K59,0,($O$1-1)*12)","v":"-"},{"$f":"OFFSET(Balance!L59,0,($O$1-1)*12)","v":"-"},{"$f":"OFFSET(Balance!M59,0,($O$1-1)*12)","v":"-"},{"$f":"OFFSET(Balance!N59,0,($O$1-1)*12)","v":"-"},{"$f":"SUM(O20:O24)","v":747121.527}]
[null,"Generación",{"$f":"OFFSET(Balance!C60,0,($O$1-1)*12)","v":755277.85100000002},{"$f":"OFFSET(Balance!D60,0,($O$1-1)*12)","v":682405.33299999998},{"$f":"OFFSET(Balance!E60,0,($O$1-1)*12)","v":729844.59699999995},{"$f":"OFFSET(Balance!F60,0,($O$1-1)*12)","v":703198.87199999997},{"$f":"OFFSET(Balance!G60,0,($O$1-1)*12)","v":715907.03},{"$f":"OFFSET(Balance!H60,0,($O$1-1)*12)","v":707412.23800000001},{"$f":"OFFSET(Balance!I60,0,($O$1-1)*12)","v":759211.451},{"$f":"OFFSET(Balance!J60,0,($O$1-1)*12)","v":782538.66700000002},{"$f":"OFFSET(Balance!K60,0,($O$1-1)*12)","v":764826.68299999996},{"$f":"OFFSET(Balance!L60,0,($O$1-1)*12)","v":"-"},{"$f":"OFFSET(Balance!M60,0,($O$1-1)*12)","v":"-"},{"$f":"OFFSET(Balance!N60,0,($O$1-1)*12)","v":"-"},6600622.722000001]
[null,"Demanda transporte (b.c.)",{"$f":"OFFSET(Balance!C61,0,($O$1-1)*12)","v":755277.85100000002},{"$f":"OFFSET(Balance!D61,0,($O$1-1)*12)","v":682405.33299999998},{"$f":"OFFSET(Balance!E61,0,($O$1-1)*12)","v":729844.59699999995},{"$f":"OFFSET(Balance!F61,0,($O$1-1)*12)","v":703198.87199999997},{"$f":"OFFSET(Balance!G61,0,($O$1-1)*12)","v":715907.03},{"$f":"OFFSET(Balance!H61,0,($O$1-1)*12)","v":707412.23800000001},{"$f":"OFFSET(Balance!I61,0,($O$1-1)*12)","v":759211.451},{"$f":"OFFSET(Balance!J61,0,($O$1-1)*12)","v":782538.66700000002},{"$f":"OFFSET(Balance!K61,0,($O$1-1)*12)","v":764826.68299999996},{"$f":"OFFSET(Balance!L61,0,($O$1-1)*12)","v":"-"},{"$f":"OFFSET(Balance!M61,0,($O$1-1)*12)","v":"-"},{"$f":"OFFSET(Balance!N61,0,($O$1-1)*12)","v":"-"},6600622.722000001]
[null,"(1) Asignación de unidades de producción según combustible principal."]
[null,"(2) Utiliza fue y gasoil como combustible principal. Incluye funcionamiento en ciclo abierto."]
[null,"(3) Grupos de emergencia que se instalan de forma transitoria en determinadas zonas para cubrir un déficit de generación."]
[null,"(4) Incluye todas aquellas unidades menores de 50 MW que no pertenecen a ninguna unidad de gestión hidráulica (UGH)."]
[null,{"$f":"'Balance nacional mensual'!B38","v":"Datos definitivos hasta el 31/03/2017. Datos provisionales del 01/04/2017 al 31/08/2018. Datos programados del 01/09/2018 al 30/09/2018."}]

{"sheet":"Balance Canarias anual","index":8,"n_rows":33,"n_cols":10,"rows_kept":33,"cut":false,"hidden":false,"merged":[[27,1,27,11],[28,1,28,11],[29,1,29,11],[30,1,30,11]]}
[null,null,null,null,null,null,null,null,null,2]
[]
[]
[null,null,null,null,null,null,null,null,"Sistema eléctrico"]
[null,null,null,null,null,null,null,null,"Horizonte temporal"]
[null,null,null,null,null,null,null,null,"Periodo"]
[]
[null,null,{"$f":"OFFSET(Balance!C149,0,($J$1-1)*8)","v":2014},{"$f":"OFFSET(Balance!D149,0,($J$1-1)*8)","v":2015},{"$f":"OFFSET(Balance!E149,0,($J$1-1)*8)","v":2016},{"$f":"OFFSET(Balance!F149,0,($J$1-1)*8)","v":2017},{"$f":"OFFSET(Balance!G149,0,($J$1-1)*8)","v":2018},{"$f":"OFFSET(Balance!H149,0,($J$1-1)*8)","v":2019},{"$f":"OFFSET(Balance!I149,0,($J$1-1)*8)","v":2020},{"$f":"OFFSET(Balance!J149,0,($J$1-1)*8)","v":2021}]
[]
[null,"Hidráulica",{"$f":"OFFSET(Balance!C150,0,($J$1-1)*8)","v":3461.0559999999996},{"$f":"OFFSET(Balance!D150,0,($J$1-1)*8)","v":3568.393},{"$f":"OFFSET(Balance!E150,0,($J$1-1)*8)","v":3453.9609999999993},{"$f":"OFFSET(Balance!F150,0,($J$1-1)*8)","v":3271.9790000000003},{"$f":"OFFSET(Balance!G150,0,($J$1-1)*8)","v":2393.7060000000001},{"$f":"OFFSET(Balance!H150,0,($J$1-1)*8)","v":"-"},{"$f":"OFFSET(Balance!I150,0,($J$1-1)*8)","v":"-"},{"$f":"OFFSET(Balance!J150,0,($J$1-1)*8)","v":"-"}]
[null,"Motores diesel",{"$f":"OFFSET(Balance!C151,0,($J$1-1)*8)","v":2138198.4350000001},{"$f":"OFFSET(Balance!D151,0,($J$1-1)*8)","v":2202337.5219999999},{"$f":"OFFSET(Balance!E151,0,($J$1-1)*8)","v":2222301.5430000005},{"$f":"OFFSET(Balance!F151,0,($J$1-1)*8)","v":2242328.7749999999},{"$f":"OFFSET(Balance!G151,0,($J$1-1)*8)","v":1589981.4339999999},{"$f":"OFFSET(Balance!H151,0,($J$1-1)*8)","v":"-"},{"$f":"OFFSET(Balance!I151,0,($J$1-1)*8)","v":"-"},{"$f":"OFFSET(Balance!J151,0,($J$1-1)*8)","v":"-"}]
[null,"Turbina de gas",{"$f":"OFFSET(Balance!C152,0,($J$1-1)*8)","v":360744.29499999998},{"$f":"OFFSET(Balance!D152,0,($J$1-1)*8)","v":327805.27100000001},{"$f":"OFFSET(Balance!E152,0,($J$1-1)*8)","v":275900.62400000001},{"$f":"OFFSET(Balance!F152,0,($J$1-1)*8)","v":314281.59499999997},{"$f":"OFFSET(Balance!G152,0,($J$1-1)*8)","v":214646.07099999997},{"$f":"OFFSET(Balance!H152,0,($J$1-1)*8)","v":"-"},{"$f":"OFFSET(Balance!I152,0,($J$1-1)*8)","v":"-"},{"$f":"OFFSET(Balance!J152,0,($J$1-1)*8)","v":"-"}]
[null,"Turbina de vapor",{"$f":"OFFSET(Balance!C153,0,($J$1-1)*8)","v":2070771.4279999998},{"$f":"OFFSET(Balance!D153,0,($J$1-1)*8)","v":2222950.5670000003},{"$f":"OFFSET(Balance!E153,0,($J$1-1)*8)","v":2536143.003},{"$f":"OFFSET(Balance!F153,0,($J$1-1)*8)","v":2674344.3740000003},{"$f":"OFFSET(Balance!G153,0,($J$1-1)*8)","v":1822238.6639999999},{"$f":"OFFSET(Balance!H153,0,($J$1-1)*8)","v":"-"},{"$f":"OFFSET(Balance!I153,0,($J$1-1)*8)","v":"-"},{"$f":"OFFSET(Balance!J153,0,($J$1-1)*8)","v":"-"}]
[null,"Fuel + Gas",{"$f":"OFFSET(Balance!C154,0,($J$1-1)*8)","v":4569714.1579999998},{"$f":"OFFSET(Balance!D154,0,($J$1-1)*8)","v":4753094.3599999994},{"$f":"OFFSET(Balance!E154,0,($J$1-1)*8)","v":5034345.17},{"$f":"OFFSET(Balance!F154,0,($J$1-1)*8)","v":5230954.743999999},{"$f":"OFFSET(Balance!G154,0,($J$1-1)*8)","v":3626866.1690000002},{"$f":"OFFSET(Balance!H154,0,($J$1-1)*8)","v":"-"},{"$f":"OFFSET(Balance!I154,0,($J$1-1)*8)","v":"-"},{"$f":"OFFSET(Balance!J154,0,($J$1-1)*8)","v":"-"}]
[null,"Ciclo combinado (2)",{"$f":"OFFSET(Balance!C155,0,($J$1-1)*8)","v":3240591.696},{"$f":"OFFSET(Balance!D155,0,($J$1-1)*8)","v":3188056.7890000003},{"$f":"OFFSET(Balance!E155,0,($J$1-1)*8)","v":3008333.7410000004},{"$f":"OFFSET(Balance!F155,0,($J$1-1)*8)","v":2997377.2830000003},{"$f":"OFFSET(Balance!G155,0,($J$1-1)*8)","v":2203269.6079999995},{"$f":"OFFSET(Balance!H155,0,($J$1-1)*8)","v":"-"},{"$f":"OFFSET(Balance!I155,0,($J$1-1)*8)","v":"-"},{"$f":"OFFSET(Balance!J155,0,($J$1-1)*8)","v":"-"}]
[null,"Generación auxiliar (3)",{"$f":"OFFSET(Balance!C156,0,($J$1-1)*8)","v":0},{"$f":"OFFSET(Balance!D156,0,($J$1-1)*8)","v":0},{"$f":"OFFSET(Balance!E156,0,($J$1-1)*8)","v":0},{"$f":"OFFSET(Balance!F156,0,($J$1-1)*8)","v":0},{"$f":"OFFSET(Balance!G156,0,($J$1-1)*8)","v":0},{"$f":"OFFSET(Balance!H156,0,($J$1-1)*8)","v":"-"},{"$f":"OFFSET(Balance!I156,0,($J$1-1)*8)","v":"-"},{"$f":"OFFSET(Balance!J156,0,($J$1-1)*8)","v":"-"}]
[null,"Régimen ordinario",{"$f":"OFFSET(Balance!C157,0,($J$1-1)*8)","v":" "},{"$f":"OFFSET(Balance!D157,0,($J$1-1)*8)","v":" "},{"$f":"OFFSET(Balance!E157,0,($J$1-1)*8)","v":" "},{"$f":"OFFSET(Balance!F157,0,($J$1-1)*8)","v":" "},{"$f":"OFFSET(Balance!G157,0,($J$1-1)*8)","v":" "},{"$f":"OFFSET(Balance!H157,0,($J$1-1)*8)","v":" "},{"$f":"OFFSET(Balance!I157,0,($J$1-1)*8)","v":" "},{"$f":"OFFSET(Balance!J157,0,($J$1-1)*8)","v":" "}]
[]
[null,"Hidroeólica",{"$f":"OFFSET(Balance!C158,0,($J$1-1)*8)","v":728.83699999999999},{"$f":"OFFSET(Balance!D158,0,($J$1-1)*8)","v":8207.4240000000009},{"$f":"OFFSET(Balance!E158,0,($J$1-1)*8)","v":17891.935999999998},{"$f":"OFFSET(Balance!F158,0,($J$1-1)*8)","v":20233.057000000001},{"$f":"OFFSET(Balance!G158,0,($J$1-1)*8)","v":20971.712},{"$f":"OFFSET(Balance!H158,0,($J$1-1)*8)","v":"-"},{"$f":"OFFSET(Balance!I158,0,($J$1-1)*8)","v":"-"},{"$f":"OFFSET(Balance!J158,0,($J$1-1)*8)","v":"-"}]
[null,"Resto hidráulica (4)",{"$f":"OFFSET(Balance!C159,0,($J$1-1)*8)","v":" "},{"$f":"OFFSET(Balance!D159,0,($J$1-1)*8)","v":" "},{"$f":"OFFSET(Balance!E159,0,($J$1-1)*8)","v":" "},{"$f":"OFFSET(Balance!F159,0,($J$1-1)*8)","v":" "},{"$f":"OFFSET(Balance!G159,0,($J$1-1)*8)","v":" "},{"$f":"OFFSET(Balance!H159,0,($J$1-1)*8)","v":" "},{"$f":"OFFSET(Balance!I159,0,($J$1-1)*8)","v":" "},{"$f":"OFFSET(Balance!J159,0,($J$1-1)*8)","v":" "}]
[null,"Eólica",{"$f":"OFFSET(Balance!C160,0,($J$1-1)*8)","v":389528.80599999998},{"$f":"OFFSET(Balance!D160,0,($J$1-1)*8)","v":396687.14299999998},{"$f":"OFFSET(Balance!E160,0,($J$1-1)*8)","v":393080.58299999998},{"$f":"OFFSET(Balance!F160,0,($J$1-1)*8)","v":395927.34799999994},{"$f":"OFFSET(Balance!G160,0,($J$1-1)*8)","v":522850.19500000001},{"$f":"OFFSET(Balance!H160,0,($J$1-1)*8)","v":"-"},{"$f":"OFFSET(Balance!I160,0,($J$1-1)*8)","v":"-"},{"$f":"OFFSET(Balance!J160,0,($J$1-1)*8)","v":"-"}]
[null,"Solar fotovoltaica",{"$f":"OFFSET(Balance!C161,0,($J$1-1)*8)","v":282285.68899999995},{"$f":"OFFSET(Balance!D161,0,($J$1-1)*8)","v":275546.60499999998},{"$f":"OFFSET(Balance!E161,0,($J$1-1)*8)","v":277661.34299999999},{"$f":"OFFSET(Balance!F161,0,($J$1-1)*8)","v":273622.21100000001},{"$f":"OFFSET(Balance!G161,0,($J$1-1)*8)","v":217902.77399999998},{"$f":"OFFSET(Balance!H161,0,($J$1-1)*8)","v":"-"},{"$f":"OFFSET(Balance!I161,0,($J$1-1)*8)","v":"-"},{"$f":"OFFSET(Balance!J161,0,($J$1-1)*8)","v":"-"}]
[null,"Térmica renovable/Otras renovables",{"$f":"OFFSET(Balance!C162,0,($J$1-1)*8)","v":8806.5839999999989},{"$f":"OFFSET(Balance!D162,0,($J$1-1)*8)","v":8053.625},{"$f":"OFFSET(Balance!E162,0,($J$1-1)*8)","v":9335.7749999999996},{"$f":"OFFSET(Balance!F162,0,($J$1-1)*8)","v":9565.259},{"$f":"OFFSET(Balance!G162,0,($J$1-1)*8)","v":6368.558},{"$f":"OFFSET(Balance!H162,0,($J$1-1)*8)","v":"-"},{"$f":"OFFSET(Balance!I162,0,($J$1-1)*8)","v":"-"},{"$f":"OFFSET(Balance!J162,0,($J$1-1)*8)","v":"-"}]
[null,"Cogeneración",{"$f":"OFFSET(Balance!C163,0,($J$1-1)*8)","v":0},{"$f":"OFFSET(Balance!D163,0,($J$1-1)*8)","v":0},{"$f":"OFFSET(Balance!E163,0,($J$1-1)*8)","v":0},{"$f":"OFFSET(Balance!F163,0,($J$1-1)*8)","v":0},{"$f":"OFFSET(Balance!G163,0,($J$1-1)*8)","v":0},{"$f":"OFFSET(Balance!H163,0,($J$1-1)*8)","v":"-"},{"$f":"OFFSET(Balance!I163,0,($J$1-1)*8)","v":"-"},{"$f":"OFFSET(Balance!J163,0,($J$1-1)*8)","v":"-"}]
[null,"Régimen especial",{"$f":"OFFSET(Balance!C164,0,($J$1-1)*8)","v":" "},{"$f":"OFFSET(Balance!D164,0,($J$1-1)*8)","v":" "},{"$f":"OFFSET(Balance!E164,0,($J$1-1)*8)","v":" "},{"$f":"OFFSET(Balance!F164,0,($J$1-1)*8)","v":" "},{"$f":"OFFSET(Balance!G164,0,($J$1-1)*8)","v":" "},{"$f":"OFFSET(Balance!H164,0,($J$1-1)*8)","v":" "},{"$f":"OFFSET(Balance!I164,0,($J$1-1)*8)","v":" "},{"$f":"OFFSET(Balance!J164,0,($J$1-1)*8)","v":" "}]
[null,"Generación",{"$f":"OFFSET(Balance!C165,0,($J$1-1)*8)","v":8495116.8259999994},{"$f":"OFFSET(Balance!D165,0,($J$1-1)*8)","v":8633213.3389999997},{"$f":"OFFSET(Balance!E165,0,($J$1-1)*8)","v":8744102.5089999996},{"$f":"OFFSET(Balance!F165,0,($J$1-1)*8)","v":8930951.8809999991},{"$f":"OFFSET(Balance!G165,0,($J$1-1)*8)","v":6600622.722000001},{"$f":"OFFSET(Balance!H165,0,($J$1-1)*8)","v":"-"},{"$f":"OFFSET(Balance!I165,0,($J$1-1)*8)","v":"-"},{"$f":"OFFSET(Balance!J165,0,($J$1-1)*8)","v":"-"}]
[null,"Demanda transporte (b.c.)",{"$f":"OFFSET(Balance!C166,0,($J$1-1)*8)","v":8495116.8259999994},{"$f":"OFFSET(Balance!D166,0,($J$1-1)*8)","v":8633213.3389999997},{"$f":"OFFSET(Balance!E166,0,($J$1-1)*8)","v":8744102.5089999996},{"$f":"OFFSET(Balance!F166,0,($J$1-1)*8)","v":8930951.8809999991},{"$f":"OFFSET(Balance!G166,0,($J$1-1)*8)","v":6600622.722000001},{"$f":"OFFSET(Balance!H166,0,($J$1-1)*8)","v":"-"},{"$f":"OFFSET(Balance!I166,0,($J$1-1)*8)","v":"-"},{"$f":"OFFSET(Balance!J166,0,($J$1-1)*8)","v":"-"}]
[null,"(1) Asignación de unidades de producción según combustible principal."]
[null,"(2) Utiliza fue y gasoil como combustible principal. Incluye funcionamiento en ciclo abierto."]
[null,"(3) Grupos de emergencia que se instalan de forma transitoria en determinadas zonas para cubrir un déficit de generación."]
[null,"(4) Incluye todas aquellas unidades menores de 50 MW que no pertenecen a ninguna unidad de gestión hidráulica (UGH)."]
[null,{"$f":"IF(MONTH(FACT)=1,\"\",CONCATENATE(\"Para el año \",YEAR(FACT), \" valores acumulados hasta \",TEXT(FACT-30,\"mmmm\"),\" de \",YEAR(FACT),\".\"))","v":"Para el año 2018 valores acumulados hasta septiembre de 2018."}]
[null,{"$f":"'Balance nacional mensual'!B38","v":"Datos definitivos hasta el 31/03/2017. Datos provisionales del 01/04/2017 al 31/08/2018. Datos programados del 01/09/2018 al 30/09/2018."}]

{"sheet":"Balance Ceuta mensual","index":9,"n_rows":18,"n_cols":15,"rows_kept":18,"cut":false,"hidden":false,"merged":[[16,1,16,14],[17,1,17,14]]}
[null,null,null,null,null,null,null,null,null,null,null,null,null,null,12]
[]
[]
[null,null,null,null,null,null,null,null,null,null,null,null,"Sistema eléctrico"]
[null,null,null,null,null,null,null,null,null,null,null,null,"Horizonte temporal"]
[null,null,null,null,null,null,null,null,null,null,null,null,"Periodo"]
[]
[null,null,"Ene.","Feb.","Mar.","Abr.","May.","Jun.","Jul.","Ago.","Sep.","Oct.","Nov.","Dic.",{"$f":"OFFSET(Año!C19,($O$1-1),0)","v":2018}]
[]
[null,"Motores diesel",{"$f":"OFFSET(Balance!C64,0,($O$1-1)*12)","v":18543.508000000002},{"$f":"OFFSET(Balance!D64,0,($O$1-1)*12)","v":17093.705999999998},{"$f":"OFFSET(Balance!E64,0,($O$1-1)*12)","v":17581.858},{"$f":"OFFSET(Balance!F64,0,($O$1-1)*12)","v":16315.112999999999},{"$f":"OFFSET(Balance!G64,0,($O$1-1)*12)","v":16335.308999999999},{"$f":"OFFSET(Balance!H64,0,($O$1-1)*12)","v":15983.209000000001},{"$f":"OFFSET(Balance!I64,0,($O$1-1)*12)","v":17163.687000000002},{"$f":"OFFSET(Balance!J64,0,($O$1-1)*12)","v":17711.165000000001},{"$f":"OFFSET(Balance!K64,0,($O$1-1)*12)","v":18071.241999999998},{"$f":"OFFSET(Balance!L64,0,($O$1-1)*12)","v":"-"},{"$f":"OFFSET(Balance!M64,0,($O$1-1)*12)","v":"-"},{"$f":"OFFSET(Balance!N64,0,($O$1-1)*12)","v":"-"},{"$f":"IF(SUM(C10:N10)=0,\"-\",SUM(C10:N10))","v":154798.79699999999}]
[null,"Turbina de gas",{"$f":"OFFSET(Balance!C65,0,($O$1-1)*12)","v":0.55300000000000005},{"$f":"OFFSET(Balance!D65,0,($O$1-1)*12)","v":5.36},{"$f":"OFFSET(Balance!E65,0,($O$1-1)*12)","v":3.1160000000000001},{"$f":"OFFSET(Balance!F65,0,($O$1-1)*12)","v":0.55300000000000005},{"$f":"OFFSET(Balance!G65,0,($O$1-1)*12)","v":7.5940000000000003},{"$f":"OFFSET(Balance!H65,0,($O$1-1)*12)","v":0.51800000000000002},{"$f":"OFFSET(Balance!I65,0,($O$1-1)*12)","v":0.90400000000000003},{"$f":"OFFSET(Balance!J65,0,($O$1-1)*12)","v":0.59899999999999998},{"$f":"OFFSET(Balance!K65,0,($O$1-1)*12)","v":4.1950000000000003},{"$f":"OFFSET(Balance!L65,0,($O$1-1)*12)","v":"-"},{"$f":"OFFSET(Balance!M65,0,($O$1-1)*12)","v":"-"},{"$f":"OFFSET(Balance!N65,0,($O$1-1)*12)","v":"-"},23.392000000000003]
[null,"Fuel + Gas",{"$f":"OFFSET(Balance!C66,0,($O$1-1)*12)","v":18544.061000000002},{"$f":"OFFSET(Balance!D66,0,($O$1-1)*12)","v":17099.065999999999},{"$f":"OFFSET(Balance!E66,0,($O$1-1)*12)","v":17584.974000000002},{"$f":"OFFSET(Balance!F66,0,($O$1-1)*12)","v":16315.665999999999},{"$f":"OFFSET(Balance!G66,0,($O$1-1)*12)","v":16342.902999999998},{"$f":"OFFSET(Balance!H66,0,($O$1-1)*12)","v":15983.727000000001},{"$f":"OFFSET(Balance!I66,0,($O$1-1)*12)","v":17164.591},{"$f":"OFFSET(Balance!J66,0,($O$1-1)*12)","v":17711.763999999999},{"$f":"OFFSET(Balance!K66,0,($O$1-1)*12)","v":18075.436999999998},{"$f":"OFFSET(Balance!L66,0,($O$1-1)*12)","v":"-"},{"$f":"OFFSET(Balance!M66,0,($O$1-1)*12)","v":"-"},{"$f":"OFFSET(Balance!N66,0,($O$1-1)*12)","v":"-"},{"$f":"SUM(O10:O11)","v":154822.18899999998}]
[null,"Régimen ordinario",{"$f":"OFFSET(Balance!C67,0,($O$1-1)*12)","v":"-"},{"$f":"OFFSET(Balance!D67,0,($O$1-1)*12)","v":"-"},{"$f":"OFFSET(Balance!E67,0,($O$1-1)*12)","v":"-"},{"$f":"OFFSET(Balance!F67,0,($O$1-1)*12)","v":"-"},{"$f":"OFFSET(Balance!G67,0,($O$1-1)*12)","v":"-"},{"$f":"OFFSET(Balance!H67,0,($O$1-1)*12)","v":"-"},{"$f":"OFFSET(Balance!I67,0,($O$1-1)*12)","v":"-"},{"$f":"OFFSET(Balance!J67,0,($O$1-1)*12)","v":"-"},{"$f":"OFFSET(Balance!K67,0,($O$1-1)*12)","v":"-"},{"$f":"OFFSET(Balance!L67,0,($O$1-1)*12)","v":"-"},{"$f":"OFFSET(Balance!M67,0,($O$1-1)*12)","v":"-"},{"$f":"OFFSET(Balance!N67,0,($O$1-1)*12)","v":"-"},{"$f":"SUM(O12)","v":154822.18899999998}]
[]
[null,"Generación",{"$f":"OFFSET(Balance!C68,0,($O$1-1)*12)","v":18544.061000000002},{"$f":"OFFSET(Balance!D68,0,($O$1-1)*12)","v":17099.065999999999},{"$f":"OFFSET(Balance!E68,0,($O$1-1)*12)","v":17584.973999999998},{"$f":"OFFSET(Balance!F68,0,($O$1-1)*12)","v":16315.665999999999},{"$f":"OFFSET(Balance!G68,0,($O$1-1)*12)","v":16342.903},{"$f":"OFFSET(Balance!H68,0,($O$1-1)*12)","v":15983.727000000001},{"$f":"OFFSET(Balance!I68,0,($O$1-1)*12)","v":17164.591},{"$f":"OFFSET(Balance!J68,0,($O$1-1)*12)","v":17711.763999999999},{"$f":"OFFSET(Balance!K68,0,($O$1-1)*12)","v":18075.437000000002},{"$f":"OFFSET(Balance!L68,0,($O$1-1)*12)","v":"-"},{"$f":"OFFSET(Balance!M68,0,($O$1-1)*12)","v":"-"},{"$f":"OFFSET(Balance!N68,0,($O$1-1)*12)","v":"-"},{"$f":"SUM(O13:O14)","v":154822.18899999998}]
[null,"Demanda transporte (b.c.)",{"$f":"OFFSET(Balance!C69,0,($O$1-1)*12)","v":18544.061000000002},{"$f":"OFFSET(Balance!D69,0,($O$1-1)*12)","v":17099.065999999999},{"$f":"OFFSET(Balance!E69,0,($O$1-1)*12)","v":17584.973999999998},{"$f":"OFFSET(Balance!F69,0,($O$1-1)*12)","v":16315.665999999999},{"$f":"OFFSET(Balance!G69,0,($O$1-1)*12)","v":16342.903},{"$f":"OFFSET(Balance!H69,0,($O$1-1)*12)","v":15983.727000000001},{"$f":"OFFSET(Balance!I69,0,($O$1-1)*12)","v":17164.591},{"$f":"OFFSET(Balance!J69,0,($O$1-1)*12)","v":17711.763999999999},{"$f":"OFFSET(Balance!K69,0,($O$1-1)*12)","v":18075.437000000002},{"$f":"OFFSET(Balance!L69,0,($O$1-1)*12)","v":"-"},{"$f":"OFFSET(Balance!M69,0,($O$1-1)*12)","v":"-"},{"$f":"OFFSET(Balance!N69,0,($O$1-1)*12)","v":"-"},{"$f":"O15","v":154822.18899999998}]
[null,"(1) Asignación de unidades de producción según combustible principal."]
[null,{"$f":"CONCATENATE(\"Datos definitivos hasta el \",RIGHT('Balance nacional mensual'!B38,59))","v":"Datos definitivos hasta el 31/08/2018. Datos programados del 01/09/2018 al 30/09/2018."}]

{"sheet":"Balance Ceuta anual","index":10,"n_rows":19,"n_cols":9,"rows_kept":19,"cut":false,"hidden":false,"merged":[[16,1,16,11],[28,1,28,14]]}
[null,null,null,null,null,null,null,null,2]
[]
[]
[null,null,null,null,null,null,null,"Sistema eléctrico"]
[null,null,null,null,null,null,null,"Horizonte temporal"]
[null,null,null,null,null,null,null,"Periodo"]
[]
[null,null,{"$f":"OFFSET(Balance!C168,0,($I$1-1)*7)","v":2014},{"$f":"OFFSET(Balance!D168,0,($I$1-1)*7)","v":2015},{"$f":"OFFSET(Balance!E168,0,($I$1-1)*7)","v":2016},{"$f":"OFFSET(Balance!F168,0,($I$1-1)*7)","v":2017},{"$f":"OFFSET(Balance!G168,0,($I$1-1)*7)","v":2018},{"$f":"OFFSET(Balance!H168,0,($I$1-1)*7)","v":2019},{"$f":"OFFSET(Balance!I168,0,($I$1-1)*7)","v":2020}]
[]
[null,"Motores diesel",{"$f":"OFFSET(Balance!C169,0,($I$1-1)*7)","v":212152.62499999997},{"$f":"OFFSET(Balance!D169,0,($I$1-1)*7)","v":203257.30900000001},{"$f":"OFFSET(Balance!E169,0,($I$1-1)*7)","v":210557.99200000003},{"$f":"OFFSET(Balance!F169,0,($I$1-1)*7)","v":202648.20499999996},{"$f":"OFFSET(Balance!G169,0,($I$1-1)*7)","v":154798.79699999999},{"$f":"OFFSET(Balance!H169,0,($I$1-1)*7)","v":"-"},{"$f":"OFFSET(Balance!I169,0,($I$1-1)*7)","v":"-"}]
[null,"Turbina de gas",{"$f":"OFFSET(Balance!C170,0,($I$1-1)*7)","v":92.531999999999996},{"$f":"OFFSET(Balance!D170,0,($I$1-1)*7)","v":765.78100000000006},{"$f":"OFFSET(Balance!E170,0,($I$1-1)*7)","v":122.944},{"$f":"OFFSET(Balance!F170,0,($I$1-1)*7)","v":212.49499999999998},{"$f":"OFFSET(Balance!G170,0,($I$1-1)*7)","v":23.392000000000003},{"$f":"OFFSET(Balance!H170,0,($I$1-1)*7)","v":"-"},{"$f":"OFFSET(Balance!I170,0,($I$1-1)*7)","v":"-"}]
[null,"Fuel + Gas",{"$f":"OFFSET(Balance!C171,0,($I$1-1)*7)","v":212245.15699999998},{"$f":"OFFSET(Balance!D171,0,($I$1-1)*7)","v":204023.09},{"$f":"OFFSET(Balance!E171,0,($I$1-1)*7)","v":210680.93600000005},{"$f":"OFFSET(Balance!F171,0,($I$1-1)*7)","v":202860.69999999998},{"$f":"OFFSET(Balance!G171,0,($I$1-1)*7)","v":154822.18900000001},{"$f":"OFFSET(Balance!H171,0,($I$1-1)*7)","v":"-"},{"$f":"OFFSET(Balance!I171,0,($I$1-1)*7)","v":"-"}]
[null,"Régimen ordinario",{"$f":"OFFSET(Balance!C172,0,($I$1-1)*7)","v":" "},{"$f":"OFFSET(Balance!D172,0,($I$1-1)*7)","v":" "},{"$f":"OFFSET(Balance!E172,0,($I$1-1)*7)","v":" "},{"$f":"OFFSET(Balance!F172,0,($I$1-1)*7)","v":" "},{"$f":"OFFSET(Balance!G172,0,($I$1-1)*7)","v":" "},{"$f":"OFFSET(Balance!H172,0,($I$1-1)*7)","v":" "},{"$f":"OFFSET(Balance!I172,0,($I$1-1)*7)","v":" "}]
[]
[null,"Generación",{"$f":"OFFSET(Balance!C173,0,($I$1-1)*7)","v":212245.15700000001},{"$f":"OFFSET(Balance!D173,0,($I$1-1)*7)","v":204023.09},{"$f":"OFFSET(Balance!E173,0,($I$1-1)*7)","v":210680.93600000005},{"$f":"OFFSET(Balance!F173,0,($I$1-1)*7)","v":202860.69999999998},{"$f":"OFFSET(Balance!G173,0,($I$1-1)*7)","v":154822.18900000001},{"$f":"OFFSET(Balance!H173,0,($I$1-1)*7)","v":"-"},{"$f":"OFFSET(Balance!I173,0,($I$1-1)*7)","v":"-"}]
[null,"Demanda transporte (b.c.)",{"$f":"OFFSET(Balance!C174,0,($I$1-1)*7)","v":212245.15700000001},{"$f":"OFFSET(Balance!D174,0,($I$1-1)*7)","v":204023.09},{"$f":"OFFSET(Balance!E174,0,($I$1-1)*7)","v":210680.93600000005},{"$f":"OFFSET(Balance!F174,0,($I$1-1)*7)","v":202860.69999999998},{"$f":"OFFSET(Balance!G174,0,($I$1-1)*7)","v":154822.18900000001},{"$f":"OFFSET(Balance!H174,0,($I$1-1)*7)","v":"-"},{"$f":"OFFSET(Balance!I174,0,($I$1-1)*7)","v":"-"}]
[null,"(1) Asignación de unidades de producción según combustible principal."]
[null,{"$f":"IF(MONTH(FACT)=1,\"\",CONCATENATE(\"Para el año \",YEAR(FACT), \" valores acumulados hasta \",TEXT(FACT-30,\"mmmm\"),\" de \",YEAR(FACT),\".\"))","v":"Para el año 2018 valores acumulados hasta septiembre de 2018."}]
[null,{"$f":"'Balance Ceuta mensual'!B18:O18","v":"Datos definitivos hasta el 31/08/2018. Datos programados del 01/09/2018 al 30/09/2018."}]

{"sheet":"Balance Melilla mensual","index":11,"n_rows":23,"n_cols":15,"rows_kept":23,"cut":false,"hidden":false,"merged":[[21,1,21,14],[22,1,22,14]]}
[null,null,null,null,null,null,null,null,null,null,null,null,null,null,12]
[]
[]
[null,null,null,null,null,null,null,null,null,null,null,null,"Sistema eléctrico"]
[null,null,null,null,null,null,null,null,null,null,null,null,"Horizonte temporal"]
[null,null,null,null,null,null,null,null,null,null,null,null,"Periodo"]
[]
[null,null,"Ene.","Feb.","Mar.","Abr.","May.","Jun.","Jul.","Ago.","Sep.","Oct.","Nov.","Dic.",{"$f":"OFFSET(Año!C19,($O$1-1),0)","v":2018}]
[]
[null,"Motores diesel",{"$f":"OFFSET(Balance!C72,0,($O$1-1)*12)","v":17095.319},{"$f":"OFFSET(Balance!D72,0,($O$1-1)*12)","v":16046.134},{"$f":"OFFSET(Balance!E72,0,($O$1-1)*12)","v":15645.465},{"$f":"OFFSET(Balance!F72,0,($O$1-1)*12)","v":14934.573},{"$f":"OFFSET(Balance!G72,0,($O$1-1)*12)","v":15540.776},{"$f":"OFFSET(Balance!H72,0,($O$1-1)*12)","v":16168.516},{"$f":"OFFSET(Balance!I72,0,($O$1-1)*12)","v":18176.227999999999},{"$f":"OFFSET(Balance!J72,0,($O$1-1)*12)","v":20469.173999999999},{"$f":"OFFSET(Balance!K72,0,($O$1-1)*12)","v":18564.09},{"$f":"OFFSET(Balance!L72,0,($O$1-1)*12)","v":"-"},{"$f":"OFFSET(Balance!M72,0,($O$1-1)*12)","v":"-"},{"$f":"OFFSET(Balance!N72,0,($O$1-1)*12)","v":"-"},{"$f":"IF(SUM(C10:N10)=0,\"-\",SUM(C10:N10))","v":152640.27499999999}]
[null,"Turbina de gas",{"$f":"OFFSET(Balance!C73,0,($O$1-1)*12)","v":44.298000000000002},{"$f":"OFFSET(Balance!D73,0,($O$1-1)*12)","v":8.6690000000000005},{"$f":"OFFSET(Balance!E73,0,($O$1-1)*12)","v":0.496},{"$f":"OFFSET(Balance!F73,0,($O$1-1)*12)","v":0.57899999999999996},{"$f":"OFFSET(Balance!G73,0,($O$1-1)*12)","v":0.55100000000000005},{"$f":"OFFSET(Balance!H73,0,($O$1-1)*12)","v":1.2370000000000001},{"$f":"OFFSET(Balance!I73,0,($O$1-1)*12)","v":9.2759999999999998},{"$f":"OFFSET(Balance!J73,0,($O$1-1)*12)","v":0.94},{"$f":"OFFSET(Balance!K73,0,($O$1-1)*12)","v":0.34499999999999997},{"$f":"OFFSET(Balance!L73,0,($O$1-1)*12)","v":"-"},{"$f":"OFFSET(Balance!M73,0,($O$1-1)*12)","v":"-"},{"$f":"OFFSET(Balance!N73,0,($O$1-1)*12)","v":"-"},{"$f":"IF(SUM(C11:N11)=0,\"-\",SUM(C11:N11))","v":66.391000000000005}]
[null,"Fuel + Gas",{"$f":"OFFSET(Balance!C74,0,($O$1-1)*12)","v":17139.616999999998},{"$f":"OFFSET(Balance!D74,0,($O$1-1)*12)","v":16054.803},{"$f":"OFFSET(Balance!E74,0,($O$1-1)*12)","v":15645.960999999999},{"$f":"OFFSET(Balance!F74,0,($O$1-1)*12)","v":14935.152},{"$f":"OFFSET(Balance!G74,0,($O$1-1)*12)","v":15541.326999999999},{"$f":"OFFSET(Balance!H74,0,($O$1-1)*12)","v":16169.752999999999},{"$f":"OFFSET(Balance!I74,0,($O$1-1)*12)","v":18185.504000000001},{"$f":"OFFSET(Balance!J74,0,($O$1-1)*12)","v":20470.113999999998},{"$f":"OFFSET(Balance!K74,0,($O$1-1)*12)","v":18564.435000000001},{"$f":"OFFSET(Balance!L74,0,($O$1-1)*12)","v":"-"},{"$f":"OFFSET(Balance!M74,0,($O$1-1)*12)","v":"-"},{"$f":"OFFSET(Balance!N74,0,($O$1-1)*12)","v":"-"},{"$f":"SUM(O10:O11)","v":152706.666}]
[null,"Régimen ordinario",{"$f":"OFFSET(Balance!C75,0,($O$1-1)*12)","v":"-"},{"$f":"OFFSET(Balance!D75,0,($O$1-1)*12)","v":"-"},{"$f":"OFFSET(Balance!E75,0,($O$1-1)*12)","v":"-"},{"$f":"OFFSET(Balance!F75,0,($O$1-1)*12)","v":"-"},{"$f":"OFFSET(Balance!G75,0,($O$1-1)*12)","v":"-"},{"$f":"OFFSET(Balance!H75,0,($O$1-1)*12)","v":"-"},{"$f":"OFFSET(Balance!I75,0,($O$1-1)*12)","v":"-"},{"$f":"OFFSET(Balance!J75,0,($O$1-1)*12)","v":"-"},{"$f":"OFFSET(Balance!K75,0,($O$1-1)*12)","v":"-"},{"$f":"OFFSET(Balance!L75,0,($O$1-1)*12)","v":"-"},{"$f":"OFFSET(Balance!M75,0,($O$1-1)*12)","v":"-"},{"$f":"OFFSET(Balance!N75,0,($O$1-1)*12)","v":"-"},{"$f":"SUM(O12)","v":152706.666}]
[]
[null,"Solar fotovoltaica",{"$f":"OFFSET(Balance!C76,0,($O$1-1)*12)","v":4.2050000000000001},{"$f":"OFFSET(Balance!D76,0,($O$1-1)*12)","v":5.8739999999999997},{"$f":"OFFSET(Balance!E76,0,($O$1-1)*12)","v":7.59},{"$f":"OFFSET(Balance!F76,0,($O$1-1)*12)","v":6.899},{"$f":"OFFSET(Balance!G76,0,($O$1-1)*12)","v":7.6449999999999996},{"$f":"OFFSET(Balance!H76,0,($O$1-1)*12)","v":6.2880000000000003},{"$f":"OFFSET(Balance!I76,0,($O$1-1)*12)","v":6.2039999999999997},{"$f":"OFFSET(Balance!J76,0,($O$1-1)*12)","v":8.6289999999999996},{"$f":"OFFSET(Balance!K76,0,($O$1-1)*12)","v":0},{"$f":"OFFSET(Balance!L76,0,($O$1-1)*12)","v":"-"},{"$f":"OFFSET(Balance!M76,0,($O$1-1)*12)","v":"-"},{"$f":"OFFSET(Balance!N76,0,($O$1-1)*12)","v":"-"},{"$f":"IF(SUM(C15:N15)=0,\"-\",SUM(C15:N15))","v":53.334000000000003}]
[null,"Térmica no renovable",{"$f":"OFFSET(Balance!C77,0,($O$1-1)*12)","v":"-"},{"$f":"OFFSET(Balance!D77,0,($O$1-1)*12)","v":"-"},{"$f":"OFFSET(Balance!E77,0,($O$1-1)*12)","v":"-"},{"$f":"OFFSET(Balance!F77,0,($O$1-1)*12)","v":"-"},{"$f":"OFFSET(Balance!G77,0,($O$1-1)*12)","v":"-"},{"$f":"OFFSET(Balance!H77,0,($O$1-1)*12)","v":"-"},{"$f":"OFFSET(Balance!I77,0,($O$1-1)*12)","v":"-"},{"$f":"OFFSET(Balance!J77,0,($O$1-1)*12)","v":"-"},{"$f":"OFFSET(Balance!K77,0,($O$1-1)*12)","v":"-"},{"$f":"OFFSET(Balance!L77,0,($O$1-1)*12)","v":"-"},{"$f":"OFFSET(Balance!M77,0,($O$1-1)*12)","v":"-"},{"$f":"OFFSET(Balance!N77,0,($O$1-1)*12)","v":"-"},{"$f":"IF(SUM(C16:N16)=0,\"-\",SUM(C16:N16))","v":"-"}]
[null,"Residuos no renovables",{"$f":"OFFSET(Balance!C78,0,($O$1-1)*12)","v":521.07550000000003},{"$f":"OFFSET(Balance!D78,0,($O$1-1)*12)","v":484.48050000000001},{"$f":"OFFSET(Balance!E78,0,($O$1-1)*12)","v":524.22050000000002},{"$f":"OFFSET(Balance!F78,0,($O$1-1)*12)","v":456.29450000000003},{"$f":"OFFSET(Balance!G78,0,($O$1-1)*12)","v":476.22399999999999},{"$f":"OFFSET(Balance!H78,0,($O$1-1)*12)","v":420.48149999999998},{"$f":"OFFSET(Balance!I78,0,($O$1-1)*12)","v":461.947},{"$f":"OFFSET(Balance!J78,0,($O$1-1)*12)","v":470.89150000000001},{"$f":"OFFSET(Balance!K78,0,($O$1-1)*12)","v":430.50400000000002},{"$f":"OFFSET(Balance!L78,0,($O$1-1)*12)","v":"-"},{"$f":"OFFSET(Balance!M78,0,($O$1-1)*12)","v":"-"},{"$f":"OFFSET(Balance!N78,0,($O$1-1)*12)","v":"-"},{"$f":"IF(SUM(C17:N17)=0,\"-\",SUM(C17:N17))","v":4246.1190000000006}]
[null,"Residuos renovables",{"$f":"OFFSET(Balance!C79,0,($O$1-1)*12)","v":521.07550000000003},{"$f":"OFFSET(Balance!D79,0,($O$1-1)*12)","v":484.48050000000001},{"$f":"OFFSET(Balance!E79,0,($O$1-1)*12)","v":524.22050000000002},{"$f":"OFFSET(Balance!F79,0,($O$1-1)*12)","v":456.29450000000003},{"$f":"OFFSET(Balance!G79,0,($O$1-1)*12)","v":476.22399999999999},{"$f":"OFFSET(Balance!H79,0,($O$1-1)*12)","v":420.48149999999998},{"$f":"OFFSET(Balance!I79,0,($O$1-1)*12)","v":461.947},{"$f":"OFFSET(Balance!J79,0,($O$1-1)*12)","v":470.89150000000001},{"$f":"OFFSET(Balance!K79,0,($O$1-1)*12)","v":430.50400000000002},{"$f":"OFFSET(Balance!L79,0,($O$1-1)*12)","v":"-"},{"$f":"OFFSET(Balance!M79,0,($O$1-1)*12)","v":"-"},{"$f":"OFFSET(Balance!N79,0,($O$1-1)*12)","v":"-"},{"$f":"IF(SUM(C18:N18)=0,\"-\",SUM(C18:N18))","v":4246.1190000000006}]
[null,"Régimen especial",{"$f":"OFFSET(Balance!C80,0,($O$1-1)*12)","v":"-"},{"$f":"OFFSET(Balance!D80,0,($O$1-1)*12)","v":"-"},{"$f":"OFFSET(Balance!E80,0,($O$1-1)*12)","v":"-"},{"$f":"OFFSET(Balance!F80,0,($O$1-1)*12)","v":"-"},{"$f":"OFFSET(Balance!G80,0,($O$1-1)*12)","v":"-"},{"$f":"OFFSET(Balance!H80,0,($O$1-1)*12)","v":"-"},{"$f":"OFFSET(Balance!I80,0,($O$1-1)*12)","v":"-"},{"$f":"OFFSET(Balance!J80,0,($O$1-1)*12)","v":"-"},{"$f":"OFFSET(Balance!K80,0,($O$1-1)*12)","v":"-"},{"$f":"OFFSET(Balance!L80,0,($O$1-1)*12)","v":"-"},{"$f":"OFFSET(Balance!M80,0,($O$1-1)*12)","v":"-"},{"$f":"OFFSET(Balance!N80,0,($O$1-1)*12)","v":"-"},{"$f":"SUM(O15:O18)","v":8545.5720000000001}]
[null,"Generación",{"$f":"OFFSET(Balance!C81,0,($O$1-1)*12)","v":18185.973000000002},{"$f":"OFFSET(Balance!D81,0,($O$1-1)*12)","v":17029.637999999999},{"$f":"OFFSET(Balance!E81,0,($O$1-1)*12)","v":16701.991999999998},{"$f":"OFFSET(Balance!F81,0,($O$1-1)*12)","v":15854.64},{"$f":"OFFSET(Balance!G81,0,($O$1-1)*12)","v":16501.419999999998},{"$f":"OFFSET(Balance!H81,0,($O$1-1)*12)","v":17017.004000000001},{"$f":"OFFSET(Balance!I81,0,($O$1-1)*12)","v":19115.601999999999},{"$f":"OFFSET(Balance!J81,0,($O$1-1)*12)","v":21420.526000000002},{"$f":"OFFSET(Balance!K81,0,($O$1-1)*12)","v":19425.442999999999},{"$f":"OFFSET(Balance!L81,0,($O$1-1)*12)","v":"-"},{"$f":"OFFSET(Balance!M81,0,($O$1-1)*12)","v":"-"},{"$f":"OFFSET(Balance!N81,0,($O$1-1)*12)","v":"-"},{"$f":"SUM(O13:O14,O19)","v":161252.23800000001}]
[null,"Demanda transporte (b.c.)",{"$f":"OFFSET(Balance!C82,0,($O$1-1)*12)","v":18185.973000000002},{"$f":"OFFSET(Balance!D82,0,($O$1-1)*12)","v":17029.637999999999},{"$f":"OFFSET(Balance!E82,0,($O$1-1)*12)","v":16701.991999999998},{"$f":"OFFSET(Balance!F82,0,($O$1-1)*12)","v":15854.64},{"$f":"OFFSET(Balance!G82,0,($O$1-1)*12)","v":16501.419999999998},{"$f":"OFFSET(Balance!H82,0,($O$1-1)*12)","v":17017.004000000001},{"$f":"OFFSET(Balance!I82,0,($O$1-1)*12)","v":19115.601999999999},{"$f":"OFFSET(Balance!J82,0,($O$1-1)*12)","v":21420.526000000002},{"$f":"OFFSET(Balance!K82,0,($O$1-1)*12)","v":19425.442999999999},{"$f":"OFFSET(Balance!L82,0,($O$1-1)*12)","v":"-"},{"$f":"OFFSET(Balance!M82,0,($O$1-1)*12)","v":"-"},{"$f":"OFFSET(Balance!N82,0,($O$1-1)*12)","v":"-"},{"$f":"O20","v":161252.23800000001}]
[null,"(1) Asignación de unidades de producción según combustible principal."]
[null,{"$f":"'Balance nacional mensual'!B38","v":"Datos definitivos hasta el 31/03/2017. Datos provisionales del 01/04/2017 al 31/08/2018. Datos programados del 01/09/2018 al 30/09/2018."}]

{"sheet":"Balance Melilla anual","index":12,"n_rows":25,"n_cols":9,"rows_kept":25,"cut":false,"hidden":false,"merged":[[21,1,21,11],[22,1,22,11]]}
[null,null,null,null,null,null,null,null,2]
[]
[]
[null,null,null,null,null,null,null,"Sistema eléctrico"]
[null,null,null,null,null,null,null,"Horizonte temporal"]
[null,null,null,null,null,null,null,"Periodo"]
[]
[null,null,{"$f":"OFFSET(Balance!C176,0,($I$1-1)*7)","v":2014},{"$f":"OFFSET(Balance!D176,0,($I$1-1)*7)","v":2015},{"$f":"OFFSET(Balance!E176,0,($I$1-1)*7)","v":2016},{"$f":"OFFSET(Balance!F176,0,($I$1-1)*7)","v":2017},{"$f":"OFFSET(Balance!G176,0,($I$1-1)*7)","v":2018},{"$f":"OFFSET(Balance!H176,0,($I$1-1)*7)","v":2019},{"$f":"OFFSET(Balance!I176,0,($I$1-1)*7)","v":2020}]
[]
[null,"Motores diesel",{"$f":"OFFSET(Balance!C177,0,($I$1-1)*7)","v":200050.45799999998},{"$f":"OFFSET(Balance!D177,0,($I$1-1)*7)","v":203917.10199999998},{"$f":"OFFSET(Balance!E177,0,($I$1-1)*7)","v":198250.31599999996},{"$f":"OFFSET(Balance!F177,0,($I$1-1)*7)","v":200316.96400000004},{"$f":"OFFSET(Balance!G177,0,($I$1-1)*7)","v":152640.27499999999},{"$f":"OFFSET(Balance!H177,0,($I$1-1)*7)","v":"-"},{"$f":"OFFSET(Balance!I177,0,($I$1-1)*7)","v":"-"}]
[null,"Turbina de gas",{"$f":"OFFSET(Balance!C178,0,($I$1-1)*7)","v":766.31},{"$f":"OFFSET(Balance!D178,0,($I$1-1)*7)","v":611.49799999999993},{"$f":"OFFSET(Balance!E178,0,($I$1-1)*7)","v":255.46899999999999},{"$f":"OFFSET(Balance!F178,0,($I$1-1)*7)","v":77.272999999999996},{"$f":"OFFSET(Balance!G178,0,($I$1-1)*7)","v":66.391000000000005},{"$f":"OFFSET(Balance!H178,0,($I$1-1)*7)","v":"-"},{"$f":"OFFSET(Balance!I178,0,($I$1-1)*7)","v":"-"}]
[null,"Fuel + Gas",{"$f":"OFFSET(Balance!C179,0,($I$1-1)*7)","v":200816.76799999998},{"$f":"OFFSET(Balance!D179,0,($I$1-1)*7)","v":204528.60000000003},{"$f":"OFFSET(Balance!E179,0,($I$1-1)*7)","v":198505.78499999997},{"$f":"OFFSET(Balance!F179,0,($I$1-1)*7)","v":200394.23700000002},{"$f":"OFFSET(Balance!G179,0,($I$1-1)*7)","v":152706.666},{"$f":"OFFSET(Balance!H179,0,($I$1-1)*7)","v":"-"},{"$f":"OFFSET(Balance!I179,0,($I$1-1)*7)","v":"-"}]
[null,"Régimen ordinario",{"$f":"OFFSET(Balance!C180,0,($I$1-1)*7)","v":" "},{"$f":"OFFSET(Balance!D180,0,($I$1-1)*7)","v":" "},{"$f":"OFFSET(Balance!E180,0,($I$1-1)*7)","v":" "},{"$f":"OFFSET(Balance!F180,0,($I$1-1)*7)","v":" "},{"$f":"OFFSET(Balance!G180,0,($I$1-1)*7)","v":" "},{"$f":"OFFSET(Balance!H180,0,($I$1-1)*7)","v":" "},{"$f":"OFFSET(Balance!I180,0,($I$1-1)*7)","v":" "}]
[]
[null,"Solar fotovoltaica",{"$f":"OFFSET(Balance!C181,0,($I$1-1)*7)","v":83.832999999999998},{"$f":"OFFSET(Balance!D181,0,($I$1-1)*7)","v":79.959999999999994},{"$f":"OFFSET(Balance!E181,0,($I$1-1)*7)","v":80.09999999999998},{"$f":"OFFSET(Balance!F181,0,($I$1-1)*7)","v":76.868999999999986},{"$f":"OFFSET(Balance!G181,0,($I$1-1)*7)","v":53.334000000000003},{"$f":"OFFSET(Balance!H181,0,($I$1-1)*7)","v":"-"},{"$f":"OFFSET(Balance!I181,0,($I$1-1)*7)","v":"-"}]
[null,"Cogeneración y resto (2)",{"$f":"OFFSET(Balance!C182,0,($I$1-1)*7)","v":0},{"$f":"OFFSET(Balance!D182,0,($I$1-1)*7)","v":"-"},{"$f":"OFFSET(Balance!E182,0,($I$1-1)*7)","v":"-"},{"$f":"OFFSET(Balance!F182,0,($I$1-1)*7)","v":"-"},{"$f":"OFFSET(Balance!G182,0,($I$1-1)*7)","v":"-"},{"$f":"OFFSET(Balance!H182,0,($I$1-1)*7)","v":"-"},{"$f":"OFFSET(Balance!I182,0,($I$1-1)*7)","v":"-"}]
[null,"Residuos no renovables",{"$f":"OFFSET(Balance!C183,0,($I$1-1)*7)","v":4449.1570000000002},{"$f":"OFFSET(Balance!D183,0,($I$1-1)*7)","v":4296.4980000000005},{"$f":"OFFSET(Balance!E183,0,($I$1-1)*7)","v":4850.0525000000016},{"$f":"OFFSET(Balance!F183,0,($I$1-1)*7)","v":4976.9860000000008},{"$f":"OFFSET(Balance!G183,0,($I$1-1)*7)","v":4246.1190000000006},{"$f":"OFFSET(Balance!H183,0,($I$1-1)*7)","v":"-"},{"$f":"OFFSET(Balance!I183,0,($I$1-1)*7)","v":"-"}]
[null,"Residuos renovables",{"$f":"OFFSET(Balance!C184,0,($I$1-1)*7)","v":4449.1570000000002},{"$f":"OFFSET(Balance!D184,0,($I$1-1)*7)","v":4296.4980000000005},{"$f":"OFFSET(Balance!E184,0,($I$1-1)*7)","v":4850.0525000000016},{"$f":"OFFSET(Balance!F184,0,($I$1-1)*7)","v":4976.9860000000008},{"$f":"OFFSET(Balance!G184,0,($I$1-1)*7)","v":4246.1190000000006},{"$f":"OFFSET(Balance!H184,0,($I$1-1)*7)","v":"-"},{"$f":"OFFSET(Balance!I184,0,($I$1-1)*7)","v":"-"}]
[null,"Régimen especial",{"$f":"OFFSET(Balance!C185,0,($I$1-1)*7)","v":" "},{"$f":"OFFSET(Balance!D185,0,($I$1-1)*7)","v":" "},{"$f":"OFFSET(Balance!E185,0,($I$1-1)*7)","v":" "},{"$f":"OFFSET(Balance!F185,0,($I$1-1)*7)","v":" "},{"$f":"OFFSET(Balance!G185,0,($I$1-1)*7)","v":" "},{"$f":"OFFSET(Balance!H185,0,($I$1-1)*7)","v":" "},{"$f":"OFFSET(Balance!I185,0,($I$1-1)*7)","v":" "}]
[null,"Generación",{"$f":"OFFSET(Balance!C186,0,($I$1-1)*7)","v":209798.91500000004},{"$f":"OFFSET(Balance!D186,0,($I$1-1)*7)","v":213201.55600000001},{"$f":"OFFSET(Balance!E186,0,($I$1-1)*7)","v":208285.99},{"$f":"OFFSET(Balance!F186,0,($I$1-1)*7)","v":210425.07800000001},{"$f":"OFFSET(Balance!G186,0,($I$1-1)*7)","v":161252.23800000001},{"$f":"OFFSET(Balance!H186,0,($I$1-1)*7)","v":"-"},{"$f":"OFFSET(Balance!I186,0,($I$1-1)*7)","v":"-"}]
[null,"Demanda transporte (b.c.)",{"$f":"OFFSET(Balance!C187,0,($I$1-1)*7)","v":209798.91500000004},{"$f":"OFFSET(Balance!D187,0,($I$1-1)*7)","v":213201.55600000001},{"$f":"OFFSET(Balance!E187,0,($I$1-1)*7)","v":208285.99},{"$f":"OFFSET(Balance!F187,0,($I$1-1)*7)","v":210425.07800000001},{"$f":"OFFSET(Balance!G187,0,($I$1-1)*7)","v":161252.23800000001},{"$f":"OFFSET(Balance!H187,0,($I$1-1)*7)","v":"-"},{"$f":"OFFSET(Balance!I187,0,($I$1-1)*7)","v":"-"}]
[null,"(1) Asignación de unidades de producción según combustible principal."]
[null,"(2) Hasta 2010 incluye residuos."]
[null,{"$f":"IF(MONTH(FACT)=1,\"\",CONCATENATE(\"Para el año \",YEAR(FACT), \" valores acumulados hasta \",TEXT(FACT-30,\"mmmm\"),\" de \",YEAR(FACT),\".\"))","v":"Para el año 2018 valores acumulados hasta septiembre de 2018."}]
[null,{"$f":"'Balance nacional mensual'!B38","v":"Datos definitivos hasta el 31/03/2017. Datos provisionales del 01/04/2017 al 31/08/2018. Datos programados del 01/09/2018 al 30/09/2018."}]

{"sheet":"Balance","index":13,"n_rows":210,"n_cols":350,"rows_kept":210,"cut":false,"hidden":true,"merged":[]}
[]
[null,"Balance eléctrico mensual peninsular (GWh)","1990-01-01","1990-02-01","1990-03-01","1990-04-01","1990-05-01","1990-06-01","1990-07-01","1990-08-01","1990-09-01","1990-10-01","1990-11-01","1990-12-01","1991-01-01","1991-02-01","1991-03-01","1991-04-01","1991-05-01","1991-06-01","1991-07-01","1991-08-01","1991-09-01","1991-10-01","1991-11-01","1991-12-01","1992-01-01","1992-02-01","1992-03-01","1992-04-01","1992-05-01","1992-06-01","1992-07-01","1992-08-01","1992-09-01","1992-10-01","1992-11-01","1992-12-01","1993-01-01","1993-02-01","1993-03-01","1993-04-01","1993-05-01","1993-06-01","1993-07-01","1993-08-01","1993-09-01","1993-10-01","1993-11-01","1993-12-01","1994-01-01","1994-02-01","1994-03-01","1994-04-01","1994-05-01","1994-06-01","1994-07-01","1994-08-01","1994-09-01","1994-10-01","1994-11-01","1994-12-01","1995-01-01","1995-02-01","1995-03-01","1995-04-01","1995-05-01","1995-06-01","1995-07-01","1995-08-01","1995-09-01","1995-10-01","1995-11-01","1995-12-01","1996-01-01","1996-02-01","1996-03-01","1996-04-01","1996-05-01","1996-06-01","1996-07-01","1996-08-01","1996-09-01","1996-10-01","1996-11-01","1996-12-01","1997-01-01","1997-02-01","1997-03-01","1997-04-01","1997-05-01","1997-06-01","1997-07-01","1997-08-01","1997-09-01","1997-10-01","1997-11-01","1997-12-01","1998-01-01","1998-02-01","1998-03-01","1998-04-01","1998-05-01","1998-06-01","1998-07-01","1998-08-01","1998-09-01","1998-10-01","1998-11-01","1998-12-01","1999-01-01","1999-02-01","1999-03-01","1999-04-01","1999-05-01","1999-06-01","1999-07-01","1999-08-01","1999-09-01","1999-10-01","1999-11-01","1999-12-01","2000-01-01","2000-02-01","2000-03-01","2000-04-01","2000-05-01","2000-06-01","2000-07-01","2000-08-01","2000-09-01","2000-10-01","2000-11-01","2000-12-01","2001-01-01","2001-02-01","2001-03-01","2001-04-01","2001-05-01","2001-06-01","2001-07-01","2001-08-01","2001-09-01","2001-10-01","2001-11-01","2001-12-01","2002-01-01","2002-02-01","2002-03-01","2002-04-01","2002-05-01","2002-06-01","2002-07-01","2002-08-01","2002-09-01","2002-10-01","2002-11-01","2002-12-01","2003-01-01","2003-02-01","2003-03-01","2003-04-01","2003-05-01","2003-06-01","2003-07-01","2003-08-01","2003-09-01","2003-10-01","2003-11-01","2003-12-01","2004-01-01","2004-02-01","2004-03-01","2004-04-01","2004-05-01","2004-06-01","2004-07-01","2004-08-01","2004-09-01","2004-10-01","2004-11-01","2004-12-01","2005-01-01","2005-02-01","2005-03-01","2005-04-01","2005-05-01","2005-06-01","2005-07-01","2005-08-01","2005-09-01","2005-10-01","2005-11-01","2005-12-01","2006-01-01","2006-02-01","2006-03-01","2006-04-01","2006-05-01","2006-06-01","2006-07-01","2006-08-01","2006-09-01","2006-10-01","2006-11-01","2006-12-01","2007-01-01","2007-02-01","2007-03-01","2007-04-01","2007-05-01","2007-06-01","2007-07-01","2007-08-01","2007-09-01","2007-10-01","2007-11-01","2007-12-01","2008-01-01","2008-02-01","2008-03-01","2008-04-01","2008-05-01","2008-06-01","2008-07-01","2008-08-01","2008-09-01","2008-10-01","2008-11-01","2008-12-01","2009-01-01","2009-02-01","2009-03-01","2009-04-01","2009-05-01","2009-06-01","2009-07-01","2009-08-01","2009-09-01","2009-10-01","2009-11-01","2009-12-01","2010-01-01","2010-02-01","2010-03-01","2010-04-01","2010-05-01","2010-06-01","2010-07-01","2010-08-01","2010-09-01","2010-10-01","2010-11-01","2010-12-01","2011-01-01","2011-02-01","2011-03-01","2011-04-01","2011-05-01","2011-06-01","2011-07-01","2011-08-01","2011-09-01","2011-10-01","2011-11-01","2011-12-01","2012-01-01","2012-02-01","2012-03-01","2012-04-01","2012-05-01","2012-06-01","2012-07-01","2012-08-01","2012-09-01","2012-10-01","2012-11-01","2012-12-01","2013-01-01","2013-02-01","2013-03-01","2013-04-01","2013-05-01","2013-06-01","2013-07-01","2013-08-01","2013-09-01","2013-10-01","2013-11-01","2013-12-01","2014-01-01","2014-02-01","2014-03-01","2014-04-01","2014-05-01","2014-06-01","2014-07-01","2014-08-01","2014-09-01","2014-10-01","2014-11-01","2014-12-01","2015-01-01","2015-02-01","2015-03-01","2015-04-01","2015-05-01","2015-06-01","2015-07-01","2015-08-01","2015-09-01","2015-10-01","2015-11-01","2015-12-01","2016-01-01","2016-02-01","2016-03-01","2016-04-01","2016-05-01","2016-06-01","2016-07-01","2016-08-01","2016-09-01","2016-10-01","2016-11-01","2016-12-01","2017-01-01","2017-02-01","2017-03-01","2017-04-01","2017-05-01","2017-06-01","2017-07-01","2017-08-01","2017-09-01","2017-10-01","2017-11-01","2017-12-01","2018-01-01","2018-02-01","2018-03-01","2018-04-01","2018-05-01","2018-06-01","2018-07-01","2018-08-01","2018-09-01","2018-10-01","2018-11-01","2018-12-01"]
[null,"Hidráulica",3812.6836999999987,3241.3313999999987,2387.7997000000005,1664.4924999999992,1752.901800000001,1739.8822,1544.0681999999999,1169.8983999999989,1178.3229000000017,1337.0603000000017,1868.1971000000021,1844.1224000000009,2467.4703999999979,1919.5628999999992,3614.2048000000013,3316.7103000000006,2694.829699999998,1973.8522000000016,1620.9676000000009,1055.4560000000006,1050.6569000000009,1456.6256999999982,1844.0770999999968,1713.5203000000015,1250.8666000000014,723.77950000000226,698.12999999999874,1390.8228999999994,1287.4845000000005,1384.7241999999992,1490.8638999999987,1021.247400000003,1103.2181999999984,1653.1741000000013,1965.1256999999989,2587.4304999999986,1964.7223000000017,1382.2487000000033,1283.8341999999971,971.62319999999681,1629.2967000000003,1998.1276000000009,1732.0918000000011,1141.0418999999988,1098.4951999999985,2604.2501000000002,3227.9826999999968,2480.7752999999984,3506.1817999999994,2871.0269000000003,2559.2106999999965,2180.1566999999995,2397.3124999999977,2261.0100000000029,1724.8935999999999,1239.8088000000002,1153.1582000000008,1376.5238999999979,2086.2166000000016,1653.1660000000034,2531.9199000000003,2392.7034000000026,2922.0561999999995,1736.6887000000038,1575.2418999999973,1613.2683,1506.0024999999998,986.9472999999989,810.23769999999809,876.02170000000251,1104.648999999999,2183.3511999999996,5366.4255000000003,5212.2742000000007,3299.6810999999993,3427.3588999999974,3565.8544000000006,2717.445299999999,2133.1411999999978,1426.6442,1653.9289000000003,1642.9637000000023,2028.170699999999,3850.8693000000017,5243.6578000000009,3212.0474000000017,2463.6685999999991,2149.822099999999,2047.0708000000016,2156.1440999999982,1862.2452000000017,1573.612700000001,1466.7002999999995,1361.9637999999989,3192.0373000000009,4952.2926000000007,5470.6294999999982,3738.6073999999985,2434.159300000003,3142.3083000000001,3702.8203000000008,3175.0883999999992,2392.2328999999995,1887.271500000001,1699.3457999999996,1791.5409000000006,1342.3168000000005,1079.2141000000008,1111.8596000000011,1083.0403000000006,1671.6503000000014,1854.149699999999,2506.3907999999997,2240.7727999999997,1763.463400000001,1280.9923999999987,1341.8103000000001,1474.790199999999,2480.3627999999994,2488.0994000000019,2258.7286000000026,1356.0572000000002,1300.8535999999999,1804.3185999999987,2863.7578000000017,2010.3655000000006,1492.7415999999989,1557.3933000000006,1681.1606000000013,1511.4157000000005,2137.1221000000005,4083.9201999999987,5842.8609000000006,5371.9687000000013,6098.7381000000005,3956.8406999999988,2967.3583000000017,2227.5889000000011,1785.2493000000011,1721.3026000000004,1319.4317000000015,1577.8276999999989,1812.4448,1422.9655,1092.5866000000001,918.69360000000006,1561.1817000000001,1532.7879,1572.4141000000002,1595.1734000000001,1135.2789,844.28559999999993,837.77120000000014,937.81510000000003,1607.2706000000001,3690.6138999999998,5077.4655000000002,3962.1758999999997,4042.1839999999997,3389.9379999999996,3195.2093,2009.3285000000001,1705.3562000000002,1257.8616999999999,1451.1365000000001,1701.9632999999999,2809.7932000000001,4405.9511000000002,3194.3600999999985,2970.8209999999976,2675.6499000000003,2489.1504999999997,2791.3154000000013,2347.6550999999999,1776.8765999999987,1499.0746000000015,1336.6138000000053,1499.4952000000026,2039.2544999999986,1500.192400000001,1212.9129999999996,1247.2604000000024,1424.3981000000015,1633.9949999999992,1748.5583999999988,1526.0680999999977,1063.7019000000018,938.54999999999757,667.86839999999802,638.98779999999829,1022.1012999999966,1306.2117000000005,1233.9692999999993,869.53769999999804,2443.6332999999972,2221.2243000000017,1775.277900000001,1255.5403000000015,1280.5138000000029,855.7432,952.06890000000055,1324.1278999999988,2588.522599999998,4426.2256999999954,1920.0478000000003,2539.7347,3412.3603999999996,2337.7021,2328.2846,1896.4941999999999,2152.4522999999999,1514.2806,1189.9214999999999,1525.5493000000001,1152.0925,1010.0581,1052.9718,724.43350000000009,774.5612000000001,2158.8984000000028,2756.8809000000001,2593.9364999999998,1801.4576,1275.0206000000001,1101.1437999999998,904.63950000000011,1192.6748000000002,1959.02,1753.4290999999998,2852.5814999999998,2234.3775999999998,1704.1587,2008.6723999999999,1659.6541999999999,1393.0593999999999,1167.1748,750.34090000000003,1028.1299000000001,1560.9612999999999,2619.7628999999997,4414.2761132999995,3450.7255615999998,5031.7780444,4029.8561307,3174.5390475999998,2946.0881532000003,2437.1694070000003,1695.0818135,1249.4073436999997,1282.6130285000002,2043.8580677,3254.0614768999999,4439.2453903059995,2483.3270061980002,3232.0600561000001,2936.9799763639999,2301.762577558,1658.9365263960001,1271.6326979360001,1211.761240882,986.124473212,1054.6867472880001,1734.1653386200001,1730.6018583500002,1288.42919416,890.01074002000007,1012.57624358,1270.9335461160001,1884.7648081940001,1662.3597153759999,1321.613361704,1067.3090153119999,832.03972230200009,1114.7873710060001,1571.0858965340001,2029.8096269940002,2334.0931532600002,2847.9296568160003,3722.6132631,4522.6975757780001,3013.9773428500002,2527.858497832,2174.2628258139998,1734.5437124660002,1514.1296808720001,1515.136217518,2268.9760876239998,1922.17871001,4261.0894408300001,5762.97680786,5292.718580058,4986.5678638279996,2826.4663612419999,2485.440481572,2354.5106886840003,2044.576989228,1796.8504679580001,1631.74783108,2451.8058291900002,3283.7728176739997,2554.5274943639997,3558.7372285259999,3845.2803957779997,2662.5207724859997,2966.8797230719997,2497.294804308,2060.0958996879999,1643.4177310919999,1609.2271818899999,1649.8575365440001,1892.3834139960002,1438.789389106,3441.5204669499999,4052.6014005740003,4366.2379949660008,5244.5851729240003,5100.8993495119994,2955.8731448839999,2272.8888052259999,2046.8134319440001,1653.36592744,1631.5607705920002,1498.794683218,1846.2932175420001,2040.378652334,1956.351218862,2700.9675717360001,1897.7219954679999,1935.158531156,1637.6011437760001,1192.784178952,1082.4397687339999,1147.5808360619999,773.35631237799998,831.61728853200009,1249.9370186699998,2193.9237987859997,2388.6122803500002,4399.0090775560002,4716.4282802460002,3520.7950463240004,3710.881286584,3024.3379099859999,2103.9091784919997,1923.630571762,"-","-","-"]
[null,"Turbinación bombeo",161.4753,85.601599999999991,10.0023,19.701499999999999,30.440199999999997,9.1798000000000002,15.472799999999998,34.9846,112.49909999999998,108.8507,31.154899999999998,108.12759999999999,188.23560000000001,152.8681,120.1802,8.5406999999999993,10.940299999999999,28.968799999999998,40.398400000000002,50.463000000000001,78.941099999999992,56.615299999999998,131.96889999999999,134.7927,183.39439999999999,101.0205,119.30799999999999,208.3151,139.03049999999999,172.7978,194.17509999999996,192.34460000000001,192.08979999999997,204.50989999999999,127.22429999999999,119.28349999999999,97.118700000000004,78.882299999999987,132.29579999999999,141.7808,158.94829999999999,94.095399999999998,97.892200000000003,133.19809999999998,141.65479999999999,133.4529,59.527299999999997,52.444700000000005,212.85320000000002,87.943099999999987,11.206299999999999,24.212299999999999,37.103499999999997,28,78.989399999999989,20.304199999999998,118.04379999999998,131.6301,78.821399999999997,112.66499999999998,160.95309999999998,106.2796,104.93979999999999,97.369299999999981,88.76209999999999,88.375699999999995,114.76149999999998,110.08269999999999,122.0093,124.77429999999998,116.68299999999999,222.21779999999998,532.94150000000002,133.28979999999999,21.018899999999999,23.697099999999999,30.819599999999998,51.009699999999995,46.447799999999994,8.4517999999999986,16.242099999999997,27.432299999999998,48.775300000000001,125.70669999999998,177.05519999999999,26.094599999999996,8.5833999999999993,15.047899999999998,57.320199999999993,59.81989999999999,82.714799999999997,123.43729999999999,133.03569999999999,101.2872,186.24269999999999,261.98339999999996,194.00849999999997,94.386599999999987,77.847699999999989,150.40269999999998,127.23269999999999,80.190600000000003,142.36109999999999,223.94749999999999,135.36320000000001,120.20610000000001,149.65019999999998,315.83089999999999,328.1404,239.93270000000001,164.0667,151.03129999999999,153.87819999999999,124.34519999999999,150.1626,182.5866,238.65169999999998,342.83479999999997,221.2182,269.61759999999998,258.01439999999997,219.27780000000001,241.97040000000001,359.50039999999996,432.54820000000001,231.15049999999997,226.40939999999998,172.43869999999998,179.7824,253.77029999999999,316.1739,543.78379999999993,377.35109999999997,215.15129999999996,271.24790000000002,140.6713,150.2347,181.0641,212.10769999999999,204.07239999999999,258.12430000000001,254.86929999999998,235.3022,391.68849999999992,456.99639999999994,354.36939999999998,326.40229999999997,310.37509999999997,391.61989999999997,439.92059999999998,489.86909999999995,400.59039999999999,418.58179999999999,402.89689999999996,399.29539999999997,478.76009999999997,411.1345,265.81309999999996,258.05499999999995,153.08999999999997,186.19369999999998,291.00049999999999,293.89079999999996,330.62329999999997,305.91749999999996,273.21069999999997,225.48679999999999,280.27789999999999,283.37189999999998,193.28399999999999,237.30209999999997,230.29649999999998,275.3646,297.92489999999998,285.8184,270.50939999999997,271.4502,288.03879999999998,251.00249999999997,338.93159999999995,387.16300000000001,303.05659999999995,344.81089999999995,315.43399999999997,450.14759999999995,444.16890000000001,485.31909999999993,312.25599999999997,363.80259999999993,337.94319999999999,318.21369999999996,387.54730000000001,410.50869999999998,370.94329999999997,262.44469999999995,214.06069999999997,219.59209999999996,259.05669999999998,359.3492,280.24779999999998,340.60109999999997,379.06610000000001,379.10039999999998,268.89030000000002,260.2432,277.11529999999999,268.91759999999999,205.37789999999998,278.33539999999999,249.37780000000001,233.46469999999999,259.9674,242.14749999999998,221.90069999999997,268.90849999999995,336.8449,301.58519999999999,293.51349999999996,281.25579999999997,153.34059999999999,144.25110000000001,199.67849999999999,177.6474,133.56139999999999,158.58920000000001,208.00149999999996,287.87919999999997,322.44799999999998,344.55889999999994,274.42450000000002,197.03039999999999,179.03129999999999,173.24859999999998,157.21579999999997,168.71259999999998,171.5042,178.14509999999999,198.88609999999997,278.25069999999994,334.92410000000001,529.60983670000007,388.30555539999995,381.26509259999995,212.21241929999999,195.96443439999999,161.10858679999998,139.41769099999999,161.80076849999998,163.58696829999997,242.28118949999995,225.55656829999995,319.33869309999994,283.94490769399999,172.14437780200001,234.3481209,201.526885636,111.13141044199999,97.401727604000001,102.43908606400001,120.019735118,138.437161788,216.20731071200001,224.26137738,281.67412965,318.69145184000001,266.29888497999997,265.75549541999999,307.58115988400004,223.421483806,199.61285362400002,195.82272629600001,256.54768168800001,270.24170669800003,283.98781499400002,276.84362946600004,337.08485500600005,372.34012374000002,342.600296184,457.14945289999997,370.51571222199999,251.14840015000001,216.49426816800002,175.260815186,163.016439534,139.951745128,216.268290482,246.284607376,338.64703298999996,443.67862617000003,369.22198314000002,354.77524994200002,361.18861317199998,275.95647575800001,207.70265442800002,170.77235531599999,151.65694177199998,160.19068604199998,267.50232792000003,326.90832081000002,326.44179232599998,319.02103063599998,291.33964547400001,327.144737222,255.86272351400001,242.84147692799999,125.366838692,110.974045312,202.46425890799998,162.10553811,249.57726645600002,276.57492800400001,332.09329889399999,454.98487605000003,434.36759242599999,351.10246903400002,429.29966807599999,316.01911348800002,169.55252211600001,96.849533773999994,110.35765205600001,101.23997756,161.43736240799998,258.23356678200003,250.884576458,291.21301766599998,267.73958013800001,241.22357426400001,199.433449532,162.454982844,91.897749223999995,98.826694048000007,112.205176266,118.471554938,133.820917622,222.09125546799999,309.58646633000001,273.43523521399999,180.62302364999999,369.77771444399997,345.63732475400002,153.27436067600001,58.722846416000003,35.306144013999997,60.031041508000001,40.026753237999998,"-","-","-"]
[null,"Nuclear",5193.2669999999998,4339.07,4257.0429999999997,4556.652,3888.4780000000001,3340.7759999999998,4237.2030000000004,4785.9570000000003,3922.86,3724.6979999999999,4508.0119999999997,5151.652,5104.1710000000003,4384.2939999999999,4067.27,3992.02,4552.1890000000003,4225.1899999999996,4437.6530000000002,4942.09,4277.0730000000003,4464.0169999999998,4223.2820000000002,4493.1509999999998,5192.8770000000004,4385.7290000000003,4026.587,3462.453,4064.5410000000002,4293.1989999999996,4749.7550000000001,4946.1469999999999,4034.17,4813.0360000000001,4192.3450000000003,5199.2209999999995,5201.174,4155.7929999999997,4669.1880000000001,4062.3710000000001,3893.6060000000002,4183.93,4729.2460000000001,4829.7979999999998,4382.91,4501.3059999999996,4049.26,5006.7079999999996,4888.2139999999999,3958.1379999999999,3900.1210000000001,4180.04,4543.5010000000002,3955.25,4579.1760000000004,5011.7669999999998,4867.835,4055.7330000000002,3978.7339999999999,5077.2939999999999,5146.4290000000001,4395.348,4446.4219999999996,4134.1989999999996,4752.0510000000004,4513.0550000000003,4113.75,4140.442,3814.6640000000002,4207.8209999999999,4297.0649999999996,5176.8519999999999,5195.7539999999999,4737.4430000000002,4830.9219999999996,4445.9740000000002,5116.9250000000002,3774.4290000000001,3664.36,3673.0569999999998,3886.011,4866.2370000000001,4595.5460000000003,5326.0879999999997,5031.4409999999998,4410.6220000000003,3691.5619999999999,4062.0650000000001,4998.1310000000003,4588.0749999999998,4734.5360000000001,4656.4660000000003,4176.0129999999999,4076.8440000000001,4225.6610000000001,4396.9260000000004,4850.357,4864.741,4461.1189999999997,4236.9560000000001,4651.5559999999996,4934.2110000000002,5286.8950000000004,5284.7460000000001,4524.4040000000005,4228.4549999999999,4439.5460000000003,4809.0609999999997,5175.085,3934.9490000000001,4011.0189999999998,3517.41,4880.7039999999997,4516.8969999999999,4677.9319999999998,5216.1670000000004,4711.5259999999998,5076.299,5278.6869999999999,5381.5219999999999,5459.17,5121.3310000000001,4958.84,4468.1360000000004,4874.4319999999998,5231.8050000000003,5359.4309999999996,5001.26,4030.7669999999998,4407.5630000000001,5064.9549999999999,5552.63,5502.3770000000004,4781.0929999999998,4681.95,4579.076,5513.3280000000004,5103.848,5432.7079999999996,5308.9870000000001,4701.9359999999997,4737.7489999999998,5173.6959999999999,5468.4650000000001,5520.4269999999997,4774.6279999999997,4206.7129999999997,4213.8419999999996,4779.2070000000003,5056.317,5461.0479999999998,5342.009,4584.9179999999997,5397.9639999999999,5372.2539999999999,5579.12,5509.2039999999997,4935.9390000000003,4672.1049999999996,4666.5870000000004,4788.8159999999998,4456.1189999999997,5407.9309999999996,5310.3649999999998,4125.6400000000003,4543.8519999999999,5301.45,5501.5820000000003,5460.7179999999998,5125.5640000000003,4948.6270000000004,5126.8320000000003,4825.2929999999997,5119.8680000000004,5506.2659999999996,5391.1970000000001,4699.0659999999998,4456.99,5064.8130000000001,5150.5079999999998,5568.3090000000002,4881.1490000000003,4397.3779999999997,3772.4949999999999,3619.3679999999999,3778.6930000000002,3888.0259999999998,4532.116,5109.7690000000002,4710.4870000000001,5173.1639999999998,5470.8789999999999,5421.2830000000004,4884.5969999999998,5073.241,3528.8339999999998,4300.0879999999997,4842.6530000000002,4775.66,5164.5550000000003,4298.7560000000003,4620.2969999999996,5068.6260000000002,5375.116,5319.1580000000004,4778.3050000000003,4947.4629999999997,4342.93,3485.058,3161.45,3855.7460000000001,3976.62,4877.2839999999997,4891.0659999999998,3934.346,5069.5010000000002,5322.9409999999998,5119.9319999999998,5354.7060000000001,4039.7550000000001,4689.7039999999997,4579.7330000000002,4541.0349999999999,5013.9489999999996,4482.3890000000001,4314.4620000000004,4045.8270000000002,4955.8580000000002,5438.39,4335.1400000000003,3949.223,4063.489,3687.607,3530.33,3998.25,5278.1620000000003,4387.8469999999998,3957.8240000000001,3973.4949999999999,3949.6880000000001,4480.6099999999997,4635.9830000000002,4877.9646469999998,4894.268,4417.8689999999997,4693.97,5399.9840000000004,5421.2550000000001,5066.8190000000004,5429.7690000000002,5094.6189999999997,4829.2110000000002,4706.5008779999998,4266.689754,4324.2312089999996,4450.0773079999999,3611.7794169999997,4695.2574460000005,4817.4696819999999,5271.6905420000003,4981.7416309999999,4490.6379879999995,4538.8814699999994,4850.9175420000001,5164.1896420000003,5145.3286880000005,5475.7198159999998,5196.3066060000001,4472.2010689999997,3482.8677540000003,5091.8557690000007,5458.005744,5300.1472389999999,5396.0980310000004,4059.590095,4353.1283459999995,4573.2782189999998,4420.6695949999994,5208.3912289999998,4453.4636330000003,3978.8062969999996,4322.5249009999998,5134.2322460000005,5022.1737570000005,4737.0821660000001,4333.3467949999995,4057.4559819999999,3969.3632990000001,4526.0627789999999,4721.9374950000001,5286.7922759999992,5056.3066469999994,4336.6333090000007,3416.6655299999998,4253.4134400000003,4205.3950650000006,4801.3623909999997,5126.607422,4363.8270980000007,4686.2778830000007,5240.0450559999999,4716.807315,5203.7174930000001,4681.6209850000005,3534.4988330000001,3750.101549,4794.5369390000005,4962.6728059999996,4871.5337340000005,4085.5825599999998,3964.2195019999999,4856.4665329999998,4607.5606760000001,3961.1322270000001,5190.0414309999996,5052.2104800000006,3877.8372300000001,4814.1318569999994,5176.6521160000002,5150.5210360000001,5008.646428,5093.0410350000002,3762.5391300000001,4327.3684130000001,5283.5543349999998,4766.6571869999998,5269.1337249999997,4926.0698920000004,4130.8703100000002,4034.3327380000001,4385.200742,5078.9521169999998,4722.5735259999992,4301.3254560000005,3601.78287,5039.108604,5096.5286330000008,4592.3205680000001,4488.9170219999996,3812.588835,3728.673667,3591.5913509999996,4471.0236880000002,5135.7246780000005,5013.0349210000004,"-","-","-"]
[null,"Carbón",3554.7130000000002,2808.93,4652.6989999999996,4136.5429999999997,4587.1109999999999,5321.4319999999998,5250.7060000000001,3947.904,5387.902,5510.9690000000001,4915.0630000000001,5264.8360000000002,5224.28,5296.625,3495.0279999999998,3481.8490000000002,3671.8180000000002,4256.6930000000002,4980.1729999999998,4086.721,5208.0709999999999,5263.2470000000003,5335.63,5504.1719999999996,5944.99,5738.3360000000002,6103.6019999999999,5201.3090000000002,4697.4560000000001,4286.62,5015.9709999999995,4074.3449999999998,5319.2740000000003,4625.6970000000001,4904.8990000000003,3913.3960000000002,5346.884,5513.03,5612.2,5170.2950000000001,4777.482,4212.7860000000001,4707.7950000000001,4404.0150000000003,5167.9459999999999,4033.7550000000001,4331.0810000000001,4573.8289999999997,3978.51,4574.6260000000002,4772.0309999999999,4414.0839999999998,3947.5819999999999,4969.9160000000002,5461.8220000000001,4646.473,4986.63,5297.8029999999999,4989.8029999999999,5135.4290000000001,4961.5429999999997,4086.7020000000002,4543.3760000000002,4764.9229999999998,4849.9660000000003,4988.4269999999997,5813.1210000000001,5715.2879999999996,5955.4340000000002,5452.8069999999998,5627.4120000000003,4475.7129999999997,2360.5059999999999,2530.3960000000002,3906.415,2566.183,2468.0160000000001,4802.9570000000003,6075.884,5718.72,5483.2709999999997,5300.6729999999998,5235.7960000000003,3019.8519999999999,3369.9650000000001,3440.4050000000002,5261.442,5405.2070000000003,4764.1080000000002,4851.4949999999999,5510.2690000000002,5458.799,6182.2820000000002,6159.8909999999996,4489.942,3626.0010000000002,2784.9969999999998,3170.357,5292.9309999999996,4252.3119999999999,3309.6819999999998,4052.5839999999998,5346.3990000000003,4423.5739999999996,5801.1279999999997,6013.634,6005.6689999999999,6472.7079999999996,6340.8639999999996,5930.6809999999996,6145.65,5483.5320000000002,4405.9440000000004,5287.6989999999996,6323.3829999999998,5275.55,6366.4870000000001,5855.6469999999999,5280.2830000000004,5709.9129999999996,6646.7269999999999,6309.58,6444.9,5440.6189999999997,4905.92,5885.0379999999996,6534.3549999999996,6262.8040000000001,6674.8770000000004,6592.7020000000002,6222.2370000000001,4308.4120000000003,3864.127,3418.3440000000001,3396.4870000000001,3806.2080000000001,4867.4440000000004,5835.1459999999997,6385.9369999999999,6261.54,6593.6639999999998,6585.9129999999996,6448.018,6986.076,6959.4219999999996,6404.2160000000003,6858.5259999999998,6465.3549999999996,6436.5510000000004,6061.0640000000003,6297.098,6142.6760000000004,6405.9840000000004,5954.9880000000003,6040.4160000000002,4529.3950000000004,4692.41,5217.6180000000004,5238.5379999999996,4917.42,5208.8059999999996,6150.0929999999998,6649.875,6645.7740000000003,6560.4669999999996,6463.7240000000002,5574.1440000000002,4974.2969999999996,5656.4549999999999,5871.2439999999997,6356.1559999999999,5163.0929999999998,5313.8549999999996,5886.91,6545.9870000000001,6332.2389999999996,6239.2479999999996,6190.8059999999996,5967.0519999999997,6597.0609999999997,6811.0429999999997,6089.2169999999996,6168.6570000000002,5506.63,5676.7759999999998,5758.9080000000004,6257.933,5758.1769999999997,5916.0669999999991,6141.5519999999997,6328.2110000000002,6580.9179999999997,6886.5889999999999,5775.3689999999997,4765.6580000000004,3496.4920000000002,5080.473,5562.59,6510.018,5286.5910000000003,5409.01,4807.43,4258.2139999999999,4287.6310000000003,6102.67,4895.3440000000001,4863.6350000000002,5834.9139999999998,5991.8040000000001,5773.7129999999997,5941.4759999999997,5886.2380000000003,5490.1840000000002,5348.8280000000004,5486.22,6071.2219999999998,4980.9620000000004,4597.7120000000004,3661.9070000000002,3107.0479999999998,2174.694,2041.751,3682.3649999999998,3065.9859999999999,3445.7359999999999,4099.5609999999997,4098.3509999999997,4453.4639999999999,4585.1629999999996,3015.4140000000002,2964.835,1785.3620000000001,2230.875,2454.0859999999998,3212.9270000000001,1795.0940000000001,2689.4720000000002,3054.2979999999998,1997.712,1837.3240000000001,1696.0940000000001,1367.2760000000001,844.19683400000008,633.69799999999998,823.90599999999995,1322.5630000000001,2450.4160000000002,2835.7339999999999,2971.1260000000002,1987.136,1627.231,2039.8789999999999,2032.0486129999999,2457.4038539999997,2974.4650189999998,2432.4195129999998,2948.4235019999996,2720.7033280000001,4180.8431460000002,4063.6950200000001,4662.4023430000007,4277.9392369999996,3876.8079759999996,3785.3282969999996,5153.1715350000004,5282.5492160000003,4447.5217999999995,2513.8798659999998,3782.4844819999998,5060.6725450000004,4672.9444050000002,4817.1025840000002,3807.9670809999998,4055.686181,3912.991059,3590.3531819999998,2875.60752,2413.7797580000001,1236.1123049999999,886.62273400000004,1891.518836,2459.6907179999998,5224.8520420000004,4373.0724199999995,4538.5073350000002,4027.8202510000001,2505.6691579999997,4657.6442350000007,2110.0701949999998,734.00893200000007,1133.9871780000001,1211.551655,3173.254261,5006.6336359999996,5377.0367819999992,5051.7544179999995,5683.6394019999998,4389.4222249999993,3143.3211120000001,4043.5989749999999,4886.6641509999999,2921.1523240000001,2565.2193220000004,2935.1636430000003,2805.889373,5324.0885470000003,6056.5782090000002,5191.5701469999995,4587.5133660000001,4301.7355809999999,4564.057847,4615.1620010000006,2580.6460729999999,1780.3059979999998,1662.7854399999999,881.77148999999997,1010.611485,2030.0312289999999,3641.6004579999999,3380.0246779999998,4295.6507499999998,4273.1180870000007,4448.3559960000002,5026.0080959999996,5158.2484850000001,3313.4886609999999,1765.5673359999998,1874.962368,3525.0074169999998,4275.5782120000003,4031.3058569999998,2962.4341600000002,2821.1507489999999,3901.3327119999999,4664.8877439999997,4128.1496340000003,3020.0704610000003,3488.6857170000003,1310.6821359999999,1360.590295,2254.3341909999999,2273.6508990000002,3488.1731800000002,3496.6442969999998,4125.149649,"-","-","-"]
[null,"Fuel + Gas",204.21799999999999,106.63200000000001,108.53100000000001,79.792000000000002,202.10499999999999,384.87799999999999,413.75400000000002,154.66399999999999,238.91200000000001,286.88600000000002,267.43900000000002,418.13499999999999,255.22300000000001,330.26900000000001,128.71299999999999,181.60300000000001,200.85400000000001,278.56799999999998,687.28200000000004,178.96100000000001,651.77,308.13900000000001,371.59300000000002,468.71,1299.375,1787.73,1434.2529999999999,698.91499999999996,614.41099999999994,147.673,415.72300000000001,221.51499999999999,529.48400000000004,185.83699999999999,87.533000000000001,41.134,95.265000000000001,339.47300000000001,343.83600000000001,259.45,99.405000000000001,120.458,38.927,88.599000000000004,185.27199999999999,52.688000000000002,79.194000000000003,74.58,99.884,90.411000000000001,115.89400000000001,122.31100000000001,19.071000000000002,97.451999999999998,377.67399999999998,54.8,84.703999999999994,118.869,64.489999999999995,166.625,152.78100000000001,37.526000000000003,143.05000000000001,120.69,108.38200000000001,288.23200000000003,593.74300000000005,231.72399999999999,578.34900000000005,658.57899999999995,432.286,315.82100000000003,15.11,185.81,257.11,138.06399999999999,30.667999999999999,162.97,265.834,140.58600000000001,231.84,97.462999999999994,243.30500000000001,274.57,261.459,382.80099999999999,453.16300000000001,496.78800000000001,437.55900000000003,493.38499999999999,819.47199999999998,582.31200000000001,735.84,822.64400000000001,542.72900000000004,524.38900000000001,69.924000000000007,100.93300000000001,152.994,52.481999999999999,36.298000000000002,200.45699999999999,473.96899999999999,507.113,713.85500000000002,389.214,997.22,1644.422,1502.4580000000001,1861.3040000000001,1086.079,532.75699999999995,168.64400000000001,532.41,1127.99,686.73099999999999,596.71299999999997,154.83099999999999,413.447,687.29899999999998,1113.6690000000001,491.26400000000001,1132.8869999999999,724.64300000000003,174.01300000000001,674.13099999999997,890.41,736.76900000000001,1450.383,931.17499999999995,755.077,490.87799999999999,502.29,406.87400000000002,415.24599999999998,162.84899999999999,332.142,1148.567,1351.6949999999999,1201.8900000000001,1299.134,1281.4549999999999,1320.4590000000001,2157.018,2663.5720000000001,1619.6969999999999,1419.443,1389.165,1086.731,1639.8030000000001,1896.914,889.726,1207.8599999999999,878.51300000000003,477.95100000000002,376.30700000000002,581.38300000000004,499.10700000000003,206.44800000000001,78.707999999999998,237.10300000000001,1224.425,1186.8030000000001,1068.492,943.46799999999996,648.37199999999996,347.553,409.78,431.41399999999999,344.90600000000001,608.28800000000001,174.5,312.65300000000002,737.54499999999996,1090.75,714.63199999999995,946.65800000000002,578.89200000000005,466.279,682.95100000000002,916.31399999999996,1095.0899999999999,1363.62,371.74299999999999,521.77099999999996,1160.585,1354.2950000000001,407.67500000000001,515.48199999999997,357.86500000000001,420.92899999999997,808.94899999999996,760.53599999999994,627.52300000000002,291.553,282.34699999999998,230.67099999999999,521.58600000000001,1004.05,339.096,760.59699999999998,340.62799999999999,131.166,106.30500000000001,102.61,220.43700000000001,191.126,113.172,166.47399999999999,83.596000000000004,272.95100000000002,212.661,233.035,127.13200000000001,199.01599999999999,168.55500000000001,142.142,124.255,70.555000000000007,137.19999999999999,147.767,248.85499999999999,154.96299999999999,242.51900000000001,189.06899999999999,200.066,227.26599999999999,190.238,128.80699999999999,119.209,191.56200000000001,137.76900000000001,91.483999999999995,147.09100000000001,212.322,171.65,154.518,104.51600000000001,165.87799999999999,164.78399999999999,153.209,126.666,22.518000000000001,105.508,163.869,165.56899999999999,138.49199999999999,113.152,138.31899999999999,124.90300000000001,166.81100000000001,147.00700000000001,-0.75117,-0.70843100000000003,-1.3620289999999999,-1.231732,-1.1803299999999999,-1.0784770000000001,-0.85597699999999999,-0.82121299999999997,-0.55512699999999993,-0.64519899999999997,-0.52432600000000007,-0.29833199999999999,-0.16912200000000002,0.43972300000000003,-0.443245,-0.499587,-0.45920800000000001,-0.35094600000000004,-0.36164999999999997,-0.46586300000000003,-0.40523300000000001,-0.348777,-0.25768400000000002,-0.49104899999999996,-0.19209299999999999,-0.20697100000000002,-0.18342900000000001,-0.266627,-0.17045500000000002,-0.15310099999999999,-0.15352299999999999,-0.14319399999999999,-0.126245,-0.12820899999999999,-0.136351,-0.15251699999999999,-0.14873900000000001,-0.13475299999999998,-0.1409,-0.10732699999999999,-0.109851,-4.2238999999999999E-2,-4.0735E-2,-3.7552999999999996E-2,-3.7085E-2,-2.0548999999999998E-2,0,0,3.2200000000000002E-4,0,9.2750000000000003E-3,0,0,0,0,7.0210000000000003E-3,0,0,0,0,0,2.3599999999999999E-4,0,0,0,0,0,0,-9.9999999999999995E-7,0,0,0,0,0,9.9999999999999995E-7,-9.9999999999999995E-7,0,0,0,-9.9999999999999995E-7,0,0,0,0,0,0,0,0,-9.9999999999999995E-7,0,9.9999999999999995E-7,-9.9999999999999995E-7,0,"-","-","-"]
[null,"Ciclo combinado","-","-","-","-","-","-","-","-","-","-","-","-","-","-","-","-","-","-","-","-","-","-","-","-","-","-","-","-","-","-","-","-","-","-","-","-",0.21299999999999999,"-","-","-","-","-","-","-","-","-","-","-","-","-","-","-","-","-","-","-","-","-","-","-","-","-","-","-","-","-","-","-","-","-","-","-","-","-","-","-","-","-","-","-","-","-","-","-","-","-","-","-","-","-","-","-","-","-","-","-","-","-","-","-","-","-","-","-","-","-","-","-","-","-","-","-","-","-","-","-","-","-","-","-","-","-","-","-","-","-","-","-","-","-","-","-","-","-","-","-","-","-","-","-","-","-","-","-","-","-","-","-",121.518,305.00700000000001,520.59400000000005,763.19200000000001,1165.914,1151.1369999999999,610.33199999999999,517.97900000000004,436.83199999999999,845.81500000000005,761.98099999999999,386.589,799.41600000000005,1781.1379999999999,1927.3420000000001,1793.886,2025.4680000000001,1795.77,1208.1959999999999,863.65300000000002,1541.807,1943.2280000000001,2272.9110000000001,1822.15,2011.424,2317.6480000000001,2722.288,2333.433,2921.5369999999998,2845.4029999999998,2763.1559999999999,2817.86,3347.6289999999999,3357.8130000000001,3345.9479999999999,3237.21,3507.2539999999999,4645.3109999999997,5188.2110000000002,4424.9160000000002,4433.4340000000002,4074.636,4170.7370000000001,4113.6899999999996,5549.6480000000001,5482.8220000000001,4705.1390000000001,4650.8059999999996,4929.5569999999998,5469.55,6664.4570000000003,4828.1819999999998,6324.433,5050.22,4256.4570000000003,4211.1629999999996,6046.6490000000003,3813.0230000000001,3823.5529999999999,4054.7080000000001,4329.2470000000003,6168.9219999999996,6583.8389999999999,5145.5169999999998,5637.6090000000004,6092.1170000000002,7608.1620000000003,7269.5219999999999,7999.7709999999997,7995.5810000000001,6774.8040000000001,6899.11,7196.2809999999999,7596.2740000000003,8863.5310000000009,8223.3009999999995,7817.5169999999998,7214.4549999999999,6826.1670000000004,5693.94,5970.2749999999996,4444.1909999999998,5032.6499999999996,5434.4449999999997,5603.4830000000002,7620.6459999999997,8497.5750000000007,8177.8140000000003,7385.0879999999997,6555.009,5522.15,6135.9579999999996,5308.0950000000003,4758.78,4086.5899279999999,4360.6160999999993,4552.942,5475.442,6782.4560000000001,5736.69,6235.23,5277.7479999999996,5529.0940000000001,4851.2572170000003,5010.4244009999993,4611.3775599999999,3920.5870869999999,2762.083208,4128.7315230000004,4823.5385190000006,4491.7070779999995,4664.7108739999994,4452.0298750000002,3691.328391,3327.9590680000001,3308.7363620000001,4196.2096069999998,3847.953802,3054.3282039999999,2206.3189240000002,2377.2222299999999,3078.7453220000002,3332.4074389999996,3448.7670279999998,2857.03208,3207.4501540000001,2928.88708,2781.4678009999998,2586.2915899999998,1937.659987,1471.6321070000001,1100.374634,1614.9021839999998,1355.6113289999998,2202.2878309999996,2349.8475049999997,2217.7022310000002,2519.763735,2016.0933170000001,2754.3908550000001,1530.5396040000001,1251.3792229999999,1265.537718,1215.723947,1400.6746000000001,1753.971781,1838.6284459999999,2202.131046,2642.3545060000001,2122.3884980000003,1909.1923870000001,1987.9868689999998,2199.3236120000001,1684.4431119999999,1608.3305270000001,1653.277075,1579.1855600000001,1863.0139920000001,3388.7775769999998,2322.7477469999999,1957.794126,2081.342752,2082.3589539999998,2613.9505260000001,1860.4619439999999,1295.8181890000001,1322.9841059999999,1155.7703039999999,1482.041935,1871.712477,2360.6466839999998,2002.2220149999998,2126.5412969999998,3282.4430419999999,3414.9835800000001,3287.440685,2911.5413089999997,1505.758904,1428.4312960000002,1228.2553559999999,1593.5105449999999,3169.0061090000004,3735.905906,3454.4160280000001,3197.9247850000002,3848.6854700000004,4546.437715,3028.112431,2254.6323689999999,1950.724201,1248.0405949999999,1200.6612050000001,1968.4294669999999,2180.1267059999996,2229.279387,2663.0555370000002,2148.659568,"-","-","-"]
[null,"Régimen ordinario",12926.357,10581.564999999999,11416.075000000001,10457.180999999999,10461.036,10796.148000000001,11461.204000000002,10093.407999999999,10840.496000000003,10968.464000000002,11589.866000000002,12786.873000000001,13239.38,12083.618999999999,11425.396000000001,10980.723,11130.630999999998,10763.272000000001,11766.474,10313.691000000001,11266.512000000002,11548.643999999997,11906.550999999998,12314.346000000001,13871.503000000001,12736.595000000001,12381.88,10961.814999999999,10802.923000000001,10285.013999999999,11866.487999999999,10455.599000000002,11178.235999999999,11482.254000000001,11277.127,11860.464999999998,12705.377,11469.427000000001,12041.353999999996,10605.519999999997,10558.738000000001,10609.397000000003,11305.952000000001,10596.652,10976.277999999998,11325.451999999999,11747.044999999996,12188.336999999998,12685.643,11582.145,11358.462999999996,10920.803999999998,10944.569999999998,11311.628000000002,12222.555,10973.152999999998,11210.371000000001,10980.558999999999,11198.065000000001,12145.179000000004,12953.626000000002,11018.559000000003,12159.843999999999,10853.870000000004,11374.402999999997,11491.358,12141.378000000001,11184.483999999999,11280.693999999998,11320.003000000002,11578.094999999999,12373.954999999998,13470.736999999999,12799.213000000002,12315.147000000001,10601.276999999996,11212.282999999999,11508.811,12185.666999999999,10967.458999999999,11271.293000000001,11934.769000000002,12151.593000000001,12597.085999999999,14083.578000000001,11471.970000000001,11878.418999999998,12128.93,12304.189,12148.918999999998,13009.237000000003,12394.627000000002,12693.870999999999,12522.63,12636.612000000001,13761.592000000001,13369.915999999999,11969.025,12419.051000000001,11834.460999999999,11827.589000000002,12442.531000000001,13641.856999999998,12326.652,12874.096,12543.050000000001,12934.402,14321.236000000001,14458.407000000001,13049.906999999999,13078.465,11538.88,12115.561000000002,12702.124,14042.931,12642.026999999998,13255.187999999998,12904.402,13673.998,14536.451000000001,15736.309000000003,13497.509999999998,14079.450999999999,12797.216999999999,13250.671000000002,14032.49,14503.346999999998,13730.665000000001,14016.970000000001,13696.626,14495.565000000001,14979.624,16089.006000000001,14193.431,14863.669000000002,12645.645,13830.507000000001,14496.214,15167.697,14697.792000000001,14172.29,14437.813999999998,14989.92,16426.213,16693.004000000001,14071.603999999999,14372.266,13911.524999999998,14388.041000000001,15097.285,15800.802,14382.479000000003,14621.029000000002,14723.314000000002,14507.519000000002,15172.174999999999,16708.429,15726.468000000001,15179.310999999998,13592.332,14415.543999999996,15912.103999999999,17171.198,16407.002,15412.097000000002,15426.892,15466.623,16435.541000000001,16568.126,16449.046999999999,17098.934000000001,15006.021999999999,15529.905000000002,16707.550999999999,17927.985999999997,16541.084999999999,16414.573000000004,15859.625000000002,16551.557000000001,17087.504000000001,18243.370999999999,16973.586000000003,17044.812000000002,14837.507000000001,15523.875,17313.733999999997,18237.486000000001,16373.689999999999,17006.422999999999,16261.470999999998,17433.355999999996,18668.195,20262.534,18010.791999999994,17541.668999999998,14393.763999999999,16535.659,17910.976000000002,20594.048000000003,16754.415000000001,18085.466,16521.769,16682.085999999996,18675.330999999998,19751.378000000001,16523.958999999999,17507.055,16888.804,16579.203000000001,17333.553,19039.929,16995.284,17670.181,18206.593000000001,18648.744999999999,19925.703000000001,19800.373,18855.427,16917.789000000001,16495.352000000003,17109.577999999998,17260.227999999999,19220.999,17954.337,17194.444,16941.185000000001,16678.165000000001,17574.968000000001,18220.623,15040.960000000003,14569.678,13304.255000000001,13795.37,15569.023000000001,17482.846000000001,16761.399000000001,15545.411,14898.662999999999,13498.447,15042.440999999999,16581.893950000001,14727.736116999997,15244.312545999999,14236.158649999999,13329.089481999999,14764.740740000001,17347.935098000002,15963.713582,15824.488311999999,14344.450218,14687.169635999999,15440.754387000001,16471.41302,13990.234121000001,14684.329463,12781.855158999999,13100.6481,13994.759070000004,14863.235713000002,15331.056199000002,15220.180357000001,13730.154474999999,13701.550903999998,13956.959857,16120.522308000003,15432.581054,14255.458314,11494.520515,12739.634865,13483.907244000002,14614.282050999998,15047.266190000002,13067.022595999999,14057.660775000002,12749.140076,13091.352761999999,12741.418513000001,11962.432322000001,12095.714927999999,11333.407662,10750.182605,10882.026612999998,14910.742237,13642.510639999999,13147.246913000003,12612.207079999998,11094.342801000003,13642.071615000001,"-","-","-","-","-","-","-","-","-","-","-","-","-","-","-","-","-","-","-","-","-","-","-","-","-","-","-","-","-","-","-","-","-","-","-","-","-","-","-","-","-","-","-","-","-","-","-","-","-","-","-","-","-","-","-","-","-","-","-","-"]
[null,"Hidráulica/Resto hidráulica",105.99199999,92.305999990000004,64.729999989999996,90.829000010000001,84.022999960000007,91.299000000000007,55.459000000000003,57.632000010000006,34.01199999,69.633999989999992,110.01000001,126.70600002,179.13800000000001,122.81100000000001,215.011,190.10900000000001,195.07300000000001,144.59399999999999,99.561000000000007,80.388999999999996,78.209000000000003,93.88,141.988,164.018,125.13500000000001,89.668999999999997,114.31100000000001,191.75700000000001,193.59,203.803,181.00200000000001,118.066,117.869,215.52699999999999,233.875,297.16899999999998,208.39500000000001,120.724,171.35300000000001,192.554,247.309,207.114,151.58000000000001,102.715,108.434,243.80099999999999,228.351,251.898,342.685,275.54899999999998,261.048,218.69300000000001,253.36600000000001,170.89599999999999,113.035,101.443,106.75,171.69800000000001,238.982,221.12299999999999,329.74799999999999,321.577,299.32900000000001,168.03299999999999,176.27099999999999,142.42699999999999,114.44499999999999,86.066999999999993,110.54,88.179000000000002,129.774,256.48399999999998,431.99400000000003,394.01900000000001,364.69799999999998,371.68,349.161,242.65199999999999,197.03100000000001,174.12299999999999,161.74299999999999,181.57599999999999,235.11199999999999,440.05799999999999,440.79199999999997,368.97300000000001,267.72199999999998,216.18199999999999,261.68,278.39100000000002,254.60499999999999,204.18799999999999,190.68700000000001,154.25,310.86200000000002,480.66300000000001,492.71681900000027,339.41051800000037,327.06436500000001,403.45852500000007,412.07627199999973,315.95694499999991,207.93444699999981,197.43269499999997,167.836814,248.31532999999988,203.70192800000009,262.56925899999993,323.52239599999979,292.89981199999983,373.90223100000003,348.71718900000002,443.13831299999953,296.52359400000012,224.70694300000005,189.84542699999983,210.82529300000019,274.4117980000002,366.44797700000021,395.38163899999972,330.40558000000061,282.4367390000001,249.44621600000002,435.78321799999981,494.62790899999982,357.92745100000013,254.29291899999987,199.41030499999974,158.61218700000026,230.15518499999985,367.53720900000002,475.46501499999971,558.92030299999965,485.9960640000001,596.9482809999995,489.46396500000048,476.68399000000039,352.76099499999998,300.49062999999978,227.07167800000002,181.60083700000001,202.50831499999984,222.42956999999993,192.64800500000001,255.92034899999996,271.46624000000031,345.5155519999999,361.37205199999977,420.06244200000003,357.79012199999954,235.872343,210.05402300000023,204.41109700000004,280.620946,390.81764499999963,565.54952800000058,581.19393900000068,453.43333999999987,562.61659000000009,532.27852599999949,529.63067400000057,359.33567800000003,277.91316899999993,209.44763500000025,208.93049999999982,309.71749599999981,485.77285999999998,578.37363800000003,587.99536900000066,427.62895799999984,507.79213800000031,547.04272999999989,572.54148200000088,412.62300300000021,336.46757500000012,259.27092500000015,199.83813299999983,245.59888100000015,329.70104599999968,323.07814500000035,350.78451000000035,292.22942700000004,386.56584999999961,465.50854399999992,438.71030300000024,297.45351899999991,244.46804400000011,191.04961800000027,151.16209100000012,217.90684300000004,377.39904099999995,404.34514899999988,400.55887300000069,320.87833499999977,567.0589700000005,506.03915599999999,360.07454500000034,248.51400000000001,226.34899999999999,177.815,164.14,312.404,381.88099999999997,482.851,345.48899999999998,478.79599999999999,516.02800000000002,529.75900000000001,509.19,412.91699999999997,302.21199999999999,256.50099999999998,186.13399999999999,186.88800000000001,189.87299999999999,211.53800000000001,340.20600000000002,233.21799999999999,301.23399999999998,581.11099999999999,613.279,581.55499999999995,380.40899999999999,264.58100000000002,212.28,190.523,400.12099999999998,539.62599999999998,521.05499999999995,629.452,559.84500000000003,501.44200000000001,577.14200000000005,468.387,365.35300000000001,282.64999999999998,242.869,230.81,466.05,608.61800000000005,764.37,616.57799999999997,784.76,690.19600000000003,688.34299999999996,608.94799999999998,459.60300000000001,341.74799999999999,281.05,318.88900000000001,567.66,702.17499999999995,680.26890200000003,514.72606699999994,678.30341599999997,600.72045100000003,495.57473800000002,411.23994699999997,390.04866200000004,309.00624300000004,235.26802900000001,195.355198,428.95937500000002,454.90848299999999,342.608993,334.62582700000002,328.27350199999995,472.96415999999999,650.04331000000002,443.549172,342.51501299999995,267.27436399999999,203.239734,273.90297100000004,415.34670299999999,631.73454500000003,680.13350600000001,703.02945299999999,864.22274500000003,867.15281600000003,804.82480500000008,680.79212699999994,549.278999,408.98983399999997,311.728589,351.29377600000004,535.73012699999992,526.83203000000003,"-","-","-","-","-","-","-","-","-","-","-","-","-","-","-","-","-","-","-","-","-","-","-","-","-","-","-","-","-","-","-","-","-","-","-","-","-","-","-","-","-","-","-","-","-","-","-","-","-","-","-","-","-","-","-","-","-","-","-","-"]
[null,"Eólica",0.115,0.19899998999999999,0.18,0.189,0.17399999999999999,0.12,0.26,0.186,0.13100000000000001,0.17,0.20699999999999999,0.25599999000000001,0.192,0.14299999999999999,0.21199999999999999,0.56200000000000006,0.32200000000000001,0.2,0.184,0.21199999999999999,0.14399999999999999,0.24199999999999999,0.27100000000000002,0.18099999999999999,0.26200000000000001,0.22500000000000001,0.313,0.20699999999999999,0.19500000000000001,0.16300000000000001,0.19500000000000001,0.66600000000000004,1.2949999999999999,2.137,2.5070000000000001,9.1959999999999997,7.1150000000000002,11.385999999999999,7.3259999999999996,6.1639999999999997,5.2709999999999999,7.9740000000000002,7.391,6.9809999999999999,5.6310000000000002,7.1980000000000004,6.7279999999999998,5.6029999999999998,6.899,4.8140000000000001,8.7690000000000001,6.859,4.97,6.4619999999999997,3.859,5.3929999999999998,5.0469999999999997,6.3360000000000003,7.78,5.6719999999999997,7.87,7.6749999999999998,8.4960000000000004,11.901999999999999,9.2110000000000003,8.8979999999999997,14.465,17.63,14.853,27.623000000000001,13.795,17.439,18.829999999999998,22.030999999999999,24.646000000000001,26.102,23.157,27.099,25.434000000000001,15.643000000000001,22.706,30.321000000000002,31.616,36.543999999999997,39.627000000000002,32.179000000000002,46.04,56.365000000000002,39.409999999999997,43.759,57.268000000000001,41.052999999999997,45.835000000000001,69.47,72.793999999999997,76.084999999999994,85.726278999999991,73.041770999999997,100.15667400000001,97.154274999999998,87.936697000000009,72.687051000000011,112.78895799999999,131.01327799999996,104.74763500000003,104.14675399999999,128.51891699999999,138.738417,159.91106499999998,214.37513500000003,206.77279700000003,190.99942600000003,173.14856599999996,212.21415299999998,177.00095900000005,139.30212900000004,172.17858000000001,199.35031500000005,312.98064799999997,315.79952500000002,305.02478600000001,295.11369999999994,338.14951600000018,416.02144200000009,226.957358,365.846115,360.05244799999997,315.70721200000003,276.36600500000014,409.72117300000014,544.09382199999982,609.44247300000018,594.73167599999999,573.65477800000008,654.24861100000021,650.22456599999998,424.36108700000011,408.90728200000012,400.20572300000021,374.72081200000002,611.54289400000005,574.769948,768.828981,557.95175500000039,657.00929500000052,782.54075799999964,795.79277999999965,618.78730799999983,820.58633199999974,646.36536599999977,693.5828309999996,598.4340899999994,505.37139599999978,869.00001900000052,1056.9575050000003,1214.8690069999998,1395.1710190000006,997.62484999999981,837.86062599999968,1138.0008659999992,901.86601600000074,703.48306400000013,727.40598099999977,543.97083900000018,781.24529999999993,1086.9553520000009,1172.985179,1433.6770410000006,1685.3449229999994,1074.4477040000002,1281.2794619999981,1519.3727670000001,1019.3578530000005,1048.3327160000013,970.02610899999979,1114.316325,1147.637898,1635.2691430000013,1511.2452730000009,1747.4875960000002,1879.1933479999996,1745.3139569999989,1763.5135970000013,1926.4580810000014,1492.0681999999997,1261.4607640000008,1611.0284699999993,1640.4408529999992,1271.4945329999998,1902.7245970000004,1958.5321529999999,2405.4374059999986,1563.7009309999996,1924.8670310000009,2788.2671979999986,1955.917235000001,1670.5176799999992,1364.4480000000001,1171.7909999999999,2177.8209999999999,1465.816,2334.8020000000001,2279.5230000000001,2183.3850000000002,2149.8069999999998,2871.9189999999999,3086.2469999999998,1356.316,2605.873,1786.288,1888.6089999999999,2419.819,2028.855,1907.625,2752.3119999999999,2395.4850000000001,2651.4679999999998,2018.9480000000001,4092.55,3352.6860000000001,1737.1610000000001,2085.509,2124.2370000000001,1972.5229999999999,2129.8850000000002,2482.0129999999999,3462.6880000000001,3648.1819999999998,3503.799,3226.32,3100.5160000000001,3059.6579999999999,2698.0039999999999,2332.395,2426.1289999999999,2235.837,2466.7310000000002,3125.33,4792.63,4921.2280000000001,4292.0919999999996,4622.4350000000004,4546.5469999999996,2634.819,3619.3339999999998,2576.1970000000001,2798.1329999999998,2894.7440000000001,2301.3229999999999,3952.8310000000001,4348.0590000000002,4621.8819999999996,4021.6643770000001,4028.6172820000002,4692.9673940000002,3399.8872000000001,3166.0120389999997,2937.4943399999997,3254.704718,2730.8525729999997,2322.956455,3152.1980950000002,3819.8568319999999,4588.5757880000001,3648.791131,5018.8625980000006,3811.353286,5306.3904899999998,3707.8793420000002,3429.2009370000001,2981.9125909999998,3126.884376,3940.3415269999996,3129.8213919999998,4604.8423119999998,5449.977965,6291.5742340000006,5340.9964380000001,5749.1031590000002,4396.7821030000005,3932.3500819999999,3827.0522629999996,2844.212849,3411.0235109999999,3214.2725030000001,3963.879786,6429.8138399999998,4943.4400140000007,6540.9186050000008,5884.2852869999997,5050.0050980000005,3950.2180450000001,4134.8413840000003,3275.5992140000003,3591.601846,2857.5115260000002,2132.6135279999999,3382.7660619999997,5071.980759,4764.3211100000008,4912.4598219999998,5948.1740439999994,4865.124194,3904.5184380000001,4800.4531200000001,2873.2880989999999,3053.3742540000003,3237.3727000000003,3002.6945469999996,3889.9814689999998,3699.8798859999997,3528.5615720000001,5604.84411,6068.142812,5409.6029699999999,4414.6531100000002,3902.1857669999999,3226.8572280000003,3464.678578,3603.8620529999998,2666.8878199999999,2376.0109070000003,3888.7489649999998,2671.6893480000003,4796.9646359999997,4905.5372690000004,4687.8387709999997,4177.3396290000001,3440.3491309999999,3152.0795880000001,3336.7890189999998,3296.3615829999999,2817.340224,3186.7215690000003,3957.8393489999999,5753.2710480000005,5286.0049170000002,4633.5825560000003,7650.1390379999993,4409.5657819999997,3253.8841389999998,2571.6879290000002,2478.2899400000001,3063.7690170000001,2403.2007760000001,"-","-","-"]
[null,"Solar fotovoltaica",0,0,0,0,0,0,0,0,0,0,0,0,0,0,0,0,0,0,0,0,0,0,0,0,1.01,0.77200000000000002,0.57199999999999995,1.2889999999999999,1.113,1.1639999999999999,1.3069999999999999,1.155,1.2230000000000001,0.94399999999999995,0.56999999999999995,0.93700000000000006,0.53800000000000003,0.53300000000000003,1.252,1.3029999999999999,1.05,1.069,1.2729999999999999,1.1930000000000001,0.88,0.72,1.2629999999999999,0.92600000000000005,0.97799999999999998,1.242,1.0649999999999999,1.208,1.742,1.484,1.635,1.6679999999999999,1.69,1.5209999999999999,1.004,5.8900000000000001E-2,6.4000000000000001E-2,6.8000000000000005E-2,0.112,0.11700000000000001,0.13200000000000001,0.111,0.105,9.6000000000000002E-2,9.0999999999999998E-2,4.8000000000000001E-2,9.0999999999999998E-2,2.7E-2,2.4E-2,3.3000000000000002E-2,4.7E-2,9.2999999999999999E-2,8.5999999999999993E-2,0.11700000000000001,0.107,0.10299999999999999,9.6000000000000002E-2,9.5000000000000001E-2,6.4000000000000001E-2,2.5999999999999999E-2,4.1000000000000002E-2,8.7999999999999995E-2,8.7999999999999995E-2,0.11899999999999999,9.2999999999999999E-2,0.107,0.14299999999999999,8.6999999999999994E-2,0.12,9.6000000000000002E-2,0.105,0.04,4.9634999999999999E-2,7.0578000000000002E-2,0.11298999999999999,0.11806,9.6176999999999999E-2,0.13051699999999999,0.13625000000000001,0.11049299999999999,9.6509999999999999E-2,0.11281099999999999,6.9553000000000004E-2,6.6723000000000005E-2,5.3642000000000002E-2,0.107873,0.15287999999999999,0.117727,0.12252399999999999,0.14707999999999999,0.159277,0.14216999999999999,0.121715,8.8742000000000001E-2,7.9733999999999999E-2,4.7816999999999998E-2,-2.6860999999999999E-2,0.101559,0.124075,1.2024E-2,0.205484,0.16091,1.9984999999999999E-2,0.29827199999999998,0.13695099999999999,0.12126000000000001,7.2305999999999995E-2,4.3852000000000002E-2,5.4684999999999997E-2,9.8405999999999993E-2,0.10854,0.17056499999999999,0.156555,0.197492,0.16886599999999999,0.21376400000000001,0.12875300000000001,0.163998,9.4907000000000005E-2,8.3112000000000005E-2,0.126051,0.22952900000000001,0.27410599999999996,0.39638100000000026,0.47843600000000014,0.47939100000000001,0.5380640000000001,0.53365199999999957,0.48980900000000005,0.41930600000000023,0.31798800000000005,0.27873900000000007,0.33177200000000012,0.40585699999999975,0.56218699999999999,0.71534800000000021,0.85679699999999903,0.97693399999999941,1.1408959999999975,1.0179979999999982,0.91532600000000108,0.80906499999999926,0.5318040000000005,0.66612099999999963,0.57597900000000002,0.83336899999999914,1.1270059999999986,1.3765969999999994,1.6380649999999966,1.9365689999999964,2.0151259999999924,2.030071999999997,1.8506319999999978,1.7061280000000048,1.3758539999999999,1.3286139999999964,1.3100380000000011,1.5964899999999982,2.7521050000000016,2.9168830000000008,3.6370650000000015,4.27022700000001,4.3964089999999914,4.5427230000000041,4.2910249999999994,3.9432079999999976,3.2481789999999919,3.1839970000000024,2.5656399999999966,4.3413879999999949,5.1637430000000002,7.3147159999999678,8.7745119999999783,10.192,11.021000000000001,13.52,11.63,9.9489999999999998,8.077,9.8260000000000005,9.6859999999999999,12.005000000000001,20.550999999999998,24.491,34.18,38.843000000000004,49.655000000000001,53.862000000000002,58.231000000000002,55.534999999999997,52.622,52.915999999999997,57.420999999999999,70.549000000000007,104.43300000000001,126.235,131.75399999999999,189.70699999999999,232.23400000000001,288.11200000000002,317.11099999999999,320.166,324.32100000000003,244.02699999999999,248.703,380.17399999999998,508.66199999999998,546.45500000000004,647.31700000000001,618.52800000000002,690.86199999999997,637.125,492.28899999999999,482.28500000000003,345.4,231.20500000000001,248.57499999999999,289.95,458.21699999999998,565.84,683.24800000000005,656.76599999999996,752.89,691.53200000000004,605.38800000000003,525.85500000000002,364.05200000000002,297.46899999999999,330.68600699999996,481.49165600000003,508.85102799999999,631.95621400000005,716.83767699999999,778.34355299999993,825.35251599999992,772.15048100000001,705.19609800000001,603.4457460000001,345.87802099999999,405.681805,482.67955800000004,635.51407200000006,736.9448000000001,627.60361,826.20912199999998,839.14592000000005,902.62741599999993,826.45653000000004,658.33498299999997,566.69292599999994,350.39532500000001,377.46511400000003,418.75289099999998,500.85101500000002,531.47993799999995,725.43592799999999,832.56004599999994,886.25145299999997,929.53256899999997,857.08086300000002,724.78513499999997,603.79004599999996,490.22813000000002,417.62809000000004,352.69103699999999,405.78451200000001,697.70298899999989,753.33708700000011,882.62790899999993,862.91634699999997,910.10322699999995,871.55282799999998,655.18204099999991,616.96482700000001,362.10219900000004,431.825917,493.21754399999998,469.24167199999999,677.67495999999994,718.22592500000007,880.71278599999994,848.44801699999994,888.93508099999997,793.67625100000009,691.73586899999998,510.878196,503.19186200000001,369.376374,337.68606399999999,452.53453100000002,674.59281199999998,686.153009,769.18945700000006,881.46239099999991,875.51018299999998,855.09481499999993,730.02335900000003,555.78306200000009,402.9502,358.23832900000002,452.33744199999995,419.297686,679.82795399999998,798.19205199999999,834.11876599999994,840.61535100000003,875.22784799999999,779.85282999999993,742.38754799999992,652.66983100000004,516.57625400000006,408.96712500000001,418.21396899999996,487.03556300000002,555.35785499999997,664.1976360000001,777.59795799999995,779.94395099999997,886.33224600000005,802.00636800000007,633.08384599999999,"-","-","-"]
[null,"Solar térmica","-","-","-","-","-","-","-","-","-","-","-","-","-","-","-","-","-","-","-","-","-","-","-","-","-","-","-","-","-","-","-","-","-","-","-","-","-","-","-","-","-","-","-","-","-","-","-","-","-","-","-","-","-","-","-","-","-","-","-","-","-","-","-","-","-","-","-","-","-","-","-","-","-","-","-","-","-","-","-","-","-","-","-","-","-","-","-","-","-","-","-","-","-","-","-","-","-","-","-","-","-","-","-","-","-","-","-","-","-","-","-","-","-","-","-","-","-","-","-","-","-","-","-","-","-","-","-","-","-","-","-","-","-","-","-","-","-","-","-","-","-","-","-","-","-","-","-","-","-","-","-","-","-","-","-","-","-","-","-","-","-","-","-","-","-","-","-","-","-","-","-","-","-","-","-","-","-","-","-","-","-","-","-","-","-","-","-","-","-","-","-","-",0,0,0,0,0,0,0,0,0,0,0,0,0,0,0.43099999999999999,0.34200000000000003,0.55800000000000005,0.88300000000000001,1.256,1.1160000000000001,0.63900000000000001,1.214,0.997,0.191,1.0840000000000001,0.79700000000000004,1.4610000000000001,0.95799999999999996,0.94199999999999995,1.9630000000000001,2.0379999999999998,1.98,0.85899999999999999,0.86599999999999999,1.27,1.1599999999999999,0.69,1.236,2.323,7.2039999999999997,7.6580000000000004,6.7519999999999998,12.414,23.867999999999999,17.539000000000001,23.446000000000002,16.183,10.51,13.151999999999999,11.682,23.731999999999999,36.92,69.084000000000003,72.531999999999996,104.59,121.9,100.917,71.745000000000005,31.619,33.747,39.743130000000001,88.657368000000005,98.457166999999998,137.83512100000002,160.44092499999999,247.970979,284.05997400000001,235.32909799999999,228.55802400000002,172.94973899999999,81.173647000000003,86.466376999999994,117.342049,200.34185399999998,235.11348100000001,177.77704500000002,348.382183,414.74907200000001,541.31674100000009,485.12652700000001,368.64290099999999,289.15457700000002,133.961873,135.585309,113.494435,204.009049,125.370378,300.89360499999998,499.267989,647.33005299999991,758.52291099999991,661.85580500000003,478.95522799999998,294.24195199999997,199.223861,158.362269,79.800654999999992,103.26450199999999,385.17531600000001,435.52705900000001,729.93555500000002,687.28808200000003,811.15318400000001,833.17848000000004,389.59590299999996,289.33703000000003,90.187433999999996,124.47172599999999,176.95139600000002,190.92526000000001,415.82866200000001,393.16048599999999,694.83874000000003,734.05393700000002,888.91770999999994,607.62348800000007,483.25015300000001,188.16886600000001,226.81775099999999,84.699065000000004,59.913641000000005,133.00979000000001,387.86076199999997,408.32323200000002,498.79538199999996,813.99067100000002,825.32457999999997,805.81879700000002,595.62669299999993,284.70289100000002,139.69961799999999,118.13564500000001,149.21208100000001,88.740902000000006,340.84468499999997,535.25547800000004,607.89817700000003,761.902153,812.88028599999996,692.43517500000007,608.14265499999999,398.79322200000001,220.652322,131.161056,112.387517,229.80815100000001,233.95594299999999,325.935092,477.20963399999999,551.29260299999999,858.89464800000007,688.557997,465.63993599999998,"-","-","-"]
[null,"Térmica renovable/Otras renovables","-","-","-","-","-","-","-","-","-","-","-","-","-","-","-","-","-","-","-","-","-",0.47899999999999998,0.19500000000000001,0.18,0.22600000000000001,0.185,0.20899999999999999,0.186,0.219,2.4910000000000001,0.85499999999999998,1.6519999999999999,2.1949999999999998,3.1859999999999999,2.8519999999999999,2.2930000000000001,2.7469999999999999,4.2910000000000004,5.55,5.08,5.1909999999999998,4.069,4.4050000000000002,5.0549999999999997,4.7699999999999996,5.9989999999999997,6.5289999999999999,5.1360000000000001,6.1820000000000004,4.2009999999999996,7.7879999999999994,12.483000000000001,22.434000000000001,14.593,25.895,34.064,35.963000000000001,40.081000000000003,55.064999999999998,63.701000000000001,52.516000000000005,54.168999999999997,59.649000000000001,59.275000000000006,60.629999999999995,38.39,56.09,56.16,55.471000000000004,65.760999999999996,51.017000000000003,62.140999999999998,61.97,55.767000000000003,73.194000000000003,69.39,67.606999999999999,74.480999999999995,76.311000000000007,76.088999999999999,74.905000000000001,70.728000000000009,57.923000000000002,56.715000000000003,56.474000000000004,46.637,55.156000000000006,57.041000000000004,57.334000000000003,33.856000000000002,57.003,53.271999999999998,57.103999999999999,61.066000000000003,58.17,55.262,29.002800999999998,53.305843000000003,61.54951100000001,62.649002999999993,69.878224000000017,68.57453000000001,70.406914,67.345651000000004,60.385233999999997,67.235011999999998,69.010128999999992,69.403475,71.806641999999997,67.74066400000001,76.241169000000014,70.55664800000001,71.228352999999998,64.031021999999993,80.270443,79.088937999999999,85.153421000000009,84.480839000000003,82.713457999999989,74.942079000000007,77.705164000000011,72.094493,81.578700000000012,75.639544999999998,57.155141000000015,64.878718000000006,80.062335000000004,78.219893000000013,86.225769,91.935601000000005,96.959690999999992,98.655336000000005,114.03217000000001,103.259727,115.38466,106.780576,116.22663500000002,163.25343300000003,164.15603399999998,142.64494099999999,174.91251699999998,184.36809099999999,170.80096299999997,182.63868100000002,102.326662,103.97290799999999,114.93776699999999,113.40504600000001,116.82101699999998,106.527145,125.927582,138.27553399999999,128.41537399999999,130.56901199999999,128.796967,143.04027199999999,125.499869,125.666718,141.367661,136.22556399999999,148.43464900000001,135.67495399999999,145.85112000000001,152.32964200000001,154.93832699999999,162.073384,144.46359000000001,164.51626000000002,165.78169199999999,141.425287,163.310002,158.00111900000002,158.15428799999998,141.57013900000001,142.66767899999999,139.21697600000002,148.774135,152.85692900000001,147.72687300000001,158.60851299999999,174.85460999999998,150.82777100000001,176.75611499999999,159.635672,172.11730599999999,162.54098200000001,167.51991400000003,173.00340799999998,160.25450599999999,152.959924,165.98202600000002,171.40583599999999,172.08671999999999,164.50467899999998,179.21714800000001,172.15726300000003,184.66687200000001,201.17400000000001,194.67,180.72499999999999,181.291,197.31100000000001,176.12700000000001,178.67599999999999,195.417,170.86799999999999,196.96199999999999,184.11799999999999,197.114,193.24700000000001,203.05199999999999,202.649,191.273,224.429,204.15700000000001,212.399,218.304,215.69800000000001,223.7,221.483,218.887,220.45099999999999,223.50399999999999,218.31,211.55500000000001,229.72499999999999,225.65600000000001,224.21600000000001,243.68600000000001,231.25299999999999,252.346,275.29700000000003,250.078,229.126,236.274,235.85900000000001,264.07600000000002,325.339,249.01,251.94300000000001,250.94,226.42400000000001,245.99799999999999,252.761,274.92500000000001,268.96100000000001,268.02999999999997,278.80399999999997,262.93700000000001,279.28699999999998,269.12099999999998,293.61099999999999,308.73294400000003,287.45968900000003,303.472871,300.471926,310.70748400000002,276.43802099999999,310.76003399999996,314.33858700000002,329.79729400000002,323.88618199999996,314.52318699999995,324.54230999999999,322.79019199999999,309.79683199999999,319.80314199999998,298.02233699999999,313.449904,325.355816,327.22878499999996,294.27426199999996,281.211839,313.54920600000003,326.44505900000001,350.53576799999996,357.49281000000002,329.59546999999998,354.57668100000001,364.007295,370.57197600000001,346.65876800000001,385.95173599999998,369.30743000000001,348.41126700000001,355.78567499999997,358.26062800000005,384.657422,379.98567800000001,293.11845699999998,304.87203600000004,265.60516799999999,329.26175900000004,329.26299,337.32765699999999,348.97107,332.3793,299.61996199999999,287.07016100000004,298.08923599999997,301.19545199999999,244.80938,273.68656800000002,200.96275800000001,274.11053499999997,287.24583000000001,308.87246299999998,316.55354999999997,306.444638,313.82398000000001,306.13780099999997,288.723792,269.58650900000004,260.66759300000001,254.62976800000001,209.02461499999998,276.21144600000002,286.84910400000001,310.28303399999999,325.98802899999998,306.89180200000004,305.478792,303.91302000000002,305.49562600000002,326.48964100000001,288.82950099999999,268.625631,231.78274199999998,297.73007900000005,301.62935900000002,332.48288700000001,315.27266900000001,308.60664700000001,308.82652000000002,306.82307199999997,311.65107799999998,295.34965500000004,300.78865500000001,269.07042999999999,237.13678899999999,290.86799699999995,303.747793,323.38886200000002,316.40050000000002,319.22702399999997,"-","-","-"]
[null,"Térmica no renovable/Cogeneración y resto/Cogeneración",35.685000010000024,38.351000019999979,45.945000009999994,29.542999990000006,39.724000039999993,36.553999999999988,59.265999999999998,54.415999989999989,70.548000009999996,79.426000009999981,86.149999990000012,79.248999989999987,95.989000000000019,93.531000000000006,115.05600000000001,116.111,113.29,97.624000000000009,119.55,109.12599999999999,134.50700000000001,150.72200000000001,140.30100000000002,150.17699999999999,158.54399999999998,156.649,153.35299999999998,133.67700000000002,150.357,147.03700000000003,147.13500000000008,155.59799999999998,159.136,169.63300000000004,179.52700000000002,192.23599999999996,216.233,207.39499999999998,238.97599999999997,228.40900000000002,230.78099999999998,243.42200000000008,273.03300000000002,222.17500000000004,290.86800000000005,356.51100000000002,393.02699999999999,406.67399999999998,424.01199999999994,397.50999999999993,428.83,427.68300000000005,448.76199999999989,440.01700000000005,418.09199999999998,419.03999999999996,459.93099999999993,463.43,473.75599999999997,510.92809999999992,488.05499999999995,461.94399999999996,538.60199999999998,514.274,531.6149999999999,523.03700000000003,524.91700000000003,510.6640000000001,559.84399999999994,605.28700000000003,625.35600000000011,657.15800000000013,649.31399999999996,674.23500000000001,693.76300000000003,721.26300000000015,706.92700000000013,708.29699999999991,764.04299999999989,721.08300000000008,746.32599999999991,827.94400000000007,871.21600000000001,907.40899999999999,907.43,826.93799999999999,929.04899999999986,911.04300000000012,932.33899999999994,902.09600000000012,984.03500000000008,910.40900000000011,947.55,1078.5139999999999,1050.981,1082.232,1132.4634659999997,1055.3262899999995,1179.4824599999999,1140.4561370000001,1143.3816300000001,1071.931957,1169.5214310000001,1090.5068830000002,1176.458807,1306.9340929999998,1295.514473,1406.3031259999998,1379.8752550000006,1318.561516,1436.0569230000001,1384.7270100000001,1425.3322440000002,1390.930151,1434.8443779999998,1350.318336,1395.920991,1537.4033059999997,1510.1531829999997,1573.1489400000003,1568.0163309999991,1437.8635089999998,1555.5964929999996,1469.5937710000005,1469.0271080000005,1426.760806,1439.9263130000002,1348.3463180000001,1376.7260879999997,1451.7187810000003,1351.8059720000003,1484.1733240000003,1509.9821660000005,1420.9730249999998,1480.3319080000003,1391.9773279999997,1478.9017329999997,1418.0977979999996,1481.5337469999999,1315.0298049999999,1436.0749989999999,1554.6446480000002,1587.637579,1581.5034469999994,1753.946643,1624.3835650000003,1752.2777950000002,1751.5292130000003,1747.5227730000001,1607.2819760000004,1731.7671800000005,1586.2397010000004,1675.7063240000002,1903.9247169999992,1846.9618950000001,1850.1104539999997,1949.8964009999988,1795.4542350000002,1917.1289360000001,1863.5466960000015,1892.4928639999987,1805.7993700000002,1913.7958340000005,1744.9618859999998,1903.9135469999999,2075.8847029999993,1958.6965669999997,2023.7759399999993,2046.9260369999997,1962.1146819999997,2107.6563920000017,1979.8427870000005,1934.4913119999985,1817.9965729999983,1921.3405109999997,1769.4697020000003,1826.6772020000005,1981.9419189999987,2074.2319539999994,2106.015132,2043.0234940000005,1951.7983550000013,2095.8113329999996,2039.9988199999989,2040.2971259999995,1919.5815079999988,1935.7391630000006,1786.1623980000002,1917.1898449999997,1838.2194279999994,1867.2426009999992,1828.6396120000024,1998.0738359999998,1940.3785669999995,2060.4519410000007,1910.7046299999986,1907.4363910000006,1747.2180000000001,1731.357,1635.847,1728.153,1850.3889999999999,1883.634,1925.296,1984.567,1757.03,1865.8879999999999,1831.5619999999999,1829.89,1893.941,1990.347,1868.579,1956.135,2102.7629999999999,2100.0659999999998,2146.989,2251.9169999999999,2226.8589999999999,2271.9859999999999,2229.3420000000001,2106.663,2078.8119999999999,2217.9769999999999,2016.6590000000001,2177.9,2358.9569999999999,2314.2759999999998,2324.6280000000002,2421.9630000000002,2242.4059999999999,2406.6460000000002,2338.3670000000002,2351.1260000000002,2309.7330000000002,2396.5940000000001,2034.3920000000001,2337.3000000000002,2464.42,2571.2600000000002,2591.7269999999999,2661.2139999999999,2477.0210000000002,2616.777,2550.3539999999998,2581.357,2541.7829999999999,2613.6729999999998,2153.4079999999999,2523.7640000000001,2647.1170000000002,2659.6819999999998,2762.902,2637.9247930000001,2468.567039,2765.528159,2555.1694630000002,2602.254191,2487.0247790000003,2498.4654389999996,2077.3425870000001,2506.0480159999997,2619.6466989999999,2629.9001359999997,2707.2393830000001,2824.207934,2688.8863539999998,2856.5180920000003,2710.3599939999999,2737.0965510000001,2608.5837310000002,2707.3400539999998,2274.1782480000002,2648.8138530000001,2805.4533550000001,2748.4382459999997,2807.9120210000001,2899.6261049999998,2591.5031760000002,2803.6361540000003,2743.1572639999999,2753.0895770000002,2580.8803240000002,2571.729292,1990.4273659999999,2401.2081120000003,2473.0463439999999,2473.0796409999998,2528.5604119999998,2548.3761400000003,1874.3724709999999,1829.3688940000002,1617.9048479999999,1929.810131,2073.645,2116.72001,1983.2143060000001,2110.9175699999996,2125.3989120000001,1932.1215950000001,1986.171421,2161.008875,1922.5255730000001,2077.93867,2011.9054450000001,2074.2588209999999,2062.5413140000001,2157.7078580000002,2036.5586929999999,2148.7054870000002,2211.2174619999996,2126.7597089999999,2178.2001320000004,2127.6710469999998,1967.5645930000001,2069.460799,1992.4880169999999,2113.6067389999998,2167.7305540000002,2239.7825550000002,2120.5986719999996,2135.1723550000002,2318.6465240000002,2295.9331069999998,2325.28728,2449.5983719999999,2206.4584759999998,2390.974647,2233.4769799999999,2327.2263800000001,2315.3605090000001,2398.0747679999999,2257.6581030000002,2272.5539779999999,2392.9653020000001,2441.5411549999999,2489.4079710000001,2480.4490580000002,2251.080739,2335.5272960000002,2353.5895970000001,2418.3062,2403.6461379999996,2432.0428059999999,2358.3318760000002,2391.9619229999998,"-","-","-"]
[null,"Residuos no renovables","-","-","-","-","-","-","-","-","-","-","-","-","-","-","-","-","-","-","-","-","-","-","-","-","-","-","-","-","-","-","-","-","-","-","-","-","-","-","-","-","-","-","-","-","-","-","-","-","-","-","-","-","-","-","-","-","-","-","-","-","-","-","-","-","-","-","-","-","-","-","-","-","-","-","-","-","-","-","-","-","-","-","-","-","-","-","-","-","-","-","-","-","-","-","-","-","-","-","-","-","-","-","-","-","-","-","-","-","-","-","-","-","-","-","-","-","-","-","-","-","-","-","-","-","-","-","-","-","-","-","-","-","-","-","-","-","-","-","-","-","-","-","-","-","-","-","-","-","-","-","-","-","-","-","-","-","-","-","-","-","-","-","-","-","-","-","-","-","-","-","-","-","-","-","-","-","-","-","-","-","-","-","-","-","-","-","-","-","-","-","-","-","-","-","-","-","-","-","-","-","-","-","-","-","-","-","-","-","-","-","-","-","-","-","-","-","-","-","-","-","-","-","-","-","-","-","-","-","-","-","-","-","-","-","-","-","-","-","-","-","-","-","-","-","-","-","-","-","-","-","-","-",106.3227535,95.162082500000011,82.495980500000002,102.94835950000001,70.163403500000001,88.736517500000005,75.959922500000005,84.326142000000004,96.779358999999999,123.575436,116.1072815,117.963598,124.1688765,112.84640399999999,110.281379,128.415032,119.8694345,104.18745750000001,113.600646,127.489637,131.05407149999999,142.80879949999999,121.463185,129.2869565,140.20411199999998,136.994911,139.54113599999999,79.729951,111.41108650000001,100.24098499999999,110.5039345,119.443185,134.10502450000001,142.83273749999998,135.91970000000001,149.223772,134.8419275,115.63052950000001,102.26726450000001,125.9423185,156.421807,151.9059905,156.31372200000001,169.77433199999999,176.352553,175.795556,169.6521315,198.445425,188.12493849999998,170.32091600000001,195.8192195,154.01119699999998,192.697857,196.30132500000002,210.19647499999999,213.78099449999999,202.416236,215.489239,203.286709,182.2696345,200.85968599999998,187.60618450000001,209.0865235,179.4145225,136.99703550000001,195.591038,242.9444475,243.15472949999997,236.99320800000001,230.03787149999999,205.3221455,203.3012535,216.856933,190.8861225,209.13019649999998,172.6677655,175.58351999999999,211.361659,200.62811600000001,215.23479399999999,213.315484,228.412195,206.525261,218.5118425,226.5715625,204.21008799999998,215.3954785,169.464494,137.027331,175.41569099999998,199.57543200000001,194.65527350000002,189.018788,"-","-","-"]
[null,"Residuos renovables","-","-","-","-","-","-","-","-","-","-","-","-","-","-","-","-","-","-","-","-","-","-","-","-","-","-","-","-","-","-","-","-","-","-","-","-","-","-","-","-","-","-","-","-","-","-","-","-","-","-","-","-","-","-","-","-","-","-","-","-","-","-","-","-","-","-","-","-","-","-","-","-","-","-","-","-","-","-","-","-","-","-","-","-","-","-","-","-","-","-","-","-","-","-","-","-","-","-","-","-","-","-","-","-","-","-","-","-","-","-","-","-","-","-","-","-","-","-","-","-","-","-","-","-","-","-","-","-","-","-","-","-","-","-","-","-","-","-","-","-","-","-","-","-","-","-","-","-","-","-","-","-","-","-","-","-","-","-","-","-","-","-","-","-","-","-","-","-","-","-","-","-","-","-","-","-","-","-","-","-","-","-","-","-","-","-","-","-","-","-","-","-","-","-","-","-","-","-","-","-","-","-","-","-","-","-","-","-","-","-","-","-","-","-","-","-","-","-","-","-","-","-","-","-","-","-","-","-","-","-","-","-","-","-","-","-","-","-","-","-","-","-","-","-","-","-","-","-","-","-","-","-",57.032729500000002,50.993014500000001,33.027413500000002,50.976274500000002,40.827454500000002,57.3867355,57.261440499999999,50.553341999999994,47.872501999999997,53.463645999999997,53.132019500000006,56.299527999999995,56.3013555,44.974485999999999,31.257473000000001,53.078470000000003,39.821430500000005,54.448398500000003,57.100842999999998,54.449194000000006,53.181955499999994,54.780555500000006,51.188628999999999,45.263191499999998,50.514924000000001,46.712419000000004,38.196781999999999,17.166903999999999,20.978891500000003,15.358893,20.559306499999998,35.316523000000004,48.522839500000003,45.476130499999996,48.379472,51.470923999999997,40.961053499999998,28.9339245,22.560322499999998,39.174100500000002,54.939254999999996,44.846376499999998,51.875004000000004,44.059013,54.613833,50.060762000000004,51.651715500000002,61.862726000000002,54.582733500000003,52.223671000000003,60.213873499999998,33.475764000000005,49.703733,58.970399,60.001640000000002,57.490990500000002,55.067411,60.863129000000001,60.056930999999999,60.005199500000003,57.299934999999998,48.103852500000002,57.529314499999998,26.702395499999998,24.278254499999999,55.115867999999999,63.646250500000001,60.315487500000003,62.051794000000001,60.050152499999996,64.739298500000004,69.907307500000002,64.737576000000004,55.999209499999999,59.911041499999996,46.575312500000003,34.262042999999998,66.986297000000008,68.889366999999993,65.701225000000008,62.429442000000002,66.129401999999999,66.55758999999999,69.971927500000007,69.2635705,62.195681999999998,65.909200500000011,66.929152000000002,24.344857999999999,50.806421,64.813796999999994,65.755174499999995,64.738028,"-","-","-"]
[null,"Régimen especial",141.79200000000003,130.85599999999999,110.85499999999999,120.56100000000001,123.92100000000001,127.973,114.985,112.23399999999999,104.691,149.22999999999996,196.36700000000002,206.21100000000001,275.31900000000002,216.48500000000001,330.279,306.78200000000004,308.685,242.41800000000001,219.29500000000002,189.72699999999998,212.86,245.32300000000001,282.755,314.55600000000004,285.17700000000002,247.5,268.75799999999998,327.11599999999999,345.47399999999999,354.65800000000002,330.49400000000003,277.137,281.71799999999996,391.42700000000002,419.33100000000002,501.83100000000002,435.02800000000002,344.32899999999995,424.45699999999999,433.51,489.60199999999998,463.64800000000002,437.68200000000002,338.11900000000003,410.58300000000003,614.22900000000004,635.89800000000002,670.23699999999997,780.75599999999997,683.31600000000003,707.5,666.92600000000004,731.27399999999989,633.452,562.51599999999996,561.60799999999995,609.38099999999986,683.06600000000003,776.58699999999999,801.48299999999995,878.25299999999993,845.43299999999999,906.18799999999999,753.601,777.85899999999992,712.86300000000006,710.02200000000005,670.61700000000008,740.79899999999998,786.89800000000002,820.03300000000002,993.24900000000002,1162.1320000000001,1146.085,1156.348,1188.528,1146.9380000000001,1052.6459999999997,1062.9259999999999,987.04100000000005,1005.7759999999998,1110.6640000000002,1195.931,1440.752,1444.364,1274.8150000000001,1298.0549999999998,1240.75,1290.856,1258.2090000000001,1353.0540000000001,1209.009,1241.296,1363.396,1492.9119999999998,1694.2820000000002,1739.9590000000001,1521.155,1668.366,1703.8360000000002,1713.3689999999997,1529.2809999999999,1560.788,1486.4090000000001,1509.5250000000001,1726.7439999999997,1696.8150000000001,1877.0809999999997,1935.1690000000003,1893.6849999999999,2093.1260000000002,1995.1179999999999,2112.9699999999993,1963.846,1916.982,1758.6969999999999,1864.2,2095.7350000000001,2272.375,2359.3200000000002,2281.125,2087.6099999999997,2224.8949999999995,2397.0500000000002,2247.973,2215.5740000000001,2134.3539999999998,1941.982,1898.067,2183.652,2360.4690000000001,2667.78,2777.721,2583.982,2847.0219999999999,2638.6170000000002,2496.33,2343.2169999999996,2346.5549999999998,2059.681,2404.2600000000002,2516.4549999999999,2749.7919999999999,2514.8249999999998,2769.3290000000006,2782.5929999999998,3008.7979999999998,2845.49,3105.471,2718.4439999999995,2787.6880000000001,2533.5370000000003,2514.3940000000002,3184.5339999999997,3423.8519999999999,3773.848,4052.0929999999998,3372.585,3459.5360000000001,3670.7669999999998,3473.2809999999999,3005.2700000000004,3066.107,2651.7280000000001,3049.9429999999998,3635.4399999999996,3762.45,4201.009,4486.6239999999998,3606.45,4061.165,4205.6360000000004,3686.183,3422.4589999999998,3372.5169999999998,3284.3040000000001,3324.7780000000002,4017.3730000000005,4064.2809999999999,4336.518,4449.1660000000002,4141.7659999999996,4425.3990000000013,4594.518,4146.83,3645.3069999999998,3963.152,3795.1989999999996,3504.3919999999998,4115.7539999999999,4372.4039999999995,4813.0120000000006,4136.9859999999999,4354.97,5600.1589999999997,4552.1329999999998,4131.47,3571.5460000000003,3335.1880000000001,4185.7280000000001,3551.03,4704.8550000000005,4729.2420000000002,4780.0339999999997,4684.9660000000003,5290.6179999999995,5686.107,3926.5880000000002,5176.8050000000003,4326.1189999999997,4435.1310000000003,4802.5259999999998,4421.2670000000007,4478.4539999999997,5300.027,5019.518,5520.4,4766.0689999999995,6995.3640000000005,6511.8150000000005,4808.6859999999997,5157.9969999999994,5180.3989999999994,4762.165,5049.59,5582.25,6728.3320000000003,6981.8389999999999,6939.8959999999988,6710.8409999999994,6830.3380000000016,6728.4230000000007,6531.3249999999998,5964.9210000000003,6127.6260000000002,5449.7309999999998,5820.8040000000001,6651.63,8440.5329999999994,8615.2309999999998,8230.3429999999989,8244.09,8676.030999999999,6730.8899999999994,7916.2909999999993,6725.1869999999999,6996.918999999999,6482.1360000000004,6075.3789999999999,7795.7240000000011,8240.1929999999993,8711.7860000000001,8182.3756359999998,8015.6741979999997,9163.1034289999989,7779.9650090000005,7562.8179119999995,7284.6348720000005,7696.6127059999999,6573.8990530000001,6472.4757769999997,7244.5207410000003,7789.5304989999986,8741.677271999999,7918.8900889999995,9345.848426999999,8429.5451549999998,9774.6111380000002,8742.7512770000012,8219.2205040000008,7973.6420889999999,7456.1331380000001,8284.8208639999993,7576.1637819999996,8752.0813320000016,9927.7608700000001,10951.793016999998,9853.6919309999994,10606.126973,9494.3258659999992,9325.0544530000006,9084.5648660000006,8170.2915970000004,7853.4445169999999,7661.9886980000001,8230.3464469999999,10670.635399000001,9160.1749330000002,"-","-","-","-","-","-","-","-","-","-","-","-","-","-","-","-","-","-","-","-","-","-","-","-","-","-","-","-","-","-","-","-","-","-","-","-","-","-","-","-","-","-","-","-","-","-","-","-","-","-","-","-","-","-","-","-","-","-","-","-"]
[null,"Generación",13068.148999999999,10712.420999999998,11526.93,10577.741999999998,10584.957,10924.121000000001,11576.189000000002,10205.642,10945.187000000004,11117.694000000001,11786.233000000002,12993.084000000001,13514.698999999999,12300.103999999999,11755.675000000001,11287.504999999999,11439.315999999997,11005.69,11985.769,10503.418000000001,11479.372000000003,11793.966999999997,12189.305999999997,12628.902000000002,14156.68,12984.095000000001,12650.637999999999,11288.930999999999,11148.397000000001,10639.671999999999,12196.982,10732.736000000003,11459.954,11873.681,11696.458000000001,12362.295999999998,13140.405000000001,11813.756000000001,12465.810999999996,11039.029999999997,11048.340000000002,11073.045000000002,11743.634000000002,10934.771000000001,11386.860999999999,11939.680999999999,12382.942999999996,12858.573999999997,13466.398999999999,12265.461000000001,12065.962999999996,11587.729999999998,11675.843999999997,11945.080000000002,12785.071,11534.760999999999,11819.752,11663.625,11974.652,12946.662000000004,13831.879000000003,11863.992000000002,13066.031999999999,11607.471000000005,12152.261999999997,12204.221,12851.400000000001,11855.100999999999,12021.492999999999,12106.901000000002,12398.127999999999,13367.203999999998,14632.868999999999,13945.298000000003,13471.495000000001,11789.804999999997,12359.221,12561.456999999999,13248.592999999999,11954.499999999998,12277.069000000001,13045.433000000003,13347.524000000001,14037.838,15527.942000000001,12746.785000000002,13176.473999999998,13369.68,13595.045,13407.127999999999,14362.291000000003,13603.636000000002,13935.166999999999,13886.026,14129.524000000001,15455.874,15109.875,13490.18,14087.417000000001,13538.296999999999,13540.958000000002,13971.812000000002,15202.644999999999,13813.061,14383.620999999999,14269.794000000002,14631.217000000001,16198.317000000001,16393.576000000001,14943.591999999999,15171.591,13533.998,14228.531000000001,14665.97,15959.913,14400.723999999998,15119.387999999999,15000.137000000001,15946.373,16895.771000000001,18017.434000000001,15585.119999999999,16304.345999999998,15194.267,15498.644000000002,16248.064,16637.700999999997,15672.647000000001,15915.037,15880.278,16856.034,17647.403999999999,18866.727000000003,16777.413,17710.691000000003,15284.262000000001,16326.837000000001,16839.431,17514.252,16757.473000000002,16576.550000000003,16954.269,17739.712,18941.038,19462.333000000002,16854.197,17381.063999999998,16757.014999999999,17493.512000000002,17815.728999999999,18588.489999999998,16916.016000000003,17135.423000000003,17907.848000000002,17931.371000000003,18946.023000000001,20760.522000000001,19099.053,18638.846999999998,17263.099000000002,17888.824999999997,18917.374,20237.305,19058.73,18462.04,19062.331999999999,19229.073,20636.550000000003,21054.75,20055.496999999999,21160.099000000002,19211.657999999999,19216.088000000003,20130.009999999998,21300.502999999997,19825.388999999999,19739.351000000002,19876.998000000003,20615.838,21424.022000000001,22692.537,21115.352000000003,21470.211000000003,19432.025000000001,19670.705000000002,20959.040999999997,22200.637999999999,20168.888999999999,20510.814999999999,20377.224999999999,21805.759999999995,23481.207000000002,24399.52,22365.761999999995,23141.827999999998,18945.896999999997,20667.129000000001,21482.522000000004,23929.236000000004,20940.143,21636.495999999999,21226.624,21411.327999999994,23455.364999999998,24436.344000000001,21814.576999999997,23193.162,20815.392,21756.008000000002,21659.671999999999,23475.06,21797.809999999998,22091.448,22685.046999999999,23948.771999999997,24945.221000000001,25320.773000000001,23621.495999999999,23913.153000000002,23007.167000000001,21918.263999999996,22418.224999999999,24401.398000000001,22716.502,22244.034,22523.435000000001,23406.497000000003,24556.807000000001,25160.519,21751.801000000003,21400.016000000003,20032.678,20326.695,21533.944000000003,23610.472000000002,22211.13,21366.215,21550.292999999998,21938.98,23657.671999999999,24812.236949999999,22971.826116999997,23920.343546,20967.048649999997,21245.380482,21489.927739999999,24344.854098,22445.849581999999,21899.867311999998,22140.174218,22927.362636000002,24152.540386999997,24653.788656000001,22005.908318999998,23847.432892000001,20561.820168000002,20663.466011999997,21279.393942000002,22559.848418999998,21904.955252,21692.656134000001,20974.675216,21491.081403,22698.637129000002,24039.412397,24778.429480999999,22685.003468999999,21269.131653,21482.386141999999,21703.127747999999,22587.924139999999,22503.399328000003,21351.84346,21633.824557,21501.221408000001,23019.113632000001,23693.21153,21816.124252999998,22701.841901,20827.733528000001,20075.237057999999,19966.591478999999,23081.033833999998,21495.955157,20809.235611,20842.553527,21764.978199999998,22802.246547999999,22948.867001999999,21544.779371000001,21725.622022,20018.940025,20230.712955999999,20295.835844000001,21969.415627000002,20763.738462000001,20936.015095999999,20477.590865999999,20159.820742,22193.265897999998,23487.122427000002,22170.700140999998,22115.987896999999,19604.705212000001,20096.070557999999,20620.714651999999,23978.968151000001,21585.936377999999,20078.488287,19758.518037000002,19905.725294,20548.297517000003,21603.035028000002,20641.854999000003,21955.914390000002,20680.396015999999,19508.673193999999,19468.898084,21570.807225,20704.771396,19919.091410000001,20572.310497000002,20684.213309999999,20790.049777,24141.13248,19965.744717000001,20042.476429999999,18321.733019000003,19064.169881999998,20858.350868000001,21468.995669,20312.963627999998,19032.477429000002,20193.038909000003,21583.331875999997,23137.836201999999,21726.830746,20769.667224000001,23141.781786,19662.724482000001,19004.744848000002,18651.513615,20491.458041000002,20948.840936999997,19717.371784000003,"-","-","-"]
[null,"Consumos en bombeo",-230.679,-122.288,-14.289,-28.145,-43.485999999999997,-13.114000000000001,-22.103999999999999,-49.978000000000002,-160.71299999999999,-155.501,-44.506999999999998,-154.46799999999999,-268.90800000000002,-218.38300000000001,-171.68600000000001,-12.201000000000001,-15.629,-41.384,-57.712000000000003,-72.09,-112.773,-80.879000000000005,-188.52699999999999,-192.56100000000001,-261.99200000000002,-144.315,-170.44,-297.59300000000002,-198.61500000000001,-246.85400000000001,-277.39299999999997,-274.77800000000002,-274.41399999999999,-292.15699999999998,-181.749,-170.405,-138.74100000000001,-112.68899999999999,-188.994,-202.54400000000001,-227.06899999999999,-134.422,-139.846,-190.28299999999999,-202.364,-190.64699999999999,-85.039000000000001,-74.921000000000006,-304.07600000000002,-125.633,-16.009,-34.588999999999999,-53.005000000000003,-40,-112.842,-29.006,-168.63399999999999,-188.04300000000001,-112.602,-160.94999999999999,-229.93299999999999,-151.828,-149.91399999999999,-139.09899999999999,-126.803,-126.251,-163.94499999999999,-157.261,-174.29900000000001,-178.249,-166.69,-317.45400000000001,-761.34500000000003,-190.41399999999999,-30.027000000000001,-33.853000000000002,-44.027999999999999,-72.870999999999995,-66.353999999999999,-12.074,-23.202999999999999,-39.189,-69.679000000000002,-179.58099999999999,-252.93600000000001,-37.277999999999999,-12.262,-21.497,-81.885999999999996,-85.456999999999994,-118.164,-176.339,-190.05099999999999,-144.696,-266.06099999999998,-374.262,-277.15499999999997,-134.83799999999999,-111.211,-214.86099999999999,-181.761,-114.55800000000001,-203.37299999999999,-319.92500000000001,-193.376,-171.72300000000001,-213.786,-451.18700000000001,-468.77199999999999,-342.76100000000002,-234.381,-215.75899999999999,-219.82599999999999,-177.636,-214.518,-260.83800000000002,-340.93099999999998,-489.76400000000001,-316.02600000000001,-385.16800000000001,-368.59199999999998,-313.25400000000002,-345.67200000000003,-513.572,-617.92600000000004,-330.21499999999997,-323.44200000000001,-246.34100000000001,-256.83199999999999,-362.529,-451.67700000000002,-776.83399999999995,-539.07299999999998,-307.35899999999998,-387.49700000000001,-200.959,-214.62100000000001,-258.66300000000001,-303.01100000000002,-291.53199999999998,-368.74900000000002,-364.09899999999999,-336.14600000000002,-559.55499999999995,-652.85199999999998,-506.24200000000002,-466.28899999999999,-443.39299999999997,-559.45699999999999,-628.45799999999997,-699.81299999999999,-572.27200000000005,-597.97400000000005,-575.56700000000001,-570.42200000000003,-683.94299999999998,-587.33500000000004,-379.733,-368.65,-218.7,-265.99099999999999,-415.71499999999997,-419.84399999999999,-472.31900000000002,-437.02499999999998,-390.30099999999999,-322.12400000000002,-400.39699999999999,-404.81700000000001,-276.12,-339.00299999999999,-328.995,-393.37799999999999,-425.60700000000003,-408.31200000000001,-386.44200000000001,-387.786,-411.48399999999998,-358.57499999999999,-484.18799999999999,-553.09,-432.93799999999999,-492.58699999999999,-450.62,-643.06799999999998,-634.52700000000004,-693.31299999999999,-446.08,-519.71799999999996,-482.77600000000001,-454.59100000000001,-553.63900000000001,-586.44100000000003,-529.91899999999998,-374.92099999999999,-305.80099999999999,-313.70299999999997,-370.08100000000002,-513.35599999999999,-400.35399999999998,-486.57299999999998,-541.52300000000002,-541.572,-384.12900000000002,-371.77600000000001,-395.87900000000002,-384.16800000000001,-293.39699999999999,-397.62200000000001,-356.25400000000002,-333.52100000000002,-371.38200000000001,-345.92500000000001,-317.00099999999998,-384.15499999999997,-481.20699999999999,-430.83600000000001,-419.30500000000001,-401.79399999999998,-219.05799999999999,-206.07300000000001,-285.255,-253.78200000000001,-190.80199999999999,-226.55600000000001,-297.14499999999998,-411.25599999999997,-460.64,-492.22699999999998,-392.03500000000003,-281.47199999999998,-255.75899999999999,-247.49799999999999,-224.59399999999999,-241.018,-245.006,-254.49299999999999,-284.12299999999999,-397.50099999999998,-478.46300000000002,-756.58548100000007,-554.72222199999999,-544.66441799999996,-303.16059899999999,-279.94919199999998,-230.155124,-199.16812999999999,-231.14395499999998,-233.69566899999998,-346.11598499999997,-322.22366899999997,-456.19813299999998,-433.11024748,-283.74152552800001,-349.30097691799995,-300.04761586399997,-160.64980081600001,-141.781322192,-175.847837008,-183.38067148799999,-178.11245619200002,-303.85738500000002,-327.17254042400003,-404.49143771999996,-451.82722167200001,-450.44684829599998,-434.615101686,-569.28791355999999,-362.23293290399999,-324.50380338400004,-288.75519004800003,-368.94573709600002,-457.46286814400003,-398.68789700000002,-405.02623852800002,-547.33924728,-699.75148337600001,-564.56846524000002,-1023.591614206,-874.07915915199999,-454.16733199999999,-388.94544047199997,-259.73799365600001,-234.30714860799998,-214.34712908799997,-306.95237199999997,-350.92624557600004,-584.40170843999999,-859.99467229599998,-629.04720457600001,-527.52226513400001,-512.77154843999995,-436.98039667199998,-326.96377761599996,-276.14044000000001,-220.375546576,-218.081517768,-410.46434799999997,-519.91368062399999,-447.51346185599999,-482.10123765399999,-545.62121219999995,-480.74035167200003,-406.66995899999995,-371.185291608,-155.118774608,-168.70420066400001,-303.45802009599998,-246.401091288,-375.05830500000002,-439.22496628800002,-537.96802052800001,-897.52000399999997,-716.57851924000011,-590.27206849200002,-584.37827990400001,-474.93249372000002,-211.03821543999999,-141.90742776799999,-161.324649776,-122.898689,-230.009151952,-353.599471376,-343.12609700000002,-434.60426672,-482.99988120800003,-334.470282166,-342.53471273999997,-229.22229382399999,-192.691575,-174.03281200000001,-204.91962000000001,-164.38873100000001,-222.16092699999999,-270.17416399999996,-555.38172199999997,-391.47835200000003,-253.86108900000002,-733.49642400000005,-560.06841218400007,-213.24354462900001,-83.652090872000002,-57.940257936000002,-68.902296153999998,-80.573028000000008,"-","-","-"]
[null,"Enlace Península-Baleares","-","-","-","-","-","-","-","-","-","-","-","-","-","-","-","-","-","-","-","-","-","-","-","-","-","-","-","-","-","-","-","-","-","-","-","-","-","-","-","-","-","-","-","-","-","-","-","-","-","-","-","-","-","-","-","-","-","-","-","-","-","-","-","-","-","-","-","-","-","-","-","-","-","-","-","-","-","-","-","-","-","-","-","-","-","-","-","-","-","-","-","-","-","-","-","-","-","-","-","-","-","-","-","-","-","-","-","-","-","-","-","-","-","-","-","-","-","-","-","-","-","-","-","-","-","-","-","-","-","-","-","-","-","-","-","-","-","-","-","-","-","-","-","-","-","-","-","-","-","-","-","-","-","-","-","-","-","-","-","-","-","-","-","-","-","-","-","-","-","-","-","-","-","-","-","-","-","-","-","-","-","-","-","-","-","-","-","-","-","-","-","-","-","-","-","-","-","-","-","-","-","-","-","-","-","-","-","-","-","-","-","-","-","-","-","-","-","-","-","-","-","-","-","-","-","-","-","-","-","-","-","-","-","-","-","-","-","-","-","-",0,0,0,0,0,0,0,0,0,0,0,0,0,0,0,0,0,0,0,0,0,0,-6.4800000000000003E-4,-0.662601,-2.9968270000000001,-25.378617999999999,-36.698442999999997,-35.662767000000002,-31.625769000000002,-35.803857000000001,-36.381226999999996,-68.014381999999998,-74.016632999999999,-70.299274000000011,-67.437619000000012,-91.247602000000001,-108.822873,-90.838239000000002,-84.296937,-88.234445000000008,-83.69395200000001,-112.811098,-145.595967,-157.38788099999999,-113.87852599999999,-108.85674300000001,-86.136350000000007,-87.955589000000003,-98.644521999999995,-86.919696000000002,-88.249651,-80.404573999999997,-85.669402000000005,-124.876598,-153.19216800000001,-165.071866,-146.82962899999998,-101.05858000000001,-79.551937000000009,-87.790311000000003,-110.89759600000001,-111.884631,-100.736395,-87.606187000000006,-65.67047199999999,-123.29128799999999,-181.06009899999998,-170.38412599999998,-119.55821499999999,-99.377005000000011,-71.777664000000001,-93.54886599999999,-89.213442999999998,-91.217189000000005,-111.467448,-86.955767999999992,-105.354345,-124.74375900000001,-144.84169399999999,-152.53868,-109.260447,-90.883770999999996,-58.978756999999995,-85.128667000000007,-96.651403000000002,-64.562011999999996,-78.352012000000002,-57.072946000000002,-75.027427000000003,-114.23341499999999,-155.21145899999999,-166.87624499999998,-116.104623,-93.286301000000009,-70.161933999999988,-91.76686500000001,-86.203828999999999,-99.993399000000011,-89.996875000000003,-66.467520000000007,-89.565090999999995,-108.62363499999999,-161.79160300000001,-153.133589,-107.931268,"-","-","-"]
[null,"Saldo intercambios internacionales",-269.29700000000003,16.550999999999998,-11.987,-20.997,159.398,0.442,-28.161000000000001,-32.036000000000001,14.863,-21.733000000000001,-139.47,-87.152000000000001,-24.533000000000001,22.888999999999999,-122.07,-226.91900000000001,-191.566,-45.838999999999999,-92.111999999999995,27.849,-99.835999999999999,-14.272,56.173999999999999,33.649000000000001,-96.052000000000007,-312.209,-213.21600000000001,188.66300000000001,271.98,371.25900000000001,87.992000000000004,216.89599999999999,131.30699999999999,-16.239000000000001,8.0229999999999997,2.72,95.905000000000001,222.43799999999999,184.267,48.24,224.11500000000001,217.79499999999999,282.58,18.097999999999999,-4.7850000000000001,-0.85399999999999998,-0.36499999999999999,-20.361999999999998,-20.454999999999998,19.067,44.103000000000002,42.116,71.337999999999994,56.383000000000003,128.05099999999999,134.20599999999999,271.50099999999998,383.18400000000003,371.48200000000003,354.12900000000002,382.27800000000002,376.39499999999998,379.125,353.88600000000002,378.61599999999999,369.63499999999999,406.47899999999998,389.68700000000001,389.56900000000002,434.89600000000002,380.024,248.45500000000001,-23.15,-228.839,95.808999999999997,234.45,175.22300000000001,297.35899999999998,337.60500000000002,288.54199999999997,53.530999999999999,-123.297,-16.169,-31.698,-483.959,-204.565,-220.011,-410.142,-439.19400000000002,-268.20999999999998,-397.76100000000002,-455.005,-103.389,13.218999999999999,65.415999999999997,-169.27099999999999,339.84100000000001,345.96100000000001,404.92,388.81900000000002,355.11399999999998,244.86199999999999,284.57,320.09500000000003,-25.49,206.148,283.52199999999999,253.50200000000001,244.11699999999999,366.79399999999998,462.85599999999999,712.678,628.45799999999997,570.85799999999995,515.62199999999996,504.84,210.995,438.75,625.31500000000005,437.96199999999999,196.386,415.9,422.24900000000002,519.16999999999996,683.53800000000001,173.875,258.827,208.52799999999999,340.72800000000001,443.80599999999998,516.19799999999998,261.39,-38.209000000000003,21.672999999999998,-83.963999999999999,447.06200000000001,578.60299999999995,504.50400000000002,431.03699999999998,282.04500000000002,283.08600000000001,139.702,402.85199999999998,489.56900000000002,532.01599999999996,648.78599999999994,721.60400000000004,705.34900000000005,259.03800000000001,187.01,575.93600000000004,236.11799999999999,428.06299999999999,298.13900000000001,490.714,245.995,26.416,50.988,247.018,-36.927,134.05699999999999,409.34500000000003,237.34800000000001,123.48699999999999,160.179,55.116,-24.058,-119.06699999999999,-318.32600000000002,-299.78699999999998,-234.03200000000001,-621.22,-303.66399999999999,-321.33600000000001,-241.46199999999999,-454.68900000000002,-53.951999999999998,-330.99,-45.66,198.1,295.54899999999998,299.65800000000002,51.222999999999999,68.78,176.042,176.29,31.582000000000001,-174.63399999999999,-495.36900000000003,-662.58799999999997,-689.60500000000002,-420.322,-365.17399999999998,-583.77499999999998,-799.06,41.878,18.827999999999999,-262.10700000000003,-377.87900000000002,63.244999999999997,-310.53500000000003,-236.93299999999999,-285.29700000000003,-175.709,94.564999999999998,-235.49199999999999,-243.36199999999999,-261.05399999999997,-494.78800000000001,-223.46299999999999,-289.77800000000002,-314.01400000000001,-846.57600000000002,-1153.7719999999999,-1052.93,-729.80100000000004,-456.80399999999997,-655.58699999999999,-1199.348,-1291.615,-761.27499999999998,-1052.3420000000001,-907.81299999999999,-796.07299999999998,-935.81,-1102.0160000000001,-948.447,-932.45600000000002,-897.62800000000004,-474.27699999999999,-192.952,-548.93399999999997,-437.37599999999998,-769.16099999999994,-944.90899999999999,-817.41700000000003,-711.16800000000001,-941.36500000000001,-897.21199999999999,-454.01499999999999,-304.71344599999998,-506.196753,-560.11404599999992,-729.095102,-542.81502899999998,-821.22575100000006,-1000.6535670000001,-758.60105700000008,-964.2554520000001,-1295.5098870000002,-593.21057400000007,-256.28839399999998,-611.33580500000005,-358.84235899999999,-762.63600899999994,-1074.8113170000001,-233.62379999999999,-404.76718699999998,-470.93457000000001,-197.10088099999999,-548.75685799999997,-381.58426100000003,-579.51663300000007,-466.21665400000001,-525.29093599999999,-1375.7932209999999,-869.96906999999999,-1211.9197819999999,-939.84038100000009,-625.32935199999997,-629.52545599999996,-646.20974899999999,-1047.302604,-1457.208903,-791.40693099999999,-1080.1572060000001,-364.45221100000003,-642.39397799999995,-430.41725799999995,-411.18220100000002,-132.05559299999999,-358.69515000000001,-1060.4316310000002,-517.67452200000002,-821.87308799999994,-679.119191,-892.91131900000005,-420.92630800000001,28.099829000000003,-490.54062400000004,-225.94670300000001,-652.23227599999996,-256.41148300000003,-285.58111300000002,-481.72024800000003,-236.69277,-336.25484,-303.548856,195.372657,-360.667597,-259.102957,-558.85504600000002,-396.75677899999999,-295.55073599999997,180.77279000000001,0.88915499999999992,-184.17543000000001,-251.793361,-169.94083300000003,436.52793199999996,453.107913,911.71418900000003,847.59026500000004,960.57577300000003,174.92662100000001,-106.684112,762.50236499999994,1083.2692120000002,917.73114199999998,1034.6561139999999,1121.321048,-433.77812599999999,357.21121500000004,938.722174,-531.54929799999991,541.13476000000003,1457.080766,1040.955944,1444.9895649999999,1128.8756839999999,1273.4433959999999,1827.9167399999999,1393.3093409999999,282.97961800000002,-350.214877,-339.92811599999999,1340.2982630000001,857.10299299999997,-273.62203199999999,882.59852599999999,1368.3609369999999,1863.9643000000001,1893.727091,1244.0220749999999,1124.4621510000002,"-","-","-"]
[null,"Demanda transporte (b.c.)",12568.172999999999,10606.683999999997,11500.654,10528.599999999999,10700.868999999999,10911.449000000001,11525.924000000003,10123.628000000001,10799.337000000003,10940.460000000001,11602.256000000003,12751.464,13221.258,12104.609999999999,11461.919000000002,11048.385,11232.120999999996,10918.467000000001,11835.945000000002,10459.177000000001,11266.763000000004,11698.815999999995,12056.952999999998,12469.990000000002,13798.636,12527.571,12266.981999999998,11180.000999999998,11221.762000000001,10764.076999999999,12007.581,10674.854000000003,11316.847,11565.285000000002,11522.732,12194.610999999997,13097.569000000001,11923.505000000001,12461.083999999995,10884.725999999997,11045.386000000002,11156.418000000001,11886.368000000002,10762.586000000001,11179.712,11748.179999999998,12297.538999999995,12763.290999999997,13141.868,12158.895,12094.056999999995,11595.256999999998,11694.176999999998,11961.463000000002,12800.279999999999,11639.960999999999,11922.619000000001,11858.766,12233.531999999999,13139.841000000004,13984.224000000004,12088.559000000003,13295.242999999999,11822.258000000005,12404.074999999997,12447.605,13093.934000000001,12087.526999999998,12236.762999999997,12363.548000000003,12611.461999999998,13298.204999999998,13848.374,13526.045000000002,13537.277,11990.401999999998,12490.415999999999,12785.945,13519.843999999999,12230.967999999997,12307.397000000003,12882.947000000002,13261.676000000001,13826.558999999999,14791.047,12504.942000000001,12944.200999999997,12938.041000000001,13073.965,13053.460999999999,13846.366000000002,12972.292000000003,13641.727000000001,13754.548999999999,13928.879000000001,14912.340999999999,15172.561,13701.303,14381.126000000002,13712.254999999997,13714.311000000002,14102.116,15283.841999999999,13813.231,14164.754999999999,14304.219000000001,14700.953000000001,16000.632000000001,16168.921,14967.624999999998,15400.066000000001,14030.916999999999,14637.163000000002,15059.191999999999,16261.017,14644.725999999999,14989.451999999999,14949.123000000001,16255.662,16948.564999999999,17845.227999999999,15687.765999999998,16380.922999999997,15199.865,15564.256000000003,16091.724,16573.085999999999,15634.834000000001,15998.932999999999,15961.555,16920.555,17131.96,18289.445000000003,16491.726999999999,17239.230000000003,15530.365,16690.819000000003,17085.272000000001,17642.278000000002,16747.986000000001,16490.887000000002,16729.872000000003,17806.417999999998,18871.052,19341.497000000003,16996.740999999998,17636.378999999997,17018.970999999998,17193.093000000004,17374.280999999999,18464.613000000001,16579.862000000001,16965.512000000002,17630.420000000002,17851.663000000004,18508.075000000001,20199.603000000003,18770.308000000001,18517.214999999997,17007.472000000002,17756.890999999996,18911.004000000001,20054.809000000001,18709.898000000001,18185.194,18727.147000000001,18882.891,20117.086000000003,20331.607,19479.59,20587.064000000002,18261.442999999999,18519.046000000002,19383.066999999999,20650.728999999996,18984.258000000002,19297.613000000001,19134.524000000001,20211.602999999999,21137.934000000001,22434.995999999999,20982.072000000004,21028.847000000005,19050.185000000001,19203.679000000004,20500.803999999996,21538.906999999999,19548.174999999999,19495.727999999999,19231.860999999997,20661.563999999995,22507.246000000003,23447.905000000002,21252.067999999992,21967.846999999998,18681.973999999998,20372.254000000001,20850.334000000006,23038.001000000004,20603.034,20839.387999999999,20448.167999999998,20584.458999999995,22895.526999999998,24159.132999999998,21183.205999999998,22565.631999999998,20260.940999999999,20863.598000000002,21079.954999999998,22851.761000000002,21112.413999999997,20898.947,21214.273999999998,22511.686999999998,23734.213000000003,24433.133000000002,22546.603999999999,22312.010999999999,21496.493999999999,20950.915999999994,21080.627999999997,23239.803000000004,21729.627,21081.667999999998,21124.274000000001,22046.794000000002,23163.711000000003,23770.664000000001,20885.489000000005,20925.592000000001,19227.985000000001,19641.821,20540.189000000002,22424.545000000002,21148.706999999999,20400.554,20324.804999999997,20644.267,22725.194,23750.938022999999,21910.907142,22815.565081999997,19934.792949000002,20422.616260999999,20438.546864999997,23145.032401,21456.10457,20701.916191,20498.548346,22011.928392999998,23440.05386,23609.342603519999,21363.324434471997,22735.495906082,19186.961235135997,20269.192411184002,20732.845432808001,21913.066011991999,21524.473699512,20965.786819808,20289.23357,20584.391581576001,21827.266436280002,23059.297412328,22926.810793704,21343.720854314,19452.26119044,20148.687059096002,20717.490735616,21633.262266951999,21420.229459904,19773.061354856,19707.628483,20237.350619471999,21300.369576720001,22520.184962624,20518.32357076,21163.536091793998,19454.237722847996,19405.320181000003,19106.139790527999,21615.268242343998,20586.585605392003,19659.136867911999,19747.625221000002,20435.004285424002,21708.96294256,22018.327636704002,20338.271846423999,20883.903402865999,18773.531626559998,19451.651674328001,19558.414355384,21058.362771,20141.598279424001,20234.849109232,19662.519081999999,19755.727781376001,21297.294528143997,22635.020636346002,20954.3392518,21137.754371327999,18814.87833,19839.987584392002,20343.193744392,23445.028421335999,20860.300870903997,19542.588147711998,19720.610659000002,19847.830576712,20828.494819471998,21463.891846000002,20794.635063760001,21429.101494507999,19902.377856095998,19690.88872028,20216.385321559999,22201.789245232001,21425.564180224002,20808.253322,19817.639448047998,20628.846296624,21300.517186999998,23078.327512279997,19959.317583792003,21086.734901833999,18963.081304260002,20204.909726176,21680.301562000001,22413.194793999999,21769.084502999998,20145.293416,20160.571298999999,20892.780901000002,22150.759499000003,22589.446828,21272.915728999997,22044.666454999999,19918.787075816002,20070.297149370999,20323.202189128002,22165.453271063998,21970.827126846001,20653.329639,"-","-","-"]
[]
[null,"Balance eléctrico mensual Islas Baleares (MWh)","2006-01-01","2006-02-01","2006-03-01","2006-04-01","2006-05-01","2006-06-01","2006-07-01","2006-08-01","2006-09-01","2006-10-01","2006-11-01","2006-12-01","2007-01-01","2007-02-01","2007-03-01","2007-04-01","2007-05-01","2007-06-01","2007-07-01","2007-08-01","2007-09-01","2007-10-01","2007-11-01","2007-12-01","2008-01-01","2008-02-01","2008-03-01","2008-04-01","2008-05-01","2008-06-01","2008-07-01","2008-08-01","2008-09-01","2008-10-01","2008-11-01","2008-12-01","2009-01-01","2009-02-01","2009-03-01","2009-04-01","2009-05-01","2009-06-01","2009-07-01","2009-08-01","2009-09-01","2009-10-01","2009-11-01","2009-12-01","2010-01-01","2010-02-01","2010-03-01","2010-04-01","2010-05-01","2010-06-01","2010-07-01","2010-08-01","2010-09-01","2010-10-01","2010-11-01","2010-12-01","2011-01-01","2011-02-01","2011-03-01","2011-04-01","2011-05-01","2011-06-01","2011-07-01","2011-08-01","2011-09-01","2011-10-01","2011-11-01","2011-12-01","2012-01-01","2012-02-01","2012-03-01","2012-04-01","2012-05-01","2012-06-01","2012-07-01","2012-08-01","2012-09-01","2012-10-01","2012-11-01","2012-12-01","2013-01-01","2013-02-01","2013-03-01","2013-04-01","2013-05-01","2013-06-01","2013-07-01","2013-08-01","2013-09-01","2013-10-01","2013-11-01","2013-12-01","2014-01-01","2014-02-01","2014-03-01","2014-04-01","2014-05-01","2014-06-01","2014-07-01","2014-08-01","2014-09-01","2014-10-01","2014-11-01","2014-12-01","2015-01-01","2015-02-01","2015-03-01","2015-04-01","2015-05-01","2015-06-01","2015-07-01","2015-08-01","2015-09-01","2015-10-01","2015-11-01","2015-12-01","2016-01-01","2016-02-01","2016-03-01","2016-04-01","2016-05-01","2016-06-01","2016-07-01","2016-08-01","2016-09-01","2016-10-01","2016-11-01","2016-12-01","2017-01-01","2017-02-01","2017-03-01","2017-04-01","2017-05-01","2017-06-01","2017-07-01","2017-08-01","2017-09-01","2017-10-01","2017-11-01","2017-12-01","2018-01-01","2018-02-01","2018-03-01","2018-04-01","2018-05-01","2018-06-01","2018-07-01","2018-08-01","2018-09-01","2018-10-01","2018-11-01","2018-12-01"]
[null,"Carbón",281585,245804,280062,239665,271836,287051,292771,281322,254499,177022,201042,264651,253259,227525,220374,263500,228127,222675,278923,292687,263412,229147,201758,262468,287616,269886,265619,216223,246771,279366,294598,301838,286166,244583,217953,188207,186398,267602,230164,242090,270324,291327,298599,307579,259941,281704,254121,280614,288628.96399999998,253130.43700000001,284143.58,270785.11,229324.10800000001,279046.16200000001,292090,286753.92800000001,285293.82500000001,217296.101,192203.66699999999,222661.68400000001,271039.09399999998,222552.524,132822.435,193302.215,240528.49600000001,255173.84400000001,292347.24200000003,285531.24800000002,269841.03700000001,199580.361,166762.40400000001,235503.62899999999,265065.64199999999,219167.12,224145.53700000001,203970.94399999999,227618.82199999999,243420.85399999999,272060.533,272045.30599999998,234898.14499999999,185552.90100000001,160683.296,173938.13699999999,182299.427,172762.74100000001,186533.31,175475.45199999999,187896.41200000001,200606.94200000001,246666.41500000001,248251.67300000001,229416.734,169654.49900000001,168250.633,182826.166,183089.32699999999,150082.495,160255.57500000001,174012.56099999999,194495.33199999999,206570.04699999999,234612.764,238509.24299999999,227702.61600000001,156195.43100000001,86828.516000000003,175423.81899999999,180751.80900000001,171709.13200000001,173706.21599999999,70165.725999999995,127697.27800000001,185477.353,218839.82199999999,250939.772,199151.61799999999,82335.691999999995,101806.757,99101.911999999997,114409.217,99651.173999999999,105038.23,151496.329,197176.087,225485.701,286133.93099999998,265479.10800000001,256765.62599999999,224344.495,180604.46100000001,196283.61199999999,221058.17300000001,189456.399,177467.58100000001,189508.45,224056.82699999999,268948.2,273077.908,263831.97200000001,237417.12700000001,196316.93400000001,153252.16,204110.712,198555.02900000001,192794.93400000001,199821.57,183056.22099999999,185327.823,204879.731,242068.47899999999,257313.11,250630.39499999999,"-","-","-"]
[null,"Motores diesel",79209,68329,70721,64718,79303,85154,104210,101456,93527,79792,63493,74990,78135,66061,74782,71646,84385,92577,102578,105250,96624,79159,73984,80425,80489,70911,75416,72520,86002,96520,116196,118501,98449,78246,72700,81131,85013,68206,71555,74273,75820,91793,105509,106425,86067,70751,62004,74409,80487.338000000003,71127.048999999999,78081.048999999999,70171.271999999997,83167.909,94393.464000000007,113035.62,113945.387,97806.403000000006,76729.221000000005,67045.221999999994,81630.111999999994,81367.514999999999,64793.347999999998,77198.425000000003,71506.826000000001,83514.44,89601.603000000003,96223.672999999995,98279.25,81466.531000000003,55485.47,49519.618000000002,74505.664999999994,80432.195000000007,74636.407000000007,73731.097999999998,72451.394,83641.615000000005,94715.403999999995,104718.624,103888.375,81443.195000000007,61390.207000000002,47298.889000000003,54941.497000000003,58812.648999999998,52746.377999999997,52141.273999999998,54645.459000000003,67040.168000000005,69555.570999999996,89962.130999999994,86026.615999999995,65524.44,49664.21,37936.910000000003,54606.175999999999,57672.186000000002,54580.671999999999,38102.188999999998,37100.252,51171.796999999999,60444.23,69382.615999999995,76557.119000000006,69254.877999999997,50580.254999999997,50997.472000000002,50939.894,56110.773999999998,54025.309000000001,50910.868999999999,53098.839,63412.131000000001,64532.934000000001,92403.281000000003,83153.922999999995,67317.426000000007,52583.101000000002,37650.925999999999,49784.457999999999,37783.989000000001,63209.023999999998,77387.698000000004,75097.445999999996,87380.182000000001,92502.951000000001,107271.533,107253.14599999999,92278.519,88576.096999999994,62148.235000000001,70372,84274.308000000005,70860.631999999998,62289.885999999999,72688.244000000006,87842.728000000003,96605.956999999995,106657.878,88000.293999999994,42120.803999999996,26871.201000000001,24992.987000000001,32782.641000000003,35080.182000000001,38969.616000000002,35928.451999999997,37207.235000000001,51279.923000000003,59423.205000000002,82636.36,89525.766000000003,72079.990000000005,"-","-","-"]
[null,"Turbina de gas",6947,10938,22831,13569,15378,29015,55976,40768,31591,29413.95199999999,18468,17160,23585,20894,20510,16976,36834,31757,41358,38367,21309,20978,20783,18090,17521,19944,19984,12615,13376,22615,34364,38299,31566,20899,19341,21978,18986,20558,19663,12270,24409,33876,53107,52569,37227,24608,21181,20915,23036.824000000001,25540.649000000001,22064.976999999999,16837.77,15550.541999999999,20236.732,41379.637000000002,42027.091,26953.491999999998,22516.812000000002,21406.807000000001,21863.032999999999,16955.983,20867.648000000001,17657.151999999998,13157.877,17049.864000000001,28160.153999999999,49932.709000000003,59305,47510.294000000002,38894.074000000001,31016.755000000001,10096.861000000001,12675.73,24629.098000000002,14551.031000000001,7952.3140000000003,12662.602999999999,29867.924999999999,42978.014000000003,61551.798999999999,38999.625,34035.131000000001,28853.183000000001,31693.327000000001,30802.12,33286.273000000001,32332.702000000001,25451.57,32308.272000000001,39630.894,61583.017999999996,68501.819000000003,57750.919000000002,51097.555999999997,43384.514999999999,38209.33,28626.27,24741.792000000001,43267.237000000001,44385.815999999999,47011.785000000003,58179.415999999997,76120.493000000002,79659.34,66582.156000000003,52353.144,28059.97,36400.463000000003,36805.256000000001,32863.889000000003,38483.677000000003,32205.506000000001,43845.550999999999,59050.26,77660.773000000001,80914.687000000005,58314.546000000002,47951.209000000003,41220.203999999998,37273.741000000002,48057.167999999998,19893.370999999999,13341.967000000001,9026.8490000000002,18357.423999999999,33146.463000000003,46712.446000000004,55467.749000000003,43668.214,18319.132000000001,20382.307000000001,13385.174999999999,13229.322,10726.194,22296.850999999999,14186.651,29491.835999999999,39728.294000000002,59674.911,82505.827999999994,82010.566000000006,75211.865999999995,62358.716999999997,65103.538,59852.256000000001,59882.574999999997,61051.561000000002,57191.896000000001,66096.778000000006,77051.413,95847.725999999995,91166.569000000003,75102.127999999997,"-","-","-"]
[null,"Fuel + Gas",86156,79267,93552,78287,94681,114169,160186,142224,125118,109205.95199999999,81961,92150,101720,86955,95292,88622,121219,124334,143936,143617,117933,100137,94767,98515,98010,90855,95400,85135,99378,119135,150560,156800,130015,99145,92041,103109,103999,88764,91218,86543,100229,125669,158616,158994,123294,95359,83185,95324,103524.16200000001,96667.698000000004,100146.026,87009.042000000001,98718.451000000001,114630.19600000001,154415.25699999998,155972.478,124759.895,99246.03300000001,88452.028999999995,103493.14499999999,98323.497999999992,85660.995999999999,94855.577000000005,84664.703000000009,100564.304,117761.757,146156.38199999998,157584.25,128976.82500000001,94379.543999999994,80536.373000000007,84602.525999999998,93107.925000000003,99265.505000000005,88282.129000000001,80403.707999999999,96304.218000000008,124583.329,147696.63800000001,165440.174,120442.82,95425.338000000003,76152.072,86634.824000000008,89614.769,86032.650999999998,84473.975999999995,80097.02900000001,99348.44,109186.465,151545.14899999998,154528.435,123275.359,100761.766,81321.425000000003,92815.505999999994,86298.456000000006,79322.464000000007,81369.426000000007,81486.067999999999,98183.581999999995,118623.64600000001,145503.109,156216.459,135837.03399999999,102933.399,79057.44200000001,87340.357000000004,92916.03,86889.198000000004,89394.546000000002,85304.345000000001,107257.682,123583.194,170064.054,164068.60999999999,125631.97200000001,100534.31,78871.13,87058.198999999993,85841.157000000007,83102.39499999999,90729.665000000008,84124.294999999998,105737.606,125649.414,153983.97899999999,162720.89499999999,135946.73300000001,106895.22899999999,82530.542000000001,83757.175000000003,97503.63,81586.826000000001,84586.736999999994,86874.895000000004,117334.564,136334.25099999999,166332.78899999999,170506.12199999997,124131.37,102083.067,87351.703999999998,97886.179000000004,94932.437999999995,98852.190999999992,96980.013000000006,94399.130999999994,117376.701,136474.61800000002,178484.08600000001,180692.33500000002,147182.11800000002,"-","-","-"]
[null,"Ciclo combinado",115133,112851,71802,58291,79596,107515,173341,167753,132665,163572,80257,79139,109535,97337,133306,66630,113287,174631,186393,169251,141173,143962,135271,113219,92464,91614,97252,120602,114746,106773,178739,177899,121342,111682,111297,199080,206459,81850,132809,89788,70003,97131,175334,166521,120693,57370,29377,64848,83745.201000000001,90692.047000000006,69947.986000000004,35630.942999999999,87840.323999999993,61960.637999999999,159205.10999999999,145959.23199999999,74275.328999999998,107178.246,98555.293999999994,120643.372,86769.994000000006,100990.879,204245.08799999999,87109.23,89290.709000000003,94269.198000000004,118082.442,151898.38099999999,114823.58,118335.08900000001,95316.159,61977.589,68530.567999999999,134285.899,53424.642999999996,51297.173000000003,56192.26,94321.538,109975.71400000001,123492.14200000001,46725.381000000001,70381.543999999994,43000.578000000001,34352.271999999997,36854.980000000003,51128.17,38342.601000000002,25038.955000000002,37992.788999999997,15434.567999999999,35278.080000000002,29391.772000000001,3171.3980000000001,53300.550999999999,34943.771999999997,46453.091999999997,32275.424999999999,44289.521999999997,51621.898000000001,15257.42,32884.425000000003,15844.592000000001,17515.224999999999,26367.670999999998,15843.343999999999,52801.557000000001,81995.646999999997,32936.394,36581.086000000003,37659.309000000001,37861.843000000001,110842.19899999999,103123.13499999999,47833.332999999999,79004.589000000007,26112.074000000001,34689.561999999998,122764.639,75613.285000000003,92601.932000000001,92204.111000000004,107882.42600000001,109644.80100000001,51199.06,18602.154999999999,12211.344999999999,14742.101000000001,24200.125,26581.525000000001,16362.103999999999,34637.993999999999,26814.348000000002,37633.499000000003,34837.552000000003,31438.682000000001,37314.464,26062.644,12581.072,35234.932000000001,56051.79,12832.513000000001,40379.856,60508.705999999998,35553.646000000001,31201.088,48135.34,39439.262000000002,48047.036999999997,45724.514000000003,36755.218999999997,53754.595000000001,62465.703999999998,31104.753000000001,"-","-","-"]
[null,"Generación auxiliar",0,0,0,0,0,0,213,3531,2469,1,0,136.219999999972,0,0,0,0,0,0,2447,8618,1547,0,0,0,0,0,0,0,0,0,2048,2600,1282,1,0,0,0,0,0,0,0,0,1489,3042,1037,-2,0,0,0,0,0,0,0,45.686,2619.5369999999998,2927.97,1100.336,0.80300000000000005,0,0,0,0,0,0,0,1060.8019999999999,2481.41,3645.4070000000002,1536.693,-2.5939999999999999,0,0,0,0,0,0,0,984.39,2564.1669999999999,3950.136,1309.72,-0.47599999999999998,0,0,0,0,0,0,-0.39800000000000002,579.67499999999995,2195.384,2895.9940000000001,1089.1980000000001,2E-3,0,0,0,0,0,0,0,0,2542.1559999999999,3212.201,1940.1769999999999,-0.44,0,0,0,0,0,0,0,336.83199999999999,3682.482,4194.6139999999996,2367.596,-3.0339999999999998,0,0,0,0,0,0,0,1214.2919999999999,2922.4059999999999,3386.491,2143.7829999999999,425.84699999999998,0,0,0,0,0,0,1338,1705.877,3128.471,4554.72,2377.3490000000002,1642.048,0,0,0,0,0,0,258.18900000000002,1406.8510000000001,3408.7330000000002,5196.1239999999998,2265.3319999999999,"-","-","-"]
[null,"Régimen ordinario",482874,437922,445416,376243,446113,508735,626511,594830,514751,449800.95199999999,363260,436076.22,464514,411817,448972,418752,462633,521640,611699,614173,524065,473246,431796,474202,478090,452355,458271,421960,460895,505274,625945,639137,538805,455411,421291,490396,496856,438216,454191,418421,440556,514127,634038,636136,504965,434431,366683,440786,475898.32699999999,440490.18200000003,454237.59200000006,393425.09499999997,415882.88300000003,455682.68199999997,608329.90399999998,591613.60800000001,485429.38500000001,423721.18300000002,379210.99,446798.201,456132.58599999995,409204.39900000003,431923.1,365076.14799999999,430383.50900000008,468265.60100000002,559067.47600000002,598659.28599999996,515178.13500000007,412292.40000000008,342614.93599999999,382083.74399999995,426704.13500000001,452718.52399999998,365852.30900000001,335671.82500000001,380115.3,463310.11099999998,532297.05200000003,564927.75800000003,403376.06599999993,351359.30699999997,279835.946,294925.23300000001,308769.17599999998,309923.56199999998,309349.88699999999,280611.43599999999,325237.24300000002,325807.64999999997,435685.02800000005,435067.87400000001,356952.68899999995,323716.81799999997,284515.83,322094.76400000002,"-","-","-","-","-","-","-","-","-","-","-","-","-","-","-","-","-","-","-","-","-","-","-","-","-","-","-","-","-","-","-","-","-","-","-","-","-","-","-","-","-","-","-","-","-","-","-","-","-","-","-","-","-","-","-","-","-","-","-","-"]
[null,"Eólica",514.35,371.37400000000002,548.18799999999999,366.096,438.988,366.65,202.55,548.33199999999999,264.46800000000002,347.64699999999999,407.40800000000002,501.30500000000001,402,480,585,246,392,334,358,444,320,541,784,770,415,420,575,741,212,290,272,328,462,470,620,692,472,688,529,482,477,383,126,147,346,531,538,824,599,689,590,377,312,275,322,395,303,477,529,703,471.577,637.57500000000005,627.31700000000001,553.49699999999996,434.952,359.10599999999999,428.68599999999998,330.58800000000002,215.447,586.64099999999996,548.71199999999999,591.81700000000001,478.96199999999999,1092.0409999999999,556.60799999999995,569.577,377.024,358.03699999999998,429.75099999999998,261.12400000000002,665.97199999999998,424.18299999999999,540.08900000000006,751.33100000000002,686.51099999999997,673.93100000000004,766.67499999999995,552.35599999999999,439.23099999999999,390.755,211.30500000000001,355.26100000000002,349.42099999999999,476.56200000000001,771.94,485.52,586.69100000000003,634.68700000000001,748.72299999999996,441.11599999999999,509.30500000000001,341.93,353.50200000000001,302.25200000000001,236.24700000000001,371.44600000000003,552.18899999999996,761.49,602.19200000000001,695.62400000000002,580.16,435.029,636.41600000000005,252.53399999999999,309.04000000000002,230.71299999999999,509.12099999999998,555.52599999999995,415.11500000000001,96.757999999999996,530.12699999999995,660.82399999999996,707.76800000000003,665.37599999999998,486.435,238.917,471.42500000000001,478.178,222.303,292.35500000000002,402.10500000000002,260.245,468.56200000000001,282.71800000000002,227.13499999999999,238.20599999999999,127.304,130.101,175.738,171.68700000000001,182.989,194.571,342.94099999999997,382.32400000000001,252.64,324.012,405.92399999999998,282.64999999999998,228.893,138.68199999999999,139.32900000000001,192.208,198.17599999999999,"-","-","-"]
[null,"Solar fotovoltaica",43.972999999999999,50.86,83.445999999999998,87.706999999999994,102.911,110.639,126.145,120.86799999999999,111.756,105.83499999999999,84.200999999999993,72.453999999999994,95,122,165,156,211,207,226,209,180,139,119,123,134,194,416,664,955,1807,2659,4719,4821,4337,3391,4283,3838,5190,7556,7099,8802,9040,8898,8709,6680,6538,5096,3487,3845,4810,6958,8061,9047,8957,10437,10003,8360,6793,5600,4886,5358.3459999999995,6715.4949999999999,8054.2619999999997,9942.5329999999994,10912.986000000001,10327.227000000001,10250.508,11566.684999999999,9702.348,8434.6059999999998,5035.3900000000003,5510.53,6182.9359999999997,6955.6509999999998,10151.971,10229.659,12309.453,11697.392,12533.19,12420.079,10872.946,9499.5400000000009,6015.9160000000002,6724.5360000000001,7273.1310000000003,7403.8310000000001,11493.687,11208.862999999999,12639.329,13817.142,14315.852999999999,12862.861999999999,10744.504999999999,8780.527,5601.8469999999998,5971.2749999999996,5827.915,8461.3080000000009,11097.609,12721.366,12506.914000000001,13246.777,13532.742,12554.948,10351.790000000001,10335.922,6491.3429999999998,5637.0550000000003,6878.9549999999999,7212.5569999999998,10110.063,12578.182000000001,13498.137000000001,13443.677,13857.289000000001,12160.058999999999,9666.6419999999998,8931.6389999999992,8007.3140000000003,6275.2889999999998,7081.3050000000003,7539.5460000000003,10661.868,11177.263999999999,12590.581,13167.569,13847.847,13337.502,10357.047,8447.7929999999997,6551.4610000000002,5747.7470000000003,5799.134,7159.3379999999997,12164.482,12625.004000000001,13622.494000000001,13314.391,13296.241,12456.52,10365.357,9718.9459999999999,7258.2,5556.8320000000003,7038.0169999999998,5329.54,10195.877,11476.928,11838.781999999999,12382.848,13421.057000000001,11261.584999999999,9045.8340000000007,"-","-","-"]
[null,"Térmica renovable/Otras renovables","-","-","-","-","-","-","-","-","-","-","-","-","-","-","-","-","-","-","-","-","-","-","-","-","-","-","-","-","-","-","-","-","-","-","-","-","-","-","-","-","-","-","-","-","-","-","-","-","-","-","-","-","-","-","-","-","-","-","-","-","-","-","-","-","-","-","-","-","-",8.3179999999999996,43.209000000000003,36.265999999999998,44.661999999999999,23.314,79.155000000000001,49.38,41.604999999999997,39.417999999999999,35.753,46.927999999999997,53.351999999999997,56.860999999999997,55.465000000000003,43.936999999999998,72.701999999999998,47.121000000000002,74.637,93.292000000000002,0,0,0,0,0,65.147999999999996,60.49,92.302999999999997,123.03700000000001,171.78100000000001,228.41200000000001,198.90700000000001,261.48099999999999,167.185,88.992999999999995,120.73399999999999,92.248000000000005,132.19499999999999,185.21299999999999,175.47300000000001,229.39500000000001,170.76300000000001,163.58500000000001,221.16300000000001,173,99.679000000000002,181.35900000000001,108.996,119.236,130.697,148.00299999999999,225.673,176.26400000000001,164.96199999999999,176.19800000000001,152.80000000000001,125.88200000000001,32.283000000000001,35.447000000000003,42.973999999999997,33.03,92.938000000000002,138.80699999999999,138.13,159.45699999999999,170.07400000000001,104.483,198.49,223.85,164.33199999999999,75.531999999999996,73.259,87.361999999999995,106.123,126.985,136.79400000000001,219.363,166.24,184.16499999999999,130.80099999999999,127.68,110.02800000000001,57.737000000000002,56.851999999999997,19.170000000000002,"-","-","-"]
[null,"Térmica no renovable/Cogeneración y resto/Cogeneración",13134.677,11651.766,12757.366,12126.197,9241.1010000000006,11667.710999999999,11282.305,11336.8,10957.776,11996.518,10537.391,12423.241,10231,11272,12861,12018,8170,9987,8947,9642,9504,1019,8067,12215,11005,12227,12415,11349,11758,11450,11883,11405,10678,11820,11914,12428,12679,9600,972,11178,12259,11199,11190,10723,11294,11475,11970,12503,10815,9246,11253,11204,10903,10391,11522,22957,25904,13766,17545,20738,940.65,889.08799999999997,1029.6969999999999,7.3380000000000001,779.56100000000004,646.79899999999998,1456.451,1778.056,1852.463,1702.703,1340.617,910.25099999999998,1175.5889999999999,2114.0700000000002,2721.3440000000001,462.03500000000003,2776.5940000000001,2547.59,2878.3029999999999,2583.6260000000002,2739.0889999999999,2413.268,1972.799,2112.3629999999998,2387.6849999999999,2252.451,2108.623,487.96199999999999,2621.27,2600.683,3228.567,2845.348,2168.7190000000001,826.85,1776.366,2416.2979999999998,2086.2809999999999,1683.588,1810.6030000000001,758.58699999999999,1364.86,1651.1079999999999,2628.2469999999998,2446.6419999999998,2744.18,2059.9430000000002,2685.1390000000001,3303.4059999999999,3153.7579999999998,2526.7080000000001,2771.268,1697.26,2205.1060000000002,1133.425,2921.51,2816.0459999999998,2463.7930000000001,3139.9549999999999,3259.5639999999999,3461.3339999999998,3301.81,3209.8339999999998,3099.3040000000001,3052.6709999999998,2121.3629999999998,3355.2379999999998,2924.6669999999999,2931.3310000000001,2901.415,2744.01,2387.4639999999999,2672.21,3018.2150000000001,3106.0990000000002,3515.1590000000001,1998.9570000000001,2017.1679999999999,2776.9250000000002,3059.2040000000002,3488.0909999999999,3215.9859999999999,3349.6129999999998,3098.652,3600.165,3182.9870000000001,3083.654,2294.6849999999999,1982.1659999999999,2578.5749999999998,3357.2420000000002,3565.5639999999999,3515.4580000000001,2436.5500000000002,"-","-","-"]
[null,"Residuos no renovables","-","-","-","-","-","-","-","-","-","-","-","-","-","-","-","-","-","-","-","-","-","-","-","-","-","-","-","-","-","-","-","-","-","-","-","-","-","-","-","-","-","-","-","-","-","-","-","-","-","-","-","-","-","-","-","-","-","-","-","-",7179.5069999999996,6530.4709999999995,6401.9070000000002,8918.1260000000002,5900.5915000000005,11850.4105,13051.111999999999,13572.184999999999,13763.906000000001,13074.686,10492.6985,12976.433000000001,10956.663500000001,8357.7785000000003,9517.9050000000007,9070.1610000000001,11143.3815,9830.9385000000002,13487.1705,13161.865,10351.8905,7156.2560000000003,7015.4470000000001,12740.079,8621.6265000000003,6081.7205000000004,8029.7179999999998,7700.8215,8209.6944999999996,11852.555,10855.8735,11387.297500000001,14086.388999999999,9534.9835000000003,7910.6329999999998,8795.2824999999993,7939.6530000000002,6507.4449999999997,9425.1545000000006,11604.4115,5269.7250000000004,13186.835499999999,14742.679,11272.941000000001,13986.786,14349.8485,8560.6990000000005,11238.1515,9163.4614999999994,6908.54,11394.0975,13639.012000000001,14790.13,13704.3935,12852.9485,12487.333000000001,14777.127500000001,14664.409,14317.8935,12398.3835,8564.5149999999994,4967.8254999999999,8611.8559999999998,12109.9035,14510.119000000001,13617.075999999999,11266.3585,12685.0265,12613.608,13662.531499999999,9270.8955000000005,8925.3515000000007,7544.1634999999997,7222.1914999999999,10517.762500000001,14685.772499999999,11209.790499999999,14046.6855,14055.790499999999,14325.673000000001,15026.625,13982.9895,11279.227500000001,9981.9964999999993,7481.4245000000001,4455.9544999999998,11199.851500000001,10486.738499999999,10524.592000000001,14709.154500000001,14429.119000000001,14961.362499999999,13453.5695,"-","-","-"]
[null,"Residuos renovables","-","-","-","-","-","-","-","-","-","-","-","-","-","-","-","-","-","-","-","-","-","-","-","-","-","-","-","-","-","-","-","-","-","-","-","-","-","-","-","-","-","-","-","-","-","-","-","-","-","-","-","-","-","-","-","-","-","-","-","-",7179.5069999999996,6530.4709999999995,6401.9070000000002,8918.1260000000002,5900.5915000000005,11850.4105,13051.111999999999,13572.184999999999,13763.906000000001,13074.686,10492.6985,12976.433000000001,10956.663500000001,8357.7785000000003,9517.9050000000007,9070.1610000000001,11143.3815,9830.9385000000002,13487.1705,13161.865,10351.8905,7156.2560000000003,7015.4470000000001,12740.079,8621.6265000000003,6081.7205000000004,8029.7179999999998,7700.8215,8209.6944999999996,11852.555,10855.8735,11387.297500000001,14086.388999999999,9534.9835000000003,7910.6329999999998,8795.2824999999993,7939.6530000000002,6507.4449999999997,9425.1545000000006,11604.4115,5269.7250000000004,13186.835499999999,14742.679,11272.941000000001,13986.786,14349.8485,8560.6990000000005,11238.1515,9163.4614999999994,6908.54,11394.0975,13639.012000000001,14790.13,13704.3935,12852.9485,12487.333000000001,14777.127500000001,14664.409,14317.8935,12398.3835,8564.5149999999994,4967.8254999999999,8611.8559999999998,12109.9035,14510.119000000001,13617.075999999999,11266.3585,12685.0265,12613.608,13662.531499999999,9270.8955000000005,8925.3515000000007,7544.1634999999997,7222.1914999999999,10517.762500000001,14685.772499999999,11209.790499999999,14046.6855,14055.790499999999,14325.673000000001,15026.625,13982.9895,11279.227500000001,9981.9964999999993,7481.4245000000001,4455.9544999999998,11199.851500000001,10486.738499999999,10524.592000000001,14709.154500000001,14429.119000000001,14961.362499999999,13453.5695,"-","-","-"]
[null,"Régimen especial",13693,12074,13389,12580,9783,12145,11611,12006,11334,12450,11029,12997,10728,11874,13611,12420,8773,10528,9531,10295,10004,1699,8970,13108,11554,12841,13406,12754,12925,13547,14814,16452,15961,16627,15925,17403,16989,15478,9057,18759,21538,20622,20214,19579,18320,18544,17604,16814,15259,14745,18801,19642,20262,19623,22281,33355,34567,21036,23674,26327,21129.587,21303.1,22515.09,28339.62,23928.682000000001,35033.953000000001,38237.868999999999,40819.699000000001,39298.07,36881.64,27953.325000000004,33001.729999999996,29795.476000000002,26900.633000000002,32544.887999999999,29450.972999999998,37791.438999999998,34304.313999999998,42851.338000000003,41635.487000000001,35035.14,26706.364000000005,22615.163,35112.324999999997,27663.281999999999,22540.775000000001,30503.058000000001,27744.115999999995,32119.218999999997,40513.69,39467.472000000002,38838.065999999999,41435.422999999995,29219.054000000004,24031.909,26555.961000000003,"-","-","-","-","-","-","-","-","-","-","-","-","-","-","-","-","-","-","-","-","-","-","-","-","-","-","-","-","-","-","-","-","-","-","-","-","-","-","-","-","-","-","-","-","-","-","-","-","-","-","-","-","-","-","-","-","-","-","-","-"]
[null,"Generación",496567,449996,458805,388823,455896,520880,638122,606836,526085,462250.95199999999,374289,449073.22,475242,423691,462583,431172,471406,532168,621230,624468,534069,474945,440766,487310,489644,465196,471677,434714,473820,518821,640759,655589,554766,472038,437216,507799,513845,453694,463248,437180,462094,534749,654252,655715,523285,452975,384287,457600,491157.32699999999,455235.18199999997,473038.592,413067.09499999997,436144.88299999997,475305.68199999997,630610.90399999998,624968.60800000001,519996.38500000001,444757.18300000002,402884.99,473125.201,477262.17300000001,430507.49900000001,454438.19,393415.76799999998,454312.19099999999,503299.554,597305.34499999997,639478.98499999999,554476.20499999996,449174.04,370568.261,415085.47399999999,456499.61099999998,479619.15700000001,398397.19699999999,365122.79800000001,417906.739,497614.42499999999,575148.39,606563.245,438411.20600000001,378065.67099999997,302451.109,330037.55800000002,336432.45799999998,332464.337,339852.94500000001,308355.55200000003,357356.462,366321.34,475152.5,473905.94,398388.11200000002,352935.87199999997,308547.739,348650.72499999998,326166.43800000002,297660.73499999999,325982.55499999999,308084.848,350745.34899999999,382818.95600000001,446262.09600000002,462276.03200000001,422721.20799999998,353529.15,274916.88699999999,328054.29700000002,339440.14799999999,320680.37099999998,337375.87599999999,308521.92800000001,384171.01400000002,399568.81400000001,514566.04200000002,485605.55,404153.79499999998,347718.24200000003,296756.95500000002,313617.864,320673.02100000001,312146.81199999998,337281.54599999997,326087.60200000001,365860.34700000001,408588.91100000002,497594.52,497946.65700000001,460178.67800000001,386929.83399999997,325794.625,333524.17,380728.99699999997,331043.38900000002,330539.78399999999,358130.011,407202.43199999997,464048.52,522492.39600000001,539785.50699999998,420663.30300000001,381757.13699999999,334497.80300000001,367190.64500000002,350344.41100000002,357597.82,371721.19900000002,360348.41100000002,384510.34100000001,424923.52799999999,523757.81800000003,550616.10100000002,469789.467,"-","-","-"]
[null,"Enlace Península-Baleares","-","-","-","-","-","-","-","-","-","-","-","-","-","-","-","-","-","-","-","-","-","-","-","-","-","-","-","-","-","-","-","-","-","-","-","-","-","-","-","-","-","-","-","-","-","-","-","-",0,0,0,0,0,0,0,0,0,0,0,0,"-","-","-","-","-","-","-","-","-","-",0.64800000000000002,662.601,2996.8270000000002,25378.617999999999,36698.442999999999,35662.767,31625.769,35803.857000000004,36381.226999999999,68014.381999999998,74016.633000000002,70299.274000000005,67437.619000000006,91247.601999999999,108822.87300000001,90838.239000000001,84296.937000000005,88234.445000000007,83693.952000000005,112811.098,145595.967,157387.88099999999,113878.526,108856.743,86136.35,87955.589000000007,98644.521999999997,86919.695999999996,88249.650999999998,80404.573999999993,85669.402000000002,124876.598,153192.16800000001,165071.86600000001,146829.62899999999,101058.58,79551.937000000005,87790.311000000002,110897.59600000001,111884.63099999999,100736.395,87606.187000000005,65670.471999999994,123291.288,181060.09899999999,170384.12599999999,119558.215,99377.005000000005,71777.664000000004,93548.865999999995,89213.442999999999,91217.188999999998,111467.448,86955.767999999996,105354.345,124743.75900000001,144841.69399999999,152538.68,109260.447,90883.770999999993,58978.756999999998,85128.667000000001,96651.403000000006,64562.012000000002,78352.012000000002,57072.946000000004,75027.426999999996,114233.41499999999,155211.459,166876.245,116104.62300000001,93286.301000000007,70161.933999999994,91766.865000000005,86203.828999999998,99993.399000000005,89996.875,66467.520000000004,89565.091,108623.63499999999,161791.603,153133.58900000001,107931.268,"-","-","-"]
[null,"Demanda transporte (b.c.)",496567,449996,458805,388823,455896,520880,638122,606836,526085,462250.95199999999,374289,449073.22,475242,423691,462583,431172,471406,532168,621230,624468,534069,474945,440766,487310,489644,465196,471677,434714,473820,518821,640759,655589,554766,472038,437216,507799,513845,453694,463248,437180,462094,534749,654252,655715,523285,452975,384287,457600,491157.32699999999,455235.18199999997,473038.592,413067.09499999997,436144.88299999997,475305.68199999997,630610.90399999998,624968.60800000001,519996.38500000001,444757.18300000002,402884.99,473125.201,477262.17300000001,430507.49900000001,454438.19,393415.76799999998,454312.19099999999,503299.554,597305.34499999997,639478.98499999999,554476.20499999996,449174.04,370568.90899999999,415748.07500000001,459496.43800000002,504997.77500000002,435095.64,400785.565,449532.50799999997,533418.28200000001,611529.61699999997,674577.62699999998,512427.83899999998,448364.94500000001,369888.728,421285.16,445255.33100000001,423302.576,424149.88199999998,396589.99699999997,441050.41399999999,479132.43800000002,620748.46699999995,631293.821,512266.63799999998,461792.61499999999,394684.08899999998,436606.31400000001,424810.96,384580.43099999998,414232.20600000001,388489.42200000002,436414.75099999999,507695.554,599454.26399999997,627347.89800000004,569550.83700000006,454587.73,354468.82400000002,415844.60800000001,450337.74400000001,432565.00199999998,438112.27100000001,396128.11499999999,449841.48599999998,522860.10200000001,695626.14099999995,655989.67599999998,523712.01,447095.24699999997,368534.61900000001,407166.73,409886.46399999998,403364.00099999999,448748.99400000001,413043.37,471214.69199999998,533332.67000000004,642436.21400000004,650485.33700000006,569439.125,477813.60499999998,384773.38199999998,418652.837,477380.4,395605.40100000001,408891.79599999997,415202.95699999999,482229.859,578281.93500000006,677703.85499999998,706661.75199999998,536767.92599999998,475043.43800000002,404659.73700000002,458957.51,436548.24,457591.21899999998,461718.07400000002,426815.93099999998,474075.43199999997,533547.16299999994,685549.42099999997,703749.69,577720.73499999999,"-","-","-"]
[]
[null,"Balance eléctrico mensual Islas Canarias (MWh)","2006-01-01","2006-02-01","2006-03-01","2006-04-01","2006-05-01","2006-06-01","2006-07-01","2006-08-01","2006-09-01","2006-10-01","2006-11-01","2006-12-01","2007-01-01","2007-02-01","2007-03-01","2007-04-01","2007-05-01","2007-06-01","2007-07-01","2007-08-01","2007-09-01","2007-10-01","2007-11-01","2007-12-01","2008-01-01","2008-02-01","2008-03-01","2008-04-01","2008-05-01","2008-06-01","2008-07-01","2008-08-01","2008-09-01","2008-10-01","2008-11-01","2008-12-01","2009-01-01","2009-02-01","2009-03-01","2009-04-01","2009-05-01","2009-06-01","2009-07-01","2009-08-01","2009-09-01","2009-10-01","2009-11-01","2009-12-01","2010-01-01","2010-02-01","2010-03-01","2010-04-01","2010-05-01","2010-06-01","2010-07-01","2010-08-01","2010-09-01","2010-10-01","2010-11-01","2010-12-01","2011-01-01","2011-02-01","2011-03-01","2011-04-01","2011-05-01","2011-06-01","2011-07-01","2011-08-01","2011-09-01","2011-10-01","2011-11-01","2011-12-01","2012-01-01","2012-02-01","2012-03-01","2012-04-01","2012-05-01","2012-06-01","2012-07-01","2012-08-01","2012-09-01","2012-10-01","2012-11-01","2012-12-01","2013-01-01","2013-02-01","2013-03-01","2013-04-01","2013-05-01","2013-06-01","2013-07-01","2013-08-01","2013-09-01","2013-10-01","2013-11-01","2013-12-01","2014-01-01","2014-02-01","2014-03-01","2014-04-01","2014-05-01","2014-06-01","2014-07-01","2014-08-01","2014-09-01","2014-10-01","2014-11-01","2014-12-01","2015-01-01","2015-02-01","2015-03-01","2015-04-01","2015-05-01","2015-06-01","2015-07-01","2015-08-01","2015-09-01","2015-10-01","2015-11-01","2015-12-01","2016-01-01","2016-02-01","2016-03-01","2016-04-01","2016-05-01","2016-06-01","2016-07-01","2016-08-01","2016-09-01","2016-10-01","2016-11-01","2016-12-01","2017-01-01","2017-02-01","2017-03-01","2017-04-01","2017-05-01","2017-06-01","2017-07-01","2017-08-01","2017-09-01","2017-10-01","2017-11-01","2017-12-01","2018-01-01","2018-02-01","2018-03-01","2018-04-01","2018-05-01","2018-06-01","2018-07-01","2018-08-01","2018-09-01","2018-10-01","2018-11-01","2018-12-01"]
[null,"Hidráulica",0,0,0,0,0,0,0,0,0,0,0,0,0,0,0,0,0,0,0,0,0,0,0,0,0,0,0,0,0,0,0,0,0,0,0,0,0,0,0,0,0,0,0,0,0,0,0,0,0,0,0,0,0,0,0,0,0,0,0,0,-2.0030000000000001,-1.778,-1.966,-1.821,-1.88,-1.6930000000000001,-1.77,-1.7390000000000001,-1.659,-1.6910000000000001,-1.6479999999999999,-1.5069999999999999,-1.516,-1.542,-1.99,-1.9410000000000001,-1.9970000000000001,-1.9279999999999999,-1.9770000000000001,-1.946,-1.855,-1.871,-1.784,-1.855,-1.867,-1.5880000000000001,-1.4950000000000001,-1.446,-1.4950000000000001,-1.458,-1.484,-1.504,-1.4530000000000001,-1.492,-1.4510000000000001,-1.488,303.39600000000002,274.36399999999998,299.43299999999999,289.012,298.858,281.23500000000001,306.37200000000001,308.505,294.18700000000001,270.27600000000001,259.64600000000002,275.77199999999999,302.96300000000002,268.97399999999999,303.18400000000003,291.012,293.69400000000002,294.19900000000001,302.02499999999998,301.95299999999997,294.12,309.28100000000001,299.74200000000002,307.24599999999998,307.66199999999998,280.30500000000001,309.428,297.27199999999999,306.25400000000002,299.06099999999998,311.60500000000002,264.923,280.44,269.73399999999998,258.59300000000002,268.68400000000003,262.54500000000002,237.11,263.47899999999998,260.03300000000002,269.84699999999998,270.34300000000002,275.07100000000003,287.12299999999999,267.60700000000003,293.59800000000001,273.79399999999998,311.42899999999997,279.43200000000002,34.173000000000002,309.52699999999999,276.12299999999999,308.334,294.48200000000003,295.596,307.64,288.399,"-","-","-"]
[null,"Motores diesel",165513,148359,156468,143502,170858,177722,176016,179233,182517,179648,157979,169849,187608,153155,170227,158998,161066,167755,183062,178646,169801,172067,170171,169446,169904,169953,164609,171005,184619,170736,180381,181406,184435,177595,169810,179313,175499,161432,167927,161723,174920,177098,181952,183950,185161,193478,183078,194481,187860.42600000001,166955.34899999999,187977.302,173369.21400000001,162133.90599999999,164800.02900000001,181346.47099999999,198336.867,189919.53599999999,200384.633,184885.12599999999,185418.913,188315.05,169751.09599999999,187294.71100000001,176784.52600000001,170042.796,179233.32399999999,187174.39999999999,185609.503,187898.01699999999,178185.008,172824.14,178195.823,179333.071,176674.845,179632.32,177987.97700000001,179479.82500000001,163739.00099999999,172466.989,197836.149,171862.37700000001,174580.98300000001,163800.891,171048.533,179857.03,165998.486,179033.25899999999,155919.565,166034.24400000001,161016.57800000001,166449.49100000001,181710.92,170566.372,179071.353,179218.38200000001,181693.443,181768.58600000001,166356.32399999999,183785.66699999999,173057.85200000001,173462.03400000001,175271.106,177522.81099999999,192306.31099999999,182600.03099999999,179344.76800000001,165674.37700000001,187048.568,182931.25,167024.78700000001,184985.01199999999,174671.34899999999,183635.15599999999,162310.734,183941.36,199440.785,197858.96900000001,190752.26199999999,180923.95499999999,193861.90299999999,190988.36300000001,170676.17,189210.20800000001,178541.473,181497.87599999999,174786.027,195369.47500000001,199040.712,172366.81400000001,197754.394,184448.639,187621.39199999999,187922.753,166130.77100000001,180374.272,182196.185,187547.679,177473.77600000001,188916.95499999999,204829.04800000001,190374.36199999999,205566.42600000001,185769.05,185227.49799999999,184470.95499999999,165518.859,176176.58600000001,171464.6,172148.367,162836.70600000001,173812.74900000001,196430.05100000001,187122.56099999999,"-","-","-"]
[null,"Turbina de gas",52857,58444,91260,61071,57809,75033,67196,68751,76471.12,83282,74117,58140,64149,63769,68930,63759,61840,50272,47789,55948,62897,57361,55111,47645,49303,38729,28799,32804,40343,47105,47074,42237,50914,36660,29392,30166,34805,21886,30042,11292,38398,37443,25400,29481,39778.542000000016,31205,25237.511999999988,17204,13491.04,18753.394,20108.357,13928.882,30855.155999999999,31941.35,29817.828000000001,24986.524000000001,28373.723999999998,46582.514999999999,44841.277999999998,39601.608999999997,34489.531000000003,37007.345000000001,48972.353000000003,30093.063999999998,33680.946000000004,29140.663,46058.224999999999,43718.16,56667.764000000003,57329.326000000001,58058.887000000002,53581.663999999997,50750.129000000001,47454.582999999999,51586.402999999998,44026.641000000003,43712.993999999999,42524.76,41988.754000000001,49475.033000000003,60806.792999999998,64122.080999999998,48281.623,53940.516000000003,34472.491000000002,28360.381000000001,31584.142,36297.750999999997,25575.27,22272.523000000001,31699.094000000001,33339.911,28380.670999999998,35606.228000000003,32740.187999999998,28502.143,26245.403999999999,32616.474999999999,19291.740000000002,21075.913,24613.278999999999,28774.097000000002,25980.510999999999,19410.667000000001,50069.565000000002,36400.239999999998,36561.516000000003,39704.887999999999,27866.815999999999,28545.553,23963.727999999999,23573.82,36940.271000000001,35205.165999999997,28064.483,25064.772000000001,32474.697,23872.946,22279.554,19953.465,18430.330000000002,21598.403999999999,18340.243999999999,19063.167000000001,17447.596000000001,14135.014999999999,15590.227999999999,31233.429,37598.512999999999,27178.258000000002,25777.03,29508.41,31081.89,23292.125,24710.708999999999,18531.559000000001,23627.002,23084.35,28038.435000000001,28412.151999999998,32016.894,30160.977999999999,25771.56,25553.940999999999,27249.141,24751.364000000001,19300.776000000002,22020.656999999999,27236.414000000001,24035.203000000001,19071.615000000002,22472.683000000001,28508.218000000001,"-","-","-"]
[null,"Turbina de vapor",348359,305913,351244,298246,274223,249935,254565,265884,284703,261074,270998,264847,267716,244594,270944,295087,222900,280003,253974,300035,289769,297640,280624,303519,325375,311290,288853,271239,285962,228474,273542,273013,285098,298907,282718,289770,283886,246215,277471,250511,289749,254556,266775,281781,281193,297557,249395,264539,275233.60499999998,239085.291,258003.02499999999,233931.054,254626.209,255627.035,246393.45,264783.53899999999,255925.19500000001,219068.06,221691.14600000001,248219.49600000001,239152.22899999999,224588.283,264588.66700000002,228433.046,220645.81599999999,180364.85699999999,227369.77499999999,216034.10500000001,207190.39799999999,231889.65400000001,183627.56400000001,210410.723,234435.492,198717.429,226791.14499999999,204570.22899999999,197795.61199999999,221412.038,236751.367,232960.62299999999,221969.155,235563.59899999999,244573.965,226155.27299999999,194068.79399999999,194765.83499999999,217694.986,205583.55300000001,195789.12100000001,176122.75399999999,213944.97700000001,213465.726,203363.68100000001,222809.97399999999,206131.40700000001,220056.19099999999,216697.50700000001,176742.11600000001,150180.23000000001,152334.79999999999,145996.242,168776.14,183304.36300000001,180445.913,162070.83600000001,169781.14,168773.92300000001,195668.21799999999,202134.49100000001,176199.239,182029.19500000001,159569.774,150479.185,185133.95499999999,204034.609,206268.15100000001,216741.247,163090.201,155701.44699999999,221569.073,229357.24900000001,206628.44099999999,219238.82,193721.36499999999,173241.37599999999,204521.10500000001,222425.38500000001,236303.29399999999,224005.587,208579.20199999999,172038.61199999999,246082.56700000001,210591.342,197528.399,217664.06099999999,240116.47099999999,210579.842,245173.49600000001,239513.29699999999,236212.20800000001,220949.87,221962.174,208786.58600000001,225266.628,230384.78400000001,210409.16099999999,195203.052,189558.611,186409.18599999999,200030.84899999999,206693.728,214943.94899999999,188605.34400000001,"-","-","-"]
[null,"Fuel + Gas",566729,512716,598972,502819,502890,502690,497777,513868,543691.12,524004,503094,492836,519473,461518,510101,517844,445806,498030,484825,534629,522467,527068,505906,520610,544582,519972,482261,475048,510924,446315,500997,496656,520447,513162,481920,499249,494190,429533,475440,423526,503067,469097,474127,495212,506132.54200000002,522240,457710.51199999999,476224,476585.071,424794.03399999999,466088.68400000001,421229.15,447615.27099999995,452368.41399999999,457557.74900000001,488106.93,474218.45499999996,466035.20799999998,451417.55,473240.01800000004,461956.81,431346.72399999999,500855.73100000003,435310.63600000006,424369.55799999996,388738.84399999998,460602.4,445361.76800000004,451756.179,467403.98800000001,414510.59100000001,442188.20999999996,464518.69200000004,422846.85700000002,458009.86800000002,426584.84700000001,420988.43099999998,427675.799,451207.11,480271.80499999999,454638.32500000001,474266.663,456656.47899999999,451144.32199999999,408398.315,389124.70199999999,428312.38699999999,397800.86900000001,387398.63500000001,359411.85499999998,412093.56200000003,428516.55700000003,402310.72400000005,437487.55499999999,418089.97700000001,430251.777,424711.49700000003,375714.91500000004,353257.63699999999,346468.565,344071.55500000005,372821.34299999999,386807.685,392162.891,394740.43200000003,385526.14800000004,371009.81599999999,422421.674,412932.55700000003,371769.57900000003,390977.935,357814.94299999997,371054.61199999996,382649.85499999998,416040.45199999999,430773.70799999998,447074.91300000006,377715.40899999999,358904.95600000001,435384.44099999999,438775.94200000004,398903.01500000001,426789.272,391326.005,372186.848,393442.147,433385.08799999999,466577.435,433970.91399999999,433511.85399999999,382264.28099999996,463212.36900000001,429595.98499999999,386951.29500000004,422749.04200000002,440844.21499999997,421754.52300000004,445731.62200000003,456468.68699999998,469453.40800000005,443341.12599999999,457689.57799999998,420327.196,436048.06699999998,442104.88,400679.38399999996,390680.41399999999,383043.86800000002,385793.96699999995,386902.75800000003,399578.092,433846.68299999996,404236.12300000002,"-","-","-"]
[null,"Ciclo combinado",125939,107765,79372,139320,154766,168017,187960,206155,200181,216209,204172,217541,203577,170340,199354,152118,243924,185380,229495,189228,195544,230632,226835,216848,199787,167592,219679,215393,194309,240047,218649,221342,228900,217782,219404,230433,218103,205178,222643,198070,148582,202502,234690,211977,201745,231922,241597,235319,230101.864,203031.70800000001,228450.67800000001,216494.734,193292.74799999999,190320.30900000001,218682.10200000001,224299.34099999999,235057.37,266936.90600000002,253781.81899999999,247960.606,252675.72099999999,190664.927,187253.67199999999,212218.769,245524.552,274539.09000000003,221192.1,252141.94200000001,256022.451,268392.69400000002,290204.24,263796.3,258272.88399999999,232593.81,227561.90599999999,210953.44500000001,248854.85399999999,228483.17,232663.58,232759.489,272478.53600000002,253879.98,229148.86799999999,242673.976,278033.15899999999,221752.503,244149.13099999999,242681.5,248314.519,243267.361,262096.342,269105.51799999998,269025.26899999997,246674.82800000001,214423.55300000001,206626.68799999999,247173.54399999999,226925.12299999999,278068.43099999998,273193.304,277994.897,249991.12100000001,269076.66200000001,262773.20699999999,316154.11,286194.61800000002,296834.37,256212.30900000001,254475.05799999999,224932.95300000001,253008.326,259090.201,259198.77499999999,240922.82699999999,255030.14799999999,254343.505,259540.69699999999,349029.11099999998,309576.93699999998,268908.25099999999,245251.45600000001,216888.698,231405.546,244969.85,268636.82799999998,236247.33300000001,238990.94099999999,245328.76699999999,238701.59700000001,292401.821,302452.26799999998,247058.636,280539.103,234197.79800000001,249097.16699999999,218370.24,253928.91200000001,213373.41800000001,229739.41200000001,259877.86900000001,234654.51500000001,288990.75400000002,280937.69699999999,253670.39799999999,233901.625,215216.772,260839.18100000001,246337.68299999999,248616.78899999999,234948.236,230145.59599999999,251789.052,281474.674,"-","-","-"]
[null,"Generación auxiliar",0,0,0,0,0,0,0,0,0,0,0,0,12171,11523,11651,11641,10919,9438,10685,12461,11325,11933,10055,9038,10202,9659,10861,10032,6829,6410,7670,7858,5141,4729,5487,4869,4385,3909,4661,2586,2823,3208,5305,3351,1680,811,899,170,0,0,0,0,0,0,0,0,0,0,0,0,null,null,null,null,null,null,null,null,null,null,null,null,null,null,null,null,null,null,null,null,null,null,null,null,null,null,null,null,null,null,null,null,null,null,null,null,null,null,null,null,null,null,null,null,null,null,null,null,null,null,null,null,null,null,null,null,null,null,null,null,null,null,null,null,null,null,null,null,null,null,null,null,null,null,null,null,null,null,null,null,null,null,null,null,null,null,null,null,null,null,null,null,null,"-","-","-"]
[null,"Régimen ordinario",692668,620481,678344,642139,657656,670707,685737,720023,743872.12,740213,707266,710377,735221,643381,721106,681603,700649,692848,725005,736318,729336,769633,742796,746496,754571,697223,712801,700473,712062,692772,727316,725856,754488,735673,706811,734551,716678,638620,702744,624182,654472,674807,714122,710540,709557.54200000002,754973,700206.51199999999,711713,706686.93500000006,627825.74199999997,694539.36199999996,637723.88400000008,640908.01899999997,642688.723,676239.85100000002,712406.27099999995,709275.82499999995,732972.11400000006,705199.36899999995,721200.62400000007,714630.52799999993,622009.87300000002,688107.43700000003,647527.58400000003,669892.23,663276.24099999992,681792.73,697501.97100000002,707776.97100000002,735794.99100000004,704713.18299999996,705983.00300000003,722790.06,655439.125,685569.78399999999,637536.35100000002,669841.28799999994,656157.04099999997,683868.71299999999,713029.348,727115.00600000005,728144.772,685803.56299999997,693816.44299999997,686429.60699999996,610875.61699999997,672460.02300000004,640480.92299999995,635711.65899999999,602677.75800000003,674188.42,697620.571,671334.54,684160.89099999995,632512.07900000003,636876.97699999996,"-","-","-","-","-","-","-","-","-","-","-","-","-","-","-","-","-","-","-","-","-","-","-","-","-","-","-","-","-","-","-","-","-","-","-","-","-","-","-","-","-","-","-","-","-","-","-","-","-","-","-","-","-","-","-","-","-","-","-","-"]
[null,"Hidroeólica","-","-","-","-","-","-","-","-","-","-","-","-","-","-","-","-","-","-","-","-","-","-","-","-","-","-","-","-","-","-","-","-","-","-","-","-","-","-","-","-","-","-","-","-","-","-","-","-","-","-","-","-","-","-","-","-","-","-","-","-","-","-","-","-","-","-","-","-","-","-","-","-","-","-","-","-","-","-","-","-","-","-","-","-","-","-","-","-","-","-","-","-","-","-","-","-","-","-","-","-","-",2.02,8.6389999999999993,274.245,101.643,0,154.755,187.535,384.98899999999998,344.34100000000001,204.85499999999999,96.545000000000002,179.51499999999999,326.20600000000002,2072.1610000000001,1917.4590000000001,716.12199999999996,453.29300000000001,868.56,643.37800000000004,790.73599999999999,1770.319,1510.1659999999999,1280.933,896.73299999999995,1990.3409999999999,2569.1329999999998,2210.7860000000001,2161.9989999999998,704.28700000000003,993.84,1012.663,1068.971,1435.85,2122.2330000000002,968.50400000000002,1475.1179999999999,2217.806,3109.0070000000001,2450.308,2337.1379999999999,971.27599999999995,790.82500000000005,1286.021,2257.7669999999998,1754.3050000000001,1599.5219999999999,2262.6460000000002,2034.203,2321.8040000000001,3716.2829999999999,2859.3209999999999,2165.8609999999999,"-","-","-"]
[null,"Hidráulica/Resto hidráulica",0,0,0,0,0,0,0,0,0,0,0,0,0,0,0,0,0,0,82,190,247,92,278,287,287,244,240,0,185,315,305,97,0,0,0,0,9,164,175,50,0,0,0,0,0,0,0,0,0,0,0,0,0,0,0,0,0,0,0,0,9.5000000000000001E-2,0,1.7769999999999999,239.375,164.61099999999999,130.56899999999999,245.417,179.15100000000001,200.899,238.375,164.249,111.408,116.43899999999999,7.4999999999999997E-2,163.001,246.87899999999999,218.845,207.49700000000001,62.734999999999999,230.96700000000001,221.7,205.726,40.073,77.364000000000004,224.66300000000001,204.523,136.68199999999999,136.99,292.267,286.38799999999998,286.267,286.37400000000002,292.33800000000002,303.71199999999999,293.43599999999998,305.86399999999998,"-","-","-","-","-","-","-","-","-","-","-","-","-","-","-","-","-","-","-","-","-","-","-","-","-","-","-","-","-","-","-","-","-","-","-","-","-","-","-","-","-","-","-","-","-","-","-","-","-","-","-","-","-","-","-","-","-","-","-","-"]
[null,"Eólica",17431.845000000001,18906.552,22433.485000000001,28613.578000000001,35233.5,25590.253000000001,56231.544000000002,38386.534,22680.768,19552.138999999999,15309.171,25694.21,17536,22919,37045,26057,34949,31706,57951,48557,26273,19181,16085,18581,12697,16352,39237,36025,31842,39889,59648,61491,17713,33991,22016,25574,23706,17290,24349,46455,32116,20734,55995,57105,22914,12762,24732,20549,11740,14778,23015,32147,36251,38838,47304,42622,35769,14015,17956,16928,11404.08,24311.829000000002,22948.121999999999,24018.133999999998,19588.204000000002,37820.731,55748.883000000002,52230.828999999998,31670.316999999999,25772.317999999999,15869.370999999999,34294.942999999999,18963.88,33726.285000000003,33681.697,30021.198,26774.771000000001,44057.214,57535.39,54600.536,12813.212,17087.317999999999,16904.712,15601.111999999999,24542.069,28387.059000000001,13294.339,27647.999,38088.171000000002,48342.129000000001,41479.146999999997,42313.802000000003,24539.764999999999,24189.816999999999,27762.66,22146.527999999998,29456.385999999999,32605.983,45693.779000000002,27505.592000000001,42524.828999999998,35023.161,45177.292000000001,59087.231,12367.692999999999,15750.272999999999,20598.572,23738.014999999999,41468.697999999997,43676.997000000003,41791.703999999998,28966.517,40093.75,30388.71,59610.985000000001,49740.294000000002,17421.194,10614.165999999999,24303.164000000001,8610.9639999999999,19203.504000000001,40727.103000000003,33659.559000000001,25977.746999999999,30430.550999999999,44238.828000000001,56791.595000000001,48605.248,46716.553,13314.826999999999,17702.067999999999,15713,15115.34,22686.48,36303.305,18569.133000000002,25519.845000000001,40162.351999999999,50390.07,47397.180999999997,54609.197,21330.208999999999,24032.089,39812.146999999997,56908.339,46207.472000000002,50497.743999999999,45548.925000000003,55351.942000000003,56421.116999999998,95148.663,65077.771999999997,51688.220999999998,"-","-","-"]
[null,"Solar fotovoltaica",36.402000000000001,46.195999999999998,66.179000000000002,67.328000000000003,76.62,77.052999999999997,98.995000000000005,430.70800000000003,484.04,533.36199999999997,462.50200000000001,536.16499999999996,610,833,1268,1459,1737,1692,2046,2433,2017,2022,1635,1621,2022,2658,3713,4145,4312,4894,5548,5693,6152,9825,7689,6849,8709,10847,12492,16156,16219,16256,17530,17568,12555,13377,11497,9124,10698,10306,16328,16499,19138,19607,22480,21526,17621,15830,12519,12614,15208.981,16925.322,19749.058000000001,19788.121999999999,20867.145,23436.741999999998,23909.437999999998,24852.741000000002,20991.273000000001,17726.076000000001,14532.902,15011.39,15819.209000000001,17853.072,23038.751,20676.245999999999,24978.376,25023.071,26449.416000000001,26299.356,23157.727999999999,19232.280999999999,16071.460999999999,17914.419000000002,20252.741000000002,19458.058000000001,23738.812999999998,27151.991000000002,27709.879000000001,30874.996999999999,30902.741999999998,26949.797999999999,24098.381000000001,22189.812000000002,17740.242999999999,15635.861999999999,18995.296999999999,20131.841,27162.146000000001,25918.809000000001,29371.409,27593.422999999999,27932.593000000001,29918.848000000002,21432.359,20632.921999999999,16823.303,16372.739,18338.96,17768.262999999999,25468.777999999998,25099.776000000002,29873.021000000001,27306.09,30356.457999999999,26057.348999999998,20794.073,17895.282999999999,18494.508999999998,18094.044999999998,19686.59,20001.838,24026.333999999999,24141.434000000001,25214.812999999998,29413.995999999999,29165.302,27398.406999999999,25682.866000000002,20207.853999999999,17006.974999999999,15714.933999999999,18013.852999999999,18975.393,25348.940999999999,25780.478999999999,25230.681,27578.364000000001,29027.198,26916.004000000001,22973.414000000001,19754.670999999998,16484.16,17539.053,19063.384999999998,17866.653999999999,25080.915000000001,25190.73,23051.194,25992.826000000001,29624.827000000001,27841.746999999999,24190.495999999999,"-","-","-"]
[null,"Térmica renovable/Otras renovables",8687.5660000000044,11201.251999999999,21105.335999999999,20726.093999999997,19570.879999999997,20816.694,21169.460999999999,19156.758000000002,13239.191999999999,22026.499000000003,17532.326999999997,22967.625,21162,19576,5693,17196,15807,15288,19273,20695,19120,18295,18031,23147,22239,19665,20200,19685,21462,14780,144,21585,13957,17447,22889,23166,23472,22220,12230,24755,22920,23920,24575,24604,23900,22497,23578,24384,23902,18935,16313,24282,25112,19550,10072,5987,5025,5016,3979,2388,806.47,704.44600000000003,710.76400000000001,790.52300000000002,789.60299999999995,728.28800000000001,734.67399999999998,721.86400000000003,702.34199999999998,703.07799999999997,748.53099999999995,675.36300000000006,612.11,489.72300000000001,585.19799999999998,682.91600000000005,647.63499999999999,645.86599999999999,716.72299999999996,723.61300000000006,743.06100000000004,760.45899999999995,617.47500000000002,825.66800000000001,744.28300000000002,697.577,800.20100000000002,747.98099999999999,798.7,697.58100000000002,798.74400000000003,711.54100000000005,628.87699999999995,722.197,510.74700000000001,644.15899999999999,786.87199999999996,707.19500000000005,777.80100000000004,663.43399999999997,668.76599999999996,643.02099999999996,797.43200000000002,820.72199999999998,628.57899999999995,746.80200000000002,834.91099999999994,731.04899999999998,378.98899999999998,349.56599999999997,447.53199999999998,493.86799999999999,605.66399999999999,795.14,838.07,840.53599999999994,865.44399999999996,810.06799999999998,840.38499999999999,788.36300000000006,861.78599999999994,734.55399999999997,824.45399999999995,816.61800000000005,883.87900000000002,679.27,761.14599999999996,696.04200000000003,737.82899999999995,786.36699999999996,764.76800000000003,789.06200000000001,811.43100000000004,720.25,830.73599999999999,835.52,813.43200000000002,823.178,830.51900000000001,681.52599999999995,802.31299999999999,831.37800000000004,803.24,781.73599999999999,762.423,646.57299999999998,837.29399999999998,538.89700000000005,750.601,531.01499999999999,702.39400000000001,816.452,782.90899999999999,"-","-","-"]
[null,"Térmica no renovable/Cogeneración y resto/Cogeneración",2832.1869999999999,0,0,0,0,0,0,0,0,0,0,0,0,0,0,0,0,0,0,0,0,0,0,0,0,0,0,0,0,0,0,0,0,0,0,0,0,0,0,0,10,10,0,0,0,0,0,0,0,0,0,0,0,0,0,0,0,0,0,0,2467.8470000000002,5041.9530000000004,5258.0919999999996,4794.57,6169.0249999999996,1075.8789999999999,"-","-","-","-","-","-","-","-","-","-","-","-","-","-","-","-","-","-","-","-","-","-","-","-","-","-","-","-","-","-","-","-","-","-","-","-","-","-","-","-","-","-","-","-","-","-","-","-","-","-","-","-","-","-","-","-","-","-","-","-","-","-","-","-","-","-","-","-","-","-","-","-","-","-","-","-","-","-","-","-","-","-","-","-","-","-","-","-","-","-"]
[null,"Régimen especial",28988,30154,43605,49407,54881,46484,77500,57974,36404,42112,33304,49198,39308,43328,44006,44712,52493,48686,79352,71875,47657,39590,36029,43636,37245,38919,63390,59855,57801,59878,65645,88866,37822,61263,52594,55589,55896,50521,49246,87416,71265,60920,98100,99277,59369,48636,59807,54057,46340,44019,55656,72928,80501,77995,79856,70135,58415,34861,34454,31930,29887.473000000002,46983.55,48667.812999999995,49630.723999999995,47578.588000000011,63192.209000000003,80638.411999999997,77984.584999999992,53564.830999999998,44439.847000000002,31315.052999999996,50093.103999999999,35511.637999999999,52069.154999999999,57468.64699999999,51627.239000000001,52619.627,69933.648000000001,84764.263999999996,81854.471999999994,36935.701000000001,37285.784,33633.720999999998,34418.563000000002,45763.756000000001,48747.216999999997,37970.035000000003,55684.961000000003,66889.017000000007,80201.095000000001,73466.899999999994,70261.514999999999,49559.360999999997,47405.538,46307.086000000003,38732.413,"-","-","-","-","-","-","-","-","-","-","-","-","-","-","-","-","-","-","-","-","-","-","-","-","-","-","-","-","-","-","-","-","-","-","-","-","-","-","-","-","-","-","-","-","-","-","-","-","-","-","-","-","-","-","-","-","-","-","-","-"]
[null,"Generación",721656,650635,721949,691546,712537,717191,763237,777997,780276.12,782325,740570,759575,774529,686709,765112,726315,753142,741534,804357,808193,776993,809223,778825,790132,791816,736142,776191,760328,769863,752650,792961,814722,792310,796936,759405,790140,772574,689141,751990,711598,725737,735727,812222,809817,768926.54200000002,803609,760013.51199999999,765770,753026.93500000006,671844.74199999997,750195.36199999996,710651.88399999996,721409.01899999997,720683.723,756095.85100000002,782541.27099999995,767690.82499999995,767833.11400000006,739653.36899999995,753130.62400000007,744518.00100000005,668993.42299999995,736775.25,697158.30799999996,717470.81799999997,726468.45,762431.14199999999,775486.55599999998,761341.80200000003,780234.83799999999,736028.23600000003,756076.10699999996,758301.69799999997,707508.28,743038.43099999998,689163.59,722460.91500000004,726090.68900000001,768632.97699999996,794883.82,764050.70700000005,765430.55599999998,719437.28399999999,728235.00600000005,732193.36300000001,659622.83400000003,710430.05799999996,696165.88399999996,702600.67599999998,682878.853,747655.32,767882.08600000001,720893.90099999995,731566.429,678819.16500000004,675609.39,721426.99199999997,656359.42099999997,705259.22699999996,674038.71600000001,694930.31400000001,686355.32400000002,730106.67500000005,745345.64899999998,745719.00300000003,709121.03899999999,706515.37300000002,719939.09299999999,728282.21400000004,659110.67299999995,712202.31400000001,671852.86199999996,701299.03099999996,682683.027,764250.299,763974.804,746706.56299999997,756826.61100000003,713288.25300000003,732736.68799999997,724877.67599999998,679305.83200000005,718524.75899999996,688809.85900000005,698555.90599999996,706310.97600000002,761974.81,791081.60800000001,748252.19799999997,761196.74399999995,721442.79299999995,743769.348,745407.228,665204.17599999998,736714.90300000005,705628.12399999995,728992.35800000001,730157.08299999998,769839.96400000004,807063.41899999999,758985.31,789861.46400000004,743649.00100000005,749448.85100000002,755277.85100000002,682405.33299999998,729844.59699999995,703198.87199999997,715907.03,707412.23800000001,759211.451,782538.66700000002,764826.68299999996,"-","-","-"]
[null,"Demanda transporte (b.c.)",721656,650635,721949,691546,712537,717191,763237,777997,780276.12,782325,740570,759575,774529,686709,765112,726315,753142,741534,804357,808193,776993,809223,778825,790132,791816,736142,776191,760328,769863,752650,792961,814722,792310,796936,759405,790140,772574,689141,751990,711598,725737,735727,812222,809817,768926.54200000002,803609,760013.51199999999,765770,753026.93500000006,671844.74199999997,750195.36199999996,710651.88399999996,721409.01899999997,720683.723,756095.85100000002,782541.27099999995,767690.82499999995,767833.11400000006,739653.36899999995,753130.62400000007,744518.00100000005,668993.42299999995,736775.25,697158.30799999996,717470.81799999997,726468.45,762431.14199999999,775486.55599999998,761341.80200000003,780234.83799999999,736028.23600000003,756076.10699999996,758301.69799999997,707508.28,743038.43099999998,689163.59,722460.91500000004,726090.68900000001,768632.97699999996,794883.82,764050.70700000005,765430.55599999998,719437.28399999999,728235.00600000005,732193.36300000001,659622.83400000003,710430.05799999996,696165.88399999996,702600.67599999998,682878.853,747655.32,767882.08600000001,720893.90099999995,731566.429,678819.16500000004,675609.39,721426.99199999997,656359.42099999997,705259.22699999996,674038.71600000001,694930.31400000001,686355.32400000002,730106.67500000005,745345.64899999998,745719.00300000003,709121.03899999999,706515.37300000002,719939.09299999999,728282.21400000004,659110.67299999995,712202.31400000001,671852.86199999996,701299.03099999996,682683.027,764250.299,763974.804,746706.56299999997,756826.61100000003,713288.25300000003,732736.68799999997,724877.67599999998,679305.83200000005,718524.75899999996,688809.85900000005,698555.90599999996,706310.97600000002,761974.81,791081.60800000001,748252.19799999997,761196.74399999995,721442.79299999995,743769.348,745407.228,665204.17599999998,736714.90300000005,705628.12399999995,728992.35800000001,730157.08299999998,769839.96400000004,807063.41899999999,758985.31,789861.46400000004,743649.00100000005,749448.85100000002,755277.85100000002,682405.33299999998,729844.59699999995,703198.87199999997,715907.03,707412.23800000001,759211.451,782538.66700000002,764826.68299999996,"-","-","-"]
[]
[null,"Balance eléctrico mensual Ceuta (MWh)","2007-01-01","2007-02-01","2007-03-01","2007-04-01","2007-05-01","2007-06-01","2007-07-01","2007-08-01","2007-09-01","2007-10-01","2007-11-01","2007-12-01","2008-01-01","2008-02-01","2008-03-01","2008-04-01","2008-05-01","2008-06-01","2008-07-01","2008-08-01","2008-09-01","2008-10-01","2008-11-01","2008-12-01","2009-01-01","2009-02-01","2009-03-01","2009-04-01","2009-05-01","2009-06-01","2009-07-01","2009-08-01","2009-09-01","2009-10-01","2009-11-01","2009-12-01","2010-01-01","2010-02-01","2010-03-01","2010-04-01","2010-05-01","2010-06-01","2010-07-01","2010-08-01","2010-09-01","2010-10-01","2010-11-01","2010-12-01","2011-01-01","2011-02-01","2011-03-01","2011-04-01","2011-05-01","2011-06-01","2011-07-01","2011-08-01","2011-09-01","2011-10-01","2011-11-01","2011-12-01","2012-01-01","2012-02-01","2012-03-01","2012-04-01","2012-05-01","2012-06-01","2012-07-01","2012-08-01","2012-09-01","2012-10-01","2012-11-01","2012-12-01","2013-01-01","2013-02-01","2013-03-01","2013-04-01","2013-05-01","2013-06-01","2013-07-01","2013-08-01","2013-09-01","2013-10-01","2013-11-01","2013-12-01","2014-01-01","2014-02-01","2014-03-01","2014-04-01","2014-05-01","2014-06-01","2014-07-01","2014-08-01","2014-09-01","2014-10-01","2014-11-01","2014-12-01","2015-01-01","2015-02-01","2015-03-01","2015-04-01","2015-05-01","2015-06-01","2015-07-01","2015-08-01","2015-09-01","2015-10-01","2015-11-01","2015-12-01","2016-01-01","2016-02-01","2016-03-01","2016-04-01","2016-05-01","2016-06-01","2016-07-01","2016-08-01","2016-09-01","2016-10-01","2016-11-01","2016-12-01","2017-01-01","2017-02-01","2017-03-01","2017-04-01","2017-05-01","2017-06-01","2017-07-01","2017-08-01","2017-09-01","2017-10-01","2017-11-01","2017-12-01","2018-01-01","2018-02-01","2018-03-01","2018-04-01","2018-05-01","2018-06-01","2018-07-01","2018-08-01","2018-09-01","2018-10-01","2018-11-01","2018-12-01"]
[null,"Motores diesel",17987,16069,16710,15678,16366,16225,17421,17411,16812,17279,16847,17839,18351,17181,16737,16313,16713,16662,18076,18122,17406,17168,17471,19471,19477,16819,17213,15436,16246,17311,18716,16715,17948,18184,16095,18156,16835.431,16928.368999999999,17444.607,16234.076999999999,17320.935000000001,17763.089,19394.422999999999,20221.285,18911.028999999999,18433.375,17839.231,17340.393,16727.395,15216.784,16429.358,14974.755999999999,15951.380999999999,17325.353999999999,18625.385999999999,18453.005000000001,16688.662,17719.653999999999,16750.932000000001,17804.21,18519.812999999998,17892.191999999999,17519.22,16664,17365.008000000002,17463.001,17737.418000000001,18517.264999999999,17121.577000000001,17631.164000000001,17337.635999999999,17742.494999999999,17869.672999999999,15515.59,15413.279,14542.153,15583.128000000001,15753.663,17866.710999999999,18953.245999999999,17326.920999999998,16943.323,17474.988000000001,18462.717000000001,18803.239000000001,17215.984,17656.77,14795.036,17090.643,17302.598999999998,18277.512999999999,18625.955000000002,18513.099999999999,18195.264999999999,17358.740000000002,18317.780999999999,18698.285,16003.342000000001,15897.091,15141.847,16578.946,16886.464,19009.494999999999,18610.038,16586.111000000001,16965.813999999998,15790.199000000001,17089.677,17310.614000000001,16980.900000000001,16940.271000000001,16285.689,16948.123,16942.517,18292.337,19185.149000000001,18110.431,17860.678,17437.978999999999,18263.304,18539.672999999999,15708.091,16352.188,14939.106,16501.16,17164.766,17578.381000000001,18673.013999999999,17044.545999999998,15956.772999999999,16328.555,17861.952000000001,18543.508000000002,17093.705999999998,17581.858,16315.112999999999,16335.308999999999,15983.209000000001,17163.687000000002,17711.165000000001,18071.241999999998,"-","-","-"]
[null,"Turbina de gas",0,0,0,0,0,0,0,0,0,0,0,0,0,0,0,0,0,0,0,0,0,0,0,0,0,0,0,0,0,0,159,1859,0,0,1026,209,2043.2850000000001,554.101,0,147.30500000000001,121.071,0,0,0,0,0,0,3.105,26.599,31.702000000000002,0,0,174.547,32.029000000000003,21.350999999999999,0.94699999999999995,0,3.891,6.7149999999999999,8.2349999999999994,0,143.124,110.084,10.287000000000001,135.30000000000001,25.193999999999999,17.056999999999999,39.597000000000001,2.2690000000000001,58.15,20.059999999999999,0,36.262999999999998,41.424999999999997,3.2000000000000001E-2,33.1,117.861,9.1349999999999998,0,0,0,0,11.071999999999999,10.654999999999999,2.5510000000000002,0,78.825999999999993,0,0.253,0.217,0,0.22500000000000001,0.25700000000000001,0.316,9.8870000000000005,0,0.17100000000000001,231.11600000000001,0.54700000000000004,0.47199999999999998,67.792000000000002,9.7119999999999997,146.10599999999999,0.98299999999999998,0.51600000000000001,0,308.06400000000002,0.30199999999999999,0.54800000000000004,0.67900000000000005,0.53100000000000003,0.435,0.53100000000000003,0.191,0.64,0.96699999999999997,96.950999999999993,4.1879999999999997,16.742999999999999,0.54,0.38200000000000001,15.823,0.44,0.58899999999999997,0.57899999999999996,6.09,3.5990000000000002,0.42499999999999999,132.386,7.819,44.363,0,0.55300000000000005,5.36,3.1160000000000001,0.55300000000000005,7.5940000000000003,0.51800000000000002,0.90400000000000003,0.59899999999999998,4.1950000000000003,"-","-","-"]
[null,"Fuel + Gas",17987,16069,16710,15678,16366,16225,17421,17411,16812,17279,16847,17839,18351,17181,16737,16313,16713,16662,18076,18122,17406,17168,17471,19471,19477,16819,17213,15436,16246,17311,18875,18574,17948,18184,17121,18365,18878.716,17482.469999999998,17444.607,16381.382,17442.006000000001,17763.089,19394.422999999999,20221.285,18911.028999999999,18433.375,17839.231,17343.498,16753.993999999999,15248.485999999999,16429.358,14974.755999999999,16125.928,17357.382999999998,18646.736999999997,18453.952000000001,16688.662,17723.544999999998,16757.647000000001,17812.445,18519.812999999998,18035.315999999999,17629.304,16674.287,17500.308000000001,17488.195,17754.475000000002,18556.862000000001,17123.846000000001,17689.314000000002,17357.696,17742.494999999999,17905.935999999998,15557.014999999999,15413.311,14575.253000000001,15700.989000000001,15762.798000000001,17866.710999999999,18953.245999999999,17326.920999999998,16943.323,17486.060000000001,18473.371999999999,18805.79,17215.984,17735.596000000001,14795.036,17090.896000000001,17302.815999999999,18277.512999999999,18626.18,18513.357,18195.580999999998,17368.627,18317.780999999999,18698.455999999998,16234.458000000001,15897.638000000001,15142.319,16646.738000000001,16896.175999999999,19155.600999999999,18611.021000000001,16586.627,16965.813999999998,16098.263000000001,17089.978999999999,17311.162,16981.579000000002,16940.802,16286.124,16948.653999999999,16942.707999999999,18292.976999999999,19186.116000000002,18207.382000000001,17864.865999999998,17454.721999999998,18263.844000000001,18540.055,15723.914000000001,16352.628000000001,14939.695,16501.739000000001,17170.856,17581.98,18673.438999999998,17176.931999999997,15964.591999999999,16372.918,17861.952000000001,18544.061000000002,17099.065999999999,17584.974000000002,16315.665999999999,16342.902999999998,15983.727000000001,17164.591,17711.763999999999,18075.436999999998,"-","-","-"]
[null,"Régimen ordinario",17987,16069,16710,15678,16366,16225,17421,17411,16812,17279,16847,17839,18351,17181,16737,16313,16713,16662,18076,18122,17406,17168,17471,19471,19477,16819,17213,15436,16246,17311,18875,18574,17948,18184,17121,18365,18878.716,17482.469999999998,17444.607,16381.382,17442.006000000001,17763.089,19394.422999999999,20221.285,18911.028999999999,18433.375,17839.231,17343.498,16753.993999999999,15248.485999999999,16429.358,14974.755999999999,16125.928,17357.382999999998,18646.736999999997,18453.952000000001,16688.662,17723.544999999998,16757.647000000001,17812.445,18519.812999999998,18035.315999999999,17629.304,16674.287,17500.308000000001,17488.195,17754.475000000002,18556.862000000001,17123.846000000001,17689.314000000002,17357.696,17742.494999999999,17905.935999999998,15557.014999999999,15413.311,14575.253000000001,15700.989000000001,15762.798000000001,17866.710999999999,18953.245999999999,17326.920999999998,16943.323,17486.060000000001,18473.371999999999,"-","-","-","-","-","-","-","-","-","-","-","-","-","-","-","-","-","-","-","-","-","-","-","-","-","-","-","-","-","-","-","-","-","-","-","-","-","-","-","-","-","-","-","-","-","-","-","-","-","-","-","-","-","-","-","-","-","-","-","-"]
[null,"Generación",17987,16069,16710,15678,16366,16225,17421,17411,16812,17279,16847,17839,18351,17181,16737,16313,16713,16662,18076,18122,17406,17168,17471,19471,19477,16819,17213,15436,16246,17311,18875,18574,17948,18184,17121,18365,18878.716,17482.469999999998,17444.607,16381.382,17442.006000000001,17763.089,19394.422999999999,20221.285,18911.028999999999,18433.375,17839.231,17343.498,16753.993999999999,15248.486000000001,16429.358,14974.755999999999,16125.928,17357.383000000002,18646.737000000001,18453.952000000001,16688.662,17723.544999999998,16757.647000000001,17812.445,18519.812999999998,18035.315999999999,17629.304,16674.287,17500.308000000001,17488.195,17754.474999999999,18556.862000000001,17123.846000000001,17689.313999999998,17357.696,17742.494999999999,17905.936000000002,15557.014999999999,15413.311,14575.253000000001,15700.989,15762.798000000001,17866.710999999999,18953.245999999999,17326.920999999998,16943.323,17486.060000000001,18473.371999999999,18805.79,17215.984,17735.596000000001,14795.036,17090.896000000001,17302.815999999999,18277.512999999999,18626.18,18513.357,18195.580999999998,17368.627,18317.780999999999,18698.455999999998,16234.458000000001,15897.638000000001,15142.319,16646.738000000001,16896.175999999999,19155.600999999999,18611.021000000001,16586.627,16965.813999999998,16098.263000000001,17089.978999999999,17311.162,16981.579000000002,16940.802,16286.124,16948.653999999999,16942.707999999999,18292.976999999999,19186.116000000002,18207.382000000001,17864.866000000002,17454.722000000002,18263.844000000001,18540.055,15723.914000000001,16352.628000000001,14939.695,16501.739000000001,17170.856,17581.98,18673.438999999998,17176.932000000001,15964.592000000001,16372.918,17861.952000000001,18544.061000000002,17099.065999999999,17584.973999999998,16315.665999999999,16342.903,15983.727000000001,17164.591,17711.763999999999,18075.437000000002,"-","-","-"]
[null,"Demanda transporte (b.c.)",17987,16069,16710,15678,16366,16225,17421,17411,16812,17279,16847,17839,18351,17181,16737,16313,16713,16662,18076,18122,17406,17168,17471,19471,19477,16819,17213,15436,16246,17311,18875,18574,17948,18184,17121,18365,18878.716,17482.469999999998,17444.607,16381.382,17442.006000000001,17763.089,19394.422999999999,20221.285,18911.028999999999,18433.375,17839.231,17343.498,16753.993999999999,15248.486000000001,16429.358,14974.755999999999,16125.928,17357.383000000002,18646.737000000001,18453.952000000001,16688.662,17723.544999999998,16757.647000000001,17812.445,18519.812999999998,18035.315999999999,17629.304,16674.287,17500.308000000001,17488.195,17754.474999999999,18556.862000000001,17123.846000000001,17689.313999999998,17357.696,17742.494999999999,17905.936000000002,15557.014999999999,15413.311,14575.253000000001,15700.989,15762.798000000001,17866.710999999999,18953.245999999999,17326.920999999998,16943.323,17486.060000000001,18473.371999999999,18805.79,17215.984,17735.596000000001,14795.036,17090.896000000001,17302.815999999999,18277.512999999999,18626.18,18513.357,18195.580999999998,17368.627,18317.780999999999,18698.455999999998,16234.458000000001,15897.638000000001,15142.319,16646.738000000001,16896.175999999999,19155.600999999999,18611.021000000001,16586.627,16965.813999999998,16098.263000000001,17089.978999999999,17311.162,16981.579000000002,16940.802,16286.124,16948.653999999999,16942.707999999999,18292.976999999999,19186.116000000002,18207.382000000001,17864.866000000002,17454.722000000002,18263.844000000001,18540.055,15723.914000000001,16352.628000000001,14939.695,16501.739000000001,17170.856,17581.98,18673.438999999998,17176.932000000001,15964.592000000001,16372.918,17861.952000000001,18544.061000000002,17099.065999999999,17584.973999999998,16315.665999999999,16342.903,15983.727000000001,17164.591,17711.763999999999,18075.437000000002,"-","-","-"]
[]
[null,"Balance eléctrico mensual Melilla (MWh)","2007-01-01","2007-02-01","2007-03-01","2007-04-01","2007-05-01","2007-06-01","2007-07-01","2007-08-01","2007-09-01","2007-10-01","2007-11-01","2007-12-01","2008-01-01","2008-02-01","2008-03-01","2008-04-01","2008-05-01","2008-06-01","2008-07-01","2008-08-01","2008-09-01","2008-10-01","2008-11-01","2008-12-01","2009-01-01","2009-02-01","2009-03-01","2009-04-01","2009-05-01","2009-06-01","2009-07-01","2009-08-01","2009-09-01","2009-10-01","2009-11-01","2009-12-01","2010-01-01","2010-02-01","2010-03-01","2010-04-01","2010-05-01","2010-06-01","2010-07-01","2010-08-01","2010-09-01","2010-10-01","2010-11-01","2010-12-01","2011-01-01","2011-02-01","2011-03-01","2011-04-01","2011-05-01","2011-06-01","2011-07-01","2011-08-01","2011-09-01","2011-10-01","2011-11-01","2011-12-01","2012-01-01","2012-02-01","2012-03-01","2012-04-01","2012-05-01","2012-06-01","2012-07-01","2012-08-01","2012-09-01","2012-10-01","2012-11-01","2012-12-01","2013-01-01","2013-02-01","2013-03-01","2013-04-01","2013-05-01","2013-06-01","2013-07-01","2013-08-01","2013-09-01","2013-10-01","2013-11-01","2013-12-01","2014-01-01","2014-02-01","2014-03-01","2014-04-01","2014-05-01","2014-06-01","2014-07-01","2014-08-01","2014-09-01","2014-10-01","2014-11-01","2014-12-01","2015-01-01","2015-02-01","2015-03-01","2015-04-01","2015-05-01","2015-06-01","2015-07-01","2015-08-01","2015-09-01","2015-10-01","2015-11-01","2015-12-01","2016-01-01","2016-02-01","2016-03-01","2016-04-01","2016-05-01","2016-06-01","2016-07-01","2016-08-01","2016-09-01","2016-10-01","2016-11-01","2016-12-01","2017-01-01","2017-02-01","2017-03-01","2017-04-01","2017-05-01","2017-06-01","2017-07-01","2017-08-01","2017-09-01","2017-10-01","2017-11-01","2017-12-01","2018-01-01","2018-02-01","2018-03-01","2018-04-01","2018-05-01","2018-06-01","2018-07-01","2018-08-01","2018-09-01","2018-10-01","2018-11-01","2018-12-01"]
[null,"Motores diesel",14250,12593,13459,13734.55,15030,15717.05,17790.86,17035.759999999998,16233.4,16172.12,14199,15653,15536,14623,14355,14494,14972,16029,18094,19226,16880,15757,15458,17701,17753,15189,15459,14176,15222,16183,18807,19379,16442,17363,15428,16152,16952.252,15255.491,16387.781999999999,15007.841,15685.419,16778.191999999999,18965.345000000001,20588.25,17840.763999999999,16821.623,16795.423999999999,17639.588,17128.133000000002,15661.591,16334.688,14888.484,16224.07,17374.929,18731.536,20183.006000000001,18021.242999999999,17472.248,16859.652999999998,18358.944,18987.483,18434.03,17595.569,15996.928,17064.137999999999,18269.987000000001,20044.004000000001,20974.534,17689.522000000001,17455.381000000001,15632.825999999999,16655.803,17110.853999999999,15528.74,15837.664000000001,15145.012000000001,16033.365,15755.906999999999,18164.968000000001,19689.804,17661.661,16824.399000000001,16654.679,17049.946,17113.973999999998,15188.762000000001,16070.376,14924.15,15881.796,16458.871999999999,18016.240000000002,19097.677,17935.041000000001,16794.754000000001,16098.888999999999,16469.927,17307.293000000001,16101.558000000001,15793.115,14968.85,15859.992,16456.643,20927.738000000001,20497.644,17047.534,16560.111000000001,16034.717000000001,16361.906999999999,16079.162,15287.703,15608.210999999999,14657.767,15686.673000000001,16462.297999999999,17919.129000000001,19733.527999999998,17852.324000000001,16584.625,16229.584999999999,16149.311,17659.624,14741.348,15595.695,14233.489,15543.528,17132.913,18825.349999999999,20097.34,16927.968000000001,16473.509999999998,16219.249,16866.95,17095.319,16046.134,15645.465,14934.573,15540.776,16168.516,18176.227999999999,20469.173999999999,18564.09,"-","-","-"]
[null,"Turbina de gas",389,201,257,105.44999999999999,69,0.95,123.13999999999999,231.23999999999998,37.599999999999994,48.879999999999995,484,465,838,433,488,171,45,136,205,76,213,250,217,9,10,11,77,53,2,63,0,61,78,7,126,57,16.721,21.806999999999999,3.2509999999999999,24.138000000000002,34.966000000000001,92.513000000000005,106.417,34.25,37.728999999999999,33.689,53.722999999999999,39.252000000000002,34.33,2.3359999999999999,6.4390000000000001,45.47,24.800999999999998,36.576999999999998,143.11199999999999,36.96,10.613,133.43100000000001,49.118000000000002,10.721,4.7290000000000001,0,0,1.6259999999999999,4.8760000000000003,9.0470000000000006,22.542999999999999,0,73.923000000000002,3.524,1.8440000000000001,18.108000000000001,4.1929999999999996,0.92400000000000004,0,0,1.278,0.35299999999999998,0.38,0,0,70.896000000000001,0,15.657,3.26,47.219000000000001,10.242000000000001,0,0,67.668999999999997,30.943000000000001,0,55.459000000000003,98.269000000000005,212.035,241.214,314.11799999999999,0,55.765000000000001,0,0,2.0659999999999998,129.964,0.94099999999999995,0,0,106.17100000000001,2.4729999999999999,0,0.27400000000000002,0.56999999999999995,114.45099999999999,12.93,30.518999999999998,61.01,15.454000000000001,17.268000000000001,0,0,2.9929999999999999,0,4.0960000000000001,0.45300000000000001,0,0,0.127,0,0,0,0,10.003,62.594000000000001,44.298000000000002,8.6690000000000005,0.496,0.57899999999999996,0.55100000000000005,1.2370000000000001,9.2759999999999998,0.94,0.34499999999999997,"-","-","-"]
[null,"Fuel + gas",14639,12794,13716,13840,15099,15718,17914,17267,16271,16221,14683,16118,16374,15056,14843,14665,15017,16165,18299,19302,17093,16007,15675,17710,17763,15200,15536,14229,15224,16246,18807,19440,16520,17370,15554,16209,16968.973000000002,15277.298000000001,16391.032999999999,15031.979000000001,15720.385,16870.704999999998,19071.762000000002,20622.5,17878.492999999999,16855.311999999998,16849.147000000001,17678.84,17162.463000000003,15663.927,16341.127,14933.954,16248.870999999999,17411.506000000001,18874.648000000001,20219.966,18031.856,17605.679,16908.770999999997,18369.665000000001,18992.212,18434.03,17595.569,15998.554,17069.013999999999,18279.034,20066.547000000002,20974.534,17763.445,17458.905000000002,15634.669999999998,16673.911,17115.046999999999,15529.664000000001,15837.664000000001,15145.012000000001,16034.643,15756.259999999998,18165.348000000002,19689.804,17661.661,16895.295000000002,16654.679,17065.602999999999,17117.233999999997,15235.981,16080.618,14924.15,15881.796,16526.541000000001,18047.183000000001,19097.677,17990.5,16893.023000000001,16310.923999999999,16711.141,17621.411,16101.558000000001,15848.88,14968.85,15859.992,16458.708999999999,21057.702000000001,20498.584999999999,17047.534,16560.111000000001,16140.888000000001,16364.38,16079.162,15287.976999999999,15608.780999999999,14772.217999999999,15699.603000000001,16492.816999999999,17980.138999999999,19748.982,17869.592000000001,16584.625,16229.584999999999,16152.304,17659.624,14745.444,15596.147999999999,14233.489,15543.528,17133.04,18825.349999999999,20097.34,16927.968000000001,16473.509999999998,16229.252,16929.544000000002,17139.616999999998,16054.803,15645.960999999999,14935.152,15541.326999999999,16169.752999999999,18185.504000000001,20470.113999999998,18564.435000000001,"-","-","-"]
[null,"Régimen ordinario",14639,12794,13716,13840,15099,15718,17914,17267,16271,16221,14683,16118,16374,15056,14843,14665,15017,16165,18299,19302,17093,16007,15675,17710,17763,15200,15536,14229,15224,16246,18807,19440,16520,17370,15554,16209,16968.973000000002,15277.298000000001,16391.032999999999,15031.979000000001,15720.385,16870.704999999998,19071.762000000002,20622.5,17878.492999999999,16855.311999999998,16849.147000000001,17678.84,17162.463000000003,15663.927,16341.127,14933.954,16248.870999999999,17411.506000000001,18874.648000000001,20219.966,18031.856,17605.679,16908.770999999997,18369.665000000001,18992.212,18434.03,17595.569,15998.554,17069.013999999999,18279.034,20066.547000000002,20974.534,17763.445,17458.905000000002,15634.669999999998,16673.911,17115.046999999999,15529.664000000001,15837.664000000001,15145.012000000001,16034.643,15756.259999999998,18165.348000000002,19689.804,17661.661,16895.295000000002,16654.679,17065.602999999999,"-","-","-","-","-","-","-","-","-","-","-","-","-","-","-","-","-","-","-","-","-","-","-","-","-","-","-","-","-","-","-","-","-","-","-","-","-","-","-","-","-","-","-","-","-","-","-","-","-","-","-","-","-","-","-","-","-","-","-","-"]
[null,"Solar fotovoltaica",0,0,0,0,0,0,0,0,0,0,0,0,1,0,0,0,0,1,1,1,1,0,1,0,8,17,22,28,9,8,8,8,7,6,0,1,1,5,6,7,9,1,8,9,7,6,5,3,3.7080000000000002,6.5010000000000003,6.5209999999999999,6.7629999999999999,7.6589999999999998,8.4280000000000008,7.0629999999999997,6.1079999999999997,5.3869999999999996,5.03,3.806,4.4980000000000002,4.9189999999999996,6.7539999999999996,6.9930000000000003,8.9309999999999992,9.0139999999999993,8.6419999999999995,8.6509999999999998,8.1,6.907,6.2290000000000001,3.76,4.2140000000000004,4.8810000000000002,5.4950000000000001,7.3550000000000004,7.49,9.4239999999999995,8.9489999999999998,8.2899999999999991,8.0269999999999992,6.9539999999999997,6.5679999999999996,4.8390000000000004,4.0510000000000002,4.4790000000000001,5.7389999999999999,7.88,8.6440000000000001,8.9640000000000004,8.9740000000000002,9.23,8.6080000000000005,6.5170000000000003,6.5270000000000001,4.1760000000000002,4.0949999999999998,4.798,5.024,8.0259999999999998,6.2329999999999997,8.4870000000000001,8.4380000000000006,8.8759999999999994,7.3479999999999999,7.3479999999999999,6.4989999999999997,4.9790000000000001,3.9039999999999999,4.3029999999999999,5.5259999999999998,8.4860000000000007,8.5269999999999992,8.57,8.3640000000000008,7.0369999999999999,8.0109999999999992,6.96,6.11,4.6180000000000003,3.5880000000000001,4.6280000000000001,4.468,7.1989999999999998,7.1680000000000001,7.6929999999999996,7.782,8.3089999999999993,6.5679999999999996,7.6040000000000001,6.5469999999999997,4.8440000000000003,4.0590000000000002,4.2050000000000001,5.8739999999999997,7.59,6.899,7.6449999999999996,6.2880000000000003,6.2039999999999997,8.6289999999999996,0,"-","-","-"]
[null,"Térmica no renovable/Cogeneración y resto/Cogeneración",747,694,836,656,886,845,733,805,275,611,799,853,937,797,849,810,755,694,0,0,0,0,0,0,819,726,782,888,819,747,783,727,707,1,0,736,699,606,781,808,921,710,772,797,897,486,0,551,"-","-","-","-","-","-","-","-","-","-","-","-","-","-","-","-","-","-","-","-","-","-","-","-","-","-","-","-","-","-","-","-","-","-","-","-","-","-","-","-","-","-","-","-","-","-","-","-","-","-","-","-","-","-","-","-","-","-","-","-","-","-","-","-","-","-","-","-","-","-","-","-","-","-","-","-","-","-","-","-","-","-","-","-","-","-","-","-","-","-","-","-","-","-","-","-"]
[null,"Residuos no renovables","-","-","-","-","-","-","-","-","-","-","-","-","-","-","-","-","-","-","-","-","-","-","-","-","-","-","-","-","-","-","-","-","-","-","-","-","-","-","-","-","-","-","-","-","-","-","-","-",464.29950000000002,397.92500000000001,430.59649999999999,373.33850000000001,337.11450000000002,334.88900000000001,382.39049999999997,338.01799999999997,346.51799999999997,104.58750000000001,7.9335000000000004,0,0,0,0,31.268999999999998,0,0,0,85.337000000000003,276.02949999999998,23.626000000000001,336.02100000000002,402.19650000000001,390.32600000000002,324.10849999999999,302.58999999999997,362.80200000000002,313.69450000000001,396.8485,339.39400000000001,323.44099999999997,305.60649999999998,446.33699999999999,82.356499999999997,431.39400000000001,438.94150000000002,426.67,449.98899999999998,391.80799999999999,342.024,327.59500000000003,387.54950000000002,349.8775,360.20299999999997,394.673,89.531999999999996,490.29450000000003,406.56650000000002,384.25200000000001,399.54250000000002,384.58249999999998,399.29050000000001,362.66800000000001,306.02749999999997,330.73250000000002,349.46249999999998,424.02449999999999,110.65049999999999,438.69850000000002,486.9855,413.23649999999998,388.06950000000001,449.90350000000001,371.4135,406.48399999999998,395.08800000000002,402.67500000000001,414.32600000000002,504.35050000000001,110.9915,506.529,452.02,426.08800000000002,438.00850000000003,420.81099999999998,450.26749999999998,434.68150000000003,425.63299999999998,341.00599999999997,448.86450000000002,497.26049999999998,87.290499999999994,555.05499999999995,521.07550000000003,484.48050000000001,524.22050000000002,456.29450000000003,476.22399999999999,420.48149999999998,461.947,470.89150000000001,430.50400000000002,"-","-","-"]
[null,"Residuos renovables","-","-","-","-","-","-","-","-","-","-","-","-","-","-","-","-","-","-","-","-","-","-","-","-","-","-","-","-","-","-","-","-","-","-","-","-","-","-","-","-","-","-","-","-","-","-","-","-",464.29950000000002,397.92500000000001,430.59649999999999,373.33850000000001,337.11450000000002,334.88900000000001,382.39049999999997,338.01799999999997,346.51799999999997,104.58750000000001,7.9335000000000004,0,0,0,0,31.268999999999998,0,0,0,85.337000000000003,276.02949999999998,23.626000000000001,336.02100000000002,402.19650000000001,390.32600000000002,324.10849999999999,302.58999999999997,362.80200000000002,313.69450000000001,396.8485,339.39400000000001,323.44099999999997,305.60649999999998,446.33699999999999,82.356499999999997,431.39400000000001,438.94150000000002,426.67,449.98899999999998,391.80799999999999,342.024,327.59500000000003,387.54950000000002,349.8775,360.20299999999997,394.673,89.531999999999996,490.29450000000003,406.56650000000002,384.25200000000001,399.54250000000002,384.58249999999998,399.29050000000001,362.66800000000001,306.02749999999997,330.73250000000002,349.46249999999998,424.02449999999999,110.65049999999999,438.69850000000002,486.9855,413.23649999999998,388.06950000000001,449.90350000000001,371.4135,406.48399999999998,395.08800000000002,402.67500000000001,414.32600000000002,504.35050000000001,110.9915,506.529,452.02,426.08800000000002,438.00850000000003,420.81099999999998,450.26749999999998,434.68150000000003,425.63299999999998,341.00599999999997,448.86450000000002,497.26049999999998,87.290499999999994,555.05499999999995,521.07550000000003,484.48050000000001,524.22050000000002,456.29450000000003,476.22399999999999,420.48149999999998,461.947,470.89150000000001,430.50400000000002,"-","-","-"]
[null,"Régimen especial",747,694,836,656,886,845,733,805,275,611,799,853,938,797,849,810,755,695,1,1,1,0,1,0,827,743,804,916,828,755,791,735,714,7,0,737,700,611,787,815,930,711,780,806,904,492,5,554,932.30700000000002,802.351,867.71399999999994,753.44,681.88800000000003,678.20600000000002,771.84399999999994,682.14400000000001,698.423,214.20500000000001,19.673000000000002,4.4980000000000002,4.9189999999999996,6.7539999999999996,6.9930000000000003,71.468999999999994,9.0139999999999993,8.6419999999999995,8.6509999999999998,178.774,558.96599999999989,53.481000000000002,675.80200000000002,808.60699999999997,785.53300000000002,653.71199999999999,612.53499999999997,733.09400000000005,636.81299999999999,802.64599999999996,687.07799999999997,654.90899999999988,618.16699999999992,899.24199999999996,169.55199999999999,866.83899999999994,"-","-","-","-","-","-","-","-","-","-","-","-","-","-","-","-","-","-","-","-","-","-","-","-","-","-","-","-","-","-","-","-","-","-","-","-","-","-","-","-","-","-","-","-","-","-","-","-","-","-","-","-","-","-","-","-","-","-","-","-"]
[null,"Generación",15386,13488,14552,14496,15985,16563,18647,18072,16546,16832,15482,16971,17312,15853,15692,15475,15772,16860,18300,19303,17094,16007,15676,17710,18590,15943,16340,15145,16052,17001,19598,20175,17234,17377,15554,16946,17668.973000000002,15888.298000000001,17178.032999999999,15846.978999999999,16650.384999999998,17581.705000000002,19851.761999999999,21428.5,18782.492999999999,17347.312000000002,16854.147000000001,18232.84,18094.77,16466.277999999998,17208.841,15687.394,16930.758999999998,18089.712,19646.491999999998,20902.11,18730.278999999999,17819.883999999998,16928.444,18374.163,18997.131000000001,18440.784,17602.562000000002,16070.022999999999,17078.027999999998,18287.675999999999,20075.198,21153.308000000001,18322.411,17512.385999999999,16310.472,17482.518,17900.580000000002,16183.376,16450.199000000001,15878.106,16671.455999999998,16558.905999999999,18852.425999999999,20344.713,18279.828000000001,17794.537,16824.231,17932.441999999999,17999.596000000001,16095.06,16988.475999999999,15716.41,16574.808000000001,17190.705000000002,18831.511999999999,19806.04,18717.422999999999,17688.896000000001,16494.164000000001,17695.825000000001,18439.342000000001,16875.085999999999,16655.991000000002,15744.248,16667.060000000001,17192.483,21678.633000000002,21167.398000000001,17753.807000000001,17414.659,16367.168,17245.681,17057.436000000002,16119.976000000001,16393.405999999999,15680.552,16451,17314.149000000001,18777.351999999999,20562.343000000001,18705.204000000002,17599.436000000002,16456.186000000002,17168.95,18568.292000000001,15602.088,16479.364000000001,15082.279,16451.756000000001,18010.185000000001,19684.924999999999,20785.919999999998,17833.300999999999,17474.578000000001,16408.677,18043.713,18185.973000000002,17029.637999999999,16701.991999999998,15854.64,16501.419999999998,17017.004000000001,19115.601999999999,21420.526000000002,19425.442999999999,"-","-","-"]
[null,"Demanda transporte (b.c.)",15386,13488,14552,14496,15985,16563,18647,18072,16546,16832,15482,16971,17312,15853,15692,15475,15772,16860,18300,19303,17094,16007,15676,17710,18590,15943,16340,15145,16052,17001,19598,20175,17234,17377,15554,16946,17668.973000000002,15888.298000000001,17178.032999999999,15846.978999999999,16650.384999999998,17581.705000000002,19851.761999999999,21428.5,18782.492999999999,17347.312000000002,16854.147000000001,18232.84,18094.77,16466.277999999998,17208.841,15687.394,16930.758999999998,18089.712,19646.491999999998,20902.11,18730.278999999999,17819.883999999998,16928.444,18374.163,18997.131000000001,18440.784,17602.562000000002,16070.022999999999,17078.027999999998,18287.675999999999,20075.198,21153.308000000001,18322.411,17512.385999999999,16310.472,17482.518,17900.580000000002,16183.376,16450.199000000001,15878.106,16671.455999999998,16558.905999999999,18852.425999999999,20344.713,18279.828000000001,17794.537,16824.231,17932.441999999999,17999.596000000001,16095.06,16988.475999999999,15716.41,16574.808000000001,17190.705000000002,18831.511999999999,19806.04,18717.422999999999,17688.896000000001,16494.164000000001,17695.825000000001,18439.342000000001,16875.085999999999,16655.991000000002,15744.248,16667.060000000001,17192.483,21678.633000000002,21167.398000000001,17753.807000000001,17414.659,16367.168,17245.681,17057.436000000002,16119.976000000001,16393.405999999999,15680.552,16451,17314.149000000001,18777.351999999999,20562.343000000001,18705.204000000002,17599.436000000002,16456.186000000002,17168.95,18568.292000000001,15602.088,16479.364000000001,15082.279,16451.756000000001,18010.185000000001,19684.924999999999,20785.919999999998,17833.300999999999,17474.578000000001,16408.677,18043.713,18185.973000000002,17029.637999999999,16701.991999999998,15854.64,16501.419999999998,17017.004000000001,19115.601999999999,21420.526000000002,19425.442999999999,"-","-","-"]
[]
[null,"Balance eléctrico mensual nacional (GWh)","2007-01-01","2007-02-01","2007-03-01","2007-04-01","2007-05-01","2007-06-01","2007-07-01","2007-08-01","2007-09-01","2007-10-01","2007-11-01","2007-12-01","2008-01-01","2008-02-01","2008-03-01","2008-04-01","2008-05-01","2008-06-01","2008-07-01","2008-08-01","2008-09-01","2008-10-01","2008-11-01","2008-12-01","2009-01-01","2009-02-01","2009-03-01","2009-04-01","2009-05-01","2009-06-01","2009-07-01","2009-08-01","2009-09-01","2009-10-01","2009-11-01","2009-12-01","2010-01-01","2010-02-01","2010-03-01","2010-04-01","2010-05-01","2010-06-01","2010-07-01","2010-08-01","2010-09-01","2010-10-01","2010-11-01","2010-12-01","2011-01-01","2011-02-01","2011-03-01","2011-04-01","2011-05-01","2011-06-01","2011-07-01","2011-08-01","2011-09-01","2011-10-01","2011-11-01","2011-12-01","2012-01-01","2012-02-01","2012-03-01","2012-04-01","2012-05-01","2012-06-01","2012-07-01","2012-08-01","2012-09-01","2012-10-01","2012-11-01","2012-12-01","2013-01-01","2013-02-01","2013-03-01","2013-04-01","2013-05-01","2013-06-01","2013-07-01","2013-08-01","2013-09-01","2013-10-01","2013-11-01","2013-12-01","2014-01-01","2014-02-01","2014-03-01","2014-04-01","2014-05-01","2014-06-01","2014-07-01","2014-08-01","2014-09-01","2014-10-01","2014-11-01","2014-12-01","2015-01-01","2015-02-01","2015-03-01","2015-04-01","2015-05-01","2015-06-01","2015-07-01","2015-08-01","2015-09-01","2015-10-01","2015-11-01","2015-12-01","2016-01-01","2016-02-01","2016-03-01","2016-04-01","2016-05-01","2016-06-01","2016-07-01","2016-08-01","2016-09-01","2016-10-01","2016-11-01","2016-12-01","2017-01-01","2017-02-01","2017-03-01","2017-04-01","2017-05-01","2017-06-01","2017-07-01","2017-08-01","2017-09-01","2017-10-01","2017-11-01","2017-12-01","2018-01-01","2018-02-01","2018-03-01","2018-04-01","2018-05-01","2018-06-01","2018-07-01","2018-08-01","2018-09-01","2018-10-01","2018-11-01","2018-12-01"]
[null,"Hidráulica",1920.0478000000003,2539.7347,3412.3603999999996,2337.7021,2328.2846,1896.4941999999999,2152.4522999999999,1514.2806,1189.9214999999999,1525.5493000000001,1152.0925,1010.0581,1052.9718,724.43350000000009,774.5612000000001,2158.8984000000028,2756.8809000000001,2593.9364999999998,1801.4576,1275.0206000000001,1101.1437999999998,904.63950000000011,1192.6748000000002,1959.02,1753.4290999999998,2852.5814999999998,2234.3775999999998,1704.1587,2008.6723999999999,1659.6541999999999,1393.0593999999999,1167.1748,750.34090000000003,1028.1299000000001,1560.9612999999999,2619.7628999999997,4414.2761132999995,3450.7255615999998,5031.7780444,4029.8561307,3174.5390475999998,2946.0881532000003,2437.1694070000003,1695.0818135,1249.4073436999997,1282.6130285000002,2043.8580677,3254.0614768999999,4439.2433873059999,2483.3252281980003,3232.0580901000003,2936.978155364,2301.7606975580002,1658.9348333960002,1271.630927936,1211.759501882,986.12281421199998,1054.6850562880002,1734.1636906200001,1730.6003513500002,1288.4276781599999,890.0091980200001,1012.57425358,1270.9316051160001,1884.7628111940001,1662.357787376,1321.6113847040001,1067.3070693119998,832.03786730200011,1114.7855000060001,1571.084112534,2029.8077719940002,2334.0912862600003,2847.9280688160002,3722.6117681000001,4522.6961297779999,3013.9758478500003,2527.8570398319998,2174.2613418139999,1734.5422084660001,1514.128227872,1515.1347255179999,2268.9746366239997,1922.1772220099999,4261.3928368300003,5763.2511718599999,5293.0180130580002,4986.8568758279998,2826.7652192420001,2485.7217165719999,2354.8170606840004,2044.885494228,1797.144654958,1632.0181070799999,2452.0654751900001,3284.0485896739997,2554.8304573639998,3559.0062025259999,3845.5835797779996,2662.8117844859999,2967.1734170719997,2497.589003308,2060.3979246879999,1643.7196840919999,1609.5213018899999,1650.1668175440002,1892.6831559960001,1439.0966351060001,3441.8281289500001,4052.8817055740005,4366.5474229660003,5244.8824449240001,5101.2056035119995,2956.172205884,2273.2004102259998,2047.078354944,1653.6463674399999,1631.8305045920001,1499.0532762180001,1846.561901542,2040.641197334,1956.588328862,2701.2310507360003,1897.982028468,1935.428378156,1637.871486776,1193.0592499520001,1082.726891734,1147.8484430619999,773.64991037799996,831.89108253200004,1250.2484476699999,2194.2032307859995,2388.6464533500002,4399.3186045560005,4716.7044032459999,3521.1033803240002,3711.1757685839998,3024.6335059859998,2104.2168184919997,1923.9189707620001,"-","-","-"]
[null,"Turbinación bombeo",260.2432,277.11529999999999,268.91759999999999,205.37789999999998,278.33539999999999,249.37780000000001,233.46469999999999,259.9674,242.14749999999998,221.90069999999997,268.90849999999995,336.8449,301.58519999999999,293.51349999999996,281.25579999999997,153.34059999999999,144.25110000000001,199.67849999999999,177.6474,133.56139999999999,158.58920000000001,208.00149999999996,287.87919999999997,322.44799999999998,344.55889999999994,274.42450000000002,197.03039999999999,179.03129999999999,173.24859999999998,157.21579999999997,168.71259999999998,171.5042,178.14509999999999,198.88609999999997,278.25069999999994,334.92410000000001,529.60983670000007,388.30555539999995,381.26509259999995,212.21241929999999,195.96443439999999,161.10858679999998,139.41769099999999,161.80076849999998,163.58696829999997,242.28118949999995,225.55656829999995,319.33869309999994,283.94490769399999,172.14437780200001,234.3481209,201.526885636,111.13141044199999,97.401727604000001,102.43908606400001,120.019735118,138.437161788,216.20731071200001,224.26137738,281.67412965,318.69145184000001,266.29888497999997,265.75549541999999,307.58115988400004,223.421483806,199.61285362400002,195.82272629600001,256.54768168800001,270.24170669800003,283.98781499400002,276.84362946600004,337.08485500600005,372.34012374000002,342.600296184,457.14945289999997,370.51571222199999,251.14840015000001,216.49426816800002,175.260815186,163.016439534,139.951745128,216.268290482,246.284607376,338.64703298999996,443.67862617000003,369.22198314000002,354.77524994200002,361.18861317199998,275.95647575800001,207.70265442800002,170.77235531599999,151.65694177199998,160.19068604199998,267.50232792000003,326.90832081000002,326.44179232599998,319.02103063599998,291.33964547400001,327.144737222,255.86272351400001,242.84147692799999,125.366838692,110.974045312,202.46425890799998,162.10553811,249.57726645600002,276.57492800400001,332.09329889399999,454.98487605000003,434.36759242599999,351.10246903400002,429.29966807599999,316.01911348800002,169.55252211600001,96.849533773999994,110.35765205600001,101.23997756,161.43736240799998,258.23356678200003,250.884576458,291.21301766599998,267.73958013800001,241.22357426400001,199.433449532,162.454982844,91.897749223999995,98.826694048000007,112.205176266,118.471554938,133.820917622,222.09125546799999,309.58646633000001,273.43523521399999,180.62302364999999,369.77771444399997,345.63732475400002,153.27436067600001,58.722846416000003,35.306144013999997,60.031041508000001,40.026753237999998,"-","-","-"]
[null,"Nuclear",5319.1580000000004,4778.3050000000003,4947.4629999999997,4342.93,3485.058,3161.45,3855.7460000000001,3976.62,4877.2839999999997,4891.0659999999998,3934.346,5069.5010000000002,5322.9409999999998,5119.9319999999998,5354.7060000000001,4039.7550000000001,4689.7039999999997,4579.7330000000002,4541.0349999999999,5013.9489999999996,4482.3890000000001,4314.4620000000004,4045.8270000000002,4955.8580000000002,5438.39,4335.1400000000003,3949.223,4063.489,3687.607,3530.33,3998.25,5278.1620000000003,4387.8469999999998,3957.8240000000001,3973.4949999999999,3949.6880000000001,4480.6099999999997,4635.9830000000002,4877.9646469999998,4894.268,4417.8689999999997,4693.97,5399.9840000000004,5421.2550000000001,5066.8190000000004,5429.7690000000002,5094.6189999999997,4829.2110000000002,4706.5008779999998,4266.689754,4324.2312089999996,4450.0773079999999,3611.7794169999997,4695.2574460000005,4817.4696819999999,5271.6905420000003,4981.7416309999999,4490.6379879999995,4538.8814699999994,4850.9175420000001,5164.1896420000003,5145.3286880000005,5475.7198159999998,5196.3066060000001,4472.2010689999997,3482.8677540000003,5091.8557690000007,5458.005744,5300.1472389999999,5396.0980310000004,4059.590095,4353.1283459999995,4573.2782189999998,4420.6695949999994,5208.3912289999998,4453.4636330000003,3978.8062969999996,4322.5249009999998,5134.2322460000005,5022.1737570000005,4737.0821660000001,4333.3467949999995,4057.4559819999999,3969.3632990000001,4526.0627789999999,4721.9374950000001,5286.7922759999992,5056.3066469999994,4336.6333090000007,3416.6655299999998,4253.4134400000003,4205.3950650000006,4801.3623909999997,5126.607422,4363.8270980000007,4686.2778830000007,5240.0450559999999,4716.807315,5203.7174930000001,4681.6209850000005,3534.4988330000001,3750.101549,4794.5369390000005,4962.6728059999996,4871.5337340000005,4085.5825599999998,3964.2195019999999,4856.4665329999998,4607.5606760000001,3961.1322270000001,5190.0414309999996,5052.2104800000006,3877.8372300000001,4814.1318569999994,5176.6521160000002,5150.5210360000001,5008.646428,5093.0410350000002,3762.5391300000001,4327.3684130000001,5283.5543349999998,4766.6571869999998,5269.1337249999997,4926.0698920000004,4130.8703100000002,4034.3327380000001,4385.200742,5078.9521169999998,4722.5735259999992,4301.3254560000005,3601.78287,5039.108604,5096.5286330000008,4592.3205680000001,4488.9170219999996,3812.588835,3728.673667,3591.5913509999996,4471.0236880000002,5135.7246780000005,5013.0349210000004,"-","-","-"]
[null,"Carbón",6355.9290000000001,5122.8689999999997,5084.009,6098.4139999999998,6219.9310000000005,5996.3879999999999,6220.3989999999994,6178.9250000000002,5753.5960000000005,5577.9750000000004,5687.9780000000001,6333.69,5268.5780000000004,4867.5980000000009,3927.5260000000003,3323.2709999999997,2421.4650000000001,2321.1170000000002,3976.9629999999997,3367.8240000000001,3731.902,4344.1439999999993,4316.3040000000001,4641.6710000000003,4771.5609999999997,3283.0160000000001,3194.9989999999998,2027.452,2501.1990000000001,2745.4129999999996,3511.5260000000003,2102.6730000000002,2949.413,3336.002,2251.8330000000001,2117.9380000000001,1984.722964,1620.4064370000001,1128.3404140000002,904.4831099999999,1053.230108,1601.6091620000002,2742.5060000000003,3122.487928,3256.4198250000004,2204.4321009999999,1819.434667,2262.5406840000001,2303.0877069999997,2679.9563779999999,3107.2874539999998,2625.721728,3188.9519979999995,2975.877172,4473.190388,4349.2262680000003,4932.2433800000008,4477.5195979999999,4043.5703799999997,4020.8319259999994,5418.237177,5501.7163360000004,4671.6673369999999,2717.8508099999999,4010.1033039999998,5304.0933990000003,4945.004938,5089.1478900000002,4042.8652259999999,4241.2390820000001,4073.6743550000001,3764.2913189999999,3057.9069469999999,2586.5424990000001,1422.6456149999999,1062.0981859999999,2079.4152479999998,2660.2976599999997,5471.5184570000001,4621.3240929999993,4767.9240690000006,4197.4747500000003,2673.9197909999998,4840.4704010000005,2293.1595219999999,884.09142700000007,1294.242753,1385.564216,3367.749593,5213.2036829999997,5611.6495459999996,5290.263661,5911.3420179999994,4545.6176559999994,3230.1496280000001,4219.0227939999995,5067.4159600000003,3092.8614560000001,2738.9255380000004,3005.3293690000005,2933.5866510000001,5509.5659000000005,6275.4180310000002,5442.5099189999992,4786.664984,4384.0712729999996,4665.8646040000003,4714.2639130000007,2695.0552899999998,1879.9571719999999,1767.8236699999998,1033.2678189999999,1207.787572,2255.5169299999998,3927.7343889999997,3645.5037859999998,4552.4163760000001,4497.462582000001,4628.9604570000001,5222.2917079999997,5379.3066580000004,3502.94506,1943.034917,2064.4708179999998,3749.0642439999997,4544.5264120000002,4304.3837649999996,3226.2661320000002,3058.5678760000001,4097.6496459999998,4818.1399039999997,4332.260346,3218.6254900000004,3681.4806510000003,1510.503706,1543.646516,2439.662014,2478.5306300000002,3730.2416590000003,3753.9574069999999,4375.7800440000001,"-","-","-"]
[null,"Fuel + Gas",768.6,809.29600000000005,838.596,760.79700000000003,775.88300000000004,747.34100000000001,950.17899999999997,946.66399999999999,919.39,799.77,841.274,830.67499999999995,829.66100000000006,776.97799999999995,690.65699999999993,738.39300000000003,796.62799999999993,853.54200000000003,852.61299999999994,943.85699999999997,880.45299999999997,850.27800000000002,839.86,834.64599999999996,768.62099999999998,673.43399999999997,795.63,680.08900000000006,729.07300000000009,778.62199999999996,889.54100000000005,870.26300000000003,821.12954200000001,758.47799999999995,740.34751200000005,771.07600000000002,769.16592200000014,680.88749999999982,622.58834999999999,645.15955300000007,743.36511300000006,767.24708999999996,791.55072799999994,801.00316300000009,775.18720799999994,725.47373100000004,741.36895700000014,758.76250100000016,593.44559499999991,547.21170200000006,627.11976400000003,548.65231700000015,556.12833099999989,541.25181499999997,645.90560000000005,644.4441300000002,616.43508800000006,596.46496300000001,528.18905600000005,562.67451399999993,594.96951999999999,559.02143100000001,581.07362499999999,539.16180899999995,551.40276299999994,588.6598009999999,638.92728699999998,688.72764799999993,610.87292300000001,604.49096700000007,565.54323299999999,571.70450299999993,532.84197400000005,506.03706099999999,543.85390899999993,507.35153600000001,518.31185400000004,500.54395200000005,601.71263099999999,624.44084200000009,561.53761799999995,571.95973200000003,533.4157899999999,558.45374100000004,546.78423799999996,487.35459100000003,468.30237700000004,457.5664920000001,475.11797800000005,525.23210700000004,571.13691099999994,589.27785500000005,568.9844149999999,523.52716200000009,483.74680899999998,544.79095299999994,542.16877599999998,490.99479300000002,512.12827400000003,473.23045699999994,510.81902400000001,539.92476599999998,630.00029100000006,638.15355899999997,608.70864199999994,511.77260999999999,470.01523699999996,555.89699900000005,558.00742300000002,514.27520200000004,550.06852000000003,506.50864200000001,510.57271100000003,553.74137800000005,626.56458899999996,671.61991899999998,608.13840299999981,575.282421,498.47913,581.38569200000006,563.29929400000003,499.00747900000005,539.28455600000007,556.89229299999988,572.47235400000022,618.07564600000012,662.33727699999986,683.28502800000001,603.954745,593.8527949999999,540.28107000000011,568.72574200000008,572.7209959999999,532.68544399999985,520.89136200000007,508.69381700000002,535.313086,556.93770700000005,616.82100700000001,657.91701899999987,590.32344500000022,"-","-","-"]
[null,"Ciclo combinado",6359.7610000000004,4080.7000000000003,4156.2129999999997,4273.4560000000001,4686.4580000000005,6528.933,6999.7269999999999,5503.9960000000001,5974.326,6466.7110000000002,7970.268,7599.5889999999999,8292.021999999999,8254.7870000000003,7091.7349999999997,7235.1049999999996,7505.3360000000002,7943.0940000000001,9260.9190000000017,8622.5419999999995,8167.759,7543.9189999999999,7156.8680000000004,6123.4529999999995,6394.8369999999995,4731.2190000000001,5388.1019999999999,5722.3029999999999,5822.0680000000002,7920.2789999999995,8907.5990000000002,8556.3119999999999,7707.5259999999998,6844.3010000000004,5793.1239999999998,6436.125,5621.9420650000002,5052.5037549999997,4384.9885919999997,4612.7417769999993,4834.0750719999996,5727.7229470000002,7160.3432119999998,6106.9485729999997,6544.5626990000001,5651.8631519999999,5881.4311129999996,5219.8611950000004,5349.8701159999991,4903.0333659999997,4312.0858470000003,3061.4112070000001,4463.5467840000001,5192.3468070000008,4830.9816199999996,5068.7511969999996,4822.8759060000002,4078.0561740000003,3713.4794670000001,3634.5102510000002,4523.0130589999999,4214.8335109999998,3335.3147530000001,2468.5695420000002,2682.2693439999998,3401.5500300000003,3675.0467329999997,3805.0186589999998,3176.2359969999998,3531.7116780000001,3201.0365259999999,3058.4940489999999,2901.179729,2210.5406600000001,1754.1238390000001,1368.0950889999999,1901.209492,1614.3132579999999,2499.6622529999995,2648.3447949999995,2489.8988980000004,2819.739114,2265.460642,3007.4706350000001,1809.9885730000001,1522.5938679999999,1595.2280470000001,1504.174671,1711.5539220000001,2019.8074939999999,2125.2203329999998,2491.2719240000001,2974.35196,2461.3846730000005,2288.0224040000003,2277.1355719999997,2490.3797560000003,1947.035374,1899.2006960000001,2023.2094750000001,1941.50747,2151.7701520000001,3722.8123139999998,2603.2033259999998,2252.0243850000002,2553.1365019999998,2467.5491759999995,2975.460709,2197.9175110000001,1620.5893129999999,1664.0344529999998,1451.939214,1769.2809179999999,2120.171155,2614.3797259999997,2271.7509069999996,2391.8244189999996,3591.2069670000001,3752.0738420000002,3561.3136690000001,3229.7139109999998,1774.7942540000001,1708.9671450000001,1483.9400599999999,1873.5021009999998,3394.9605990000005,4000.8802500000002,3770.345687,3445.4118130000002,4178.0560800000003,4887.8841179999999,3317.3364750000001,2519.7350820000001,2214.076313,1548.3190380000001,1495.0459250000001,2262.7707700000001,2451.8301609999994,2513.1795780000002,2977.310293,2461.2389950000002,"-","-","-"]
[null,"Régimen ordinario",20983.739000000001,17608.02,18707.558999999997,18018.677,17773.95,18579.984,20411.968000000001,18380.453000000001,18956.665000000001,19482.972000000002,19854.866999999998,21180.358,21067.758999999998,20037.241999999998,18120.440999999999,17648.763000000003,18314.264999999999,18491.100999999999,20610.635000000002,19356.754000000001,18522.235999999997,18165.444,17839.413,18837.095999999998,19471.396999999997,16149.814999999999,15759.361999999997,14376.523000000001,14921.868000000002,16791.513999999999,18868.688000000002,18146.089,16794.401542,16123.620999999999,14598.011512000001,16229.513999999999,17800.326901,15828.811808999997,16426.925139999999,15298.720989999998,14419.042774999998,15897.745939000002,18670.971038000003,17308.577246000001,17055.983044000001,15536.432202,15806.268372999999,16643.775550000002,17676.092590999997,15052.360806000001,15837.130485,13824.367601000002,14233.298637999998,15161.069801000001,16141.617303999999,16665.891373999999,16477.855981000001,14913.571090000001,14782.545440999998,15081.208714,17307.528527999999,16577.208049000001,15342.105280000002,12500.401532,13824.160775,14639.141625,15868.268838,16364.754692,14232.400959000001,15172.313072999999,13747.771951000001,14114.510844,13771.638279000001,12914.31818,13108.775812999998,12284.220286,11742.867138999998,11842.031079,16056.647744000002,14813.842134999999,14210.522724000002,13653.923406999998,12045.511449,14636.582331,"-","-","-","-","-","-","-","-","-","-","-","-","-","-","-","-","-","-","-","-","-","-","-","-","-","-","-","-","-","-","-","-","-","-","-","-","-","-","-","-","-","-","-","-","-","-","-","-","-","-","-","-","-","-","-","-","-","-","-","-"]
[null,"Hidroeólica","-","-","-","-","-","-","-","-","-","-","-","-","-","-","-","-","-","-","-","-","-","-","-","-","-","-","-","-","-","-","-","-","-","-","-","-","-","-","-","-","-","-","-","-","-","-","-","-","-","-","-","-","-","-","-","-","-","-","-","-","-","-","-","-","-","-","-","-","-","-","-","-","-","-","-","-","-","-","-","-","-","-","-","-","-","-","-","-","-",2.0200000000000001E-3,8.6389999999999991E-3,0.27424500000000002,0.101643,0,0.154755,0.18753500000000001,0.38498899999999997,0.34434100000000001,0.20485499999999998,9.6545000000000006E-2,0.17951499999999998,0.326206,2.0721609999999999,1.917459,0.71612199999999993,0.453293,0.86856,0.64337800000000001,0.79073599999999999,1.770319,1.5101659999999999,1.2809330000000001,0.896733,1.9903409999999999,2.5691329999999999,2.2107860000000001,2.1619989999999998,0.704287,0.99384000000000006,1.0126630000000001,1.0689709999999999,1.4358499999999998,2.122233,0.96850400000000003,1.4751179999999999,2.2178059999999999,3.1090070000000001,2.4503080000000002,2.3371379999999999,0.97127599999999992,0.790825,1.2860209999999999,2.2577669999999999,1.754305,1.5995219999999999,2.2626460000000002,2.0342029999999998,2.3218040000000002,3.7162829999999998,2.859321,2.165861,"-","-","-"]
[null,"Hidráulica/Resto hidráulica",345.48899999999998,478.79599999999999,516.02800000000002,529.75900000000001,509.19,412.91699999999997,302.29399999999998,256.69099999999997,186.381,186.98000000000002,190.15099999999998,211.82500000000002,340.49299999999999,233.46199999999999,301.47399999999999,581.11099999999999,613.46399999999994,581.87,380.714,264.678,212.28,190.523,400.12099999999998,539.62599999999998,521.06399999999996,629.61599999999999,560.02,501.49200000000002,577.14200000000005,468.387,365.35300000000001,282.64999999999998,242.869,230.81,466.05,608.61800000000005,764.37,616.57799999999997,784.76,690.19600000000003,688.34299999999996,608.94799999999998,459.60300000000001,341.74799999999999,281.05,318.88900000000001,567.66,702.17499999999995,680.26899700000001,514.72606699999994,678.30519299999992,600.95982600000002,495.739349,411.37051599999995,390.29407900000001,309.18539400000003,235.46892800000001,195.59357299999999,429.12362400000001,455.01989099999997,342.72543200000001,334.625902,328.43650299999996,473.21103899999997,650.26215500000001,443.75666899999999,342.57774799999993,267.50533100000001,203.461434,274.10869700000006,415.386776,631.81190900000001,680.35816899999998,703.23397599999998,864.35942699999998,867.289806,805.11707200000012,681.07851499999992,549.56526599999995,409.276208,312.02092699999997,351.59748800000006,536.02356299999997,527.13789400000007,"-","-","-","-","-","-","-","-","-","-","-","-","-","-","-","-","-","-","-","-","-","-","-","-","-","-","-","-","-","-","-","-","-","-","-","-","-","-","-","-","-","-","-","-","-","-","-","-","-","-","-","-","-","-","-","-","-","-","-","-"]
[null,"Eólica",2167.7449999999999,2895.3179999999998,3123.877,1382.6190000000001,2641.2139999999999,1818.328,1946.9179999999999,2468.8200000000002,2055.4479999999999,1927.347,2769.181,2414.8360000000002,2664.58,2035.72,4132.3620000000001,3389.4520000000002,1769.2150000000001,2125.6880000000001,2184.1570000000002,2034.3419999999999,2148.0600000000004,2516.4739999999997,3485.3240000000001,3674.4479999999999,3527.9769999999999,3244.2980000000002,3125.3940000000002,3106.5949999999998,2730.5969999999998,2353.5120000000002,2482.25,2293.0889999999999,2489.9910000000004,3138.623,4817.9000000000005,4942.6009999999997,4304.4309999999996,4637.902,4570.1519999999991,2667.3429999999998,3655.8969999999999,2615.31,2845.759,2937.761,2337.395,3967.3230000000003,4366.5439999999999,4639.5129999999999,4033.5400340000001,4053.5666860000001,4716.5428330000004,3424.4588309999999,3186.0351949999999,2975.6741769999999,3310.8822869999999,2783.4139899999996,2354.8422190000001,3178.5570540000003,3836.274915,4623.4625480000004,3668.2339729999999,5053.6809240000002,3845.5915909999999,5336.9812649999994,3735.0311370000004,3473.616188,3039.8777319999999,3181.746036,3953.8207109999994,3147.3328929999998,4622.2871129999994,5466.3304079999998,6316.8028140000006,5370.0574280000001,5763.1641730000001,4424.9824580000004,3970.8774840000001,3875.7851469999996,2885.9033009999998,3453.6925739999997,3239.161689,3988.5461649999997,6458.3484399999998,4966.0720620000011,6570.961682000001,5917.5259569999998,5096.4476000000004,3978.164753,4177.8755180000007,3310.9643050000004,3637.1326399999998,2916.9010090000002,2145.2174679999998,3398.8877809999999,5093.1315199999999,4788.8206150000005,4954.5307119999998,5992.5466649999998,4907.4960579999997,3933.9199840000001,4841.1832860000004,2903.9293429999998,3113.2942790000002,3287.3437070000004,3020.6248619999997,3901.1511609999998,3724.5981649999999,3537.2692940000002,5624.5777410000001,6109.5307389999998,5443.9702969999998,4441.296233,3933.1027530000001,3271.3349730000004,3521.9415979999999,3652.945479,2713.8266760000001,2389.6180890000005,3906.8531379999999,2687.6625930000005,4812.548538,4928.5064670000002,4724.3692110000002,4196.146968,3465.9962799999998,3192.3720410000001,3387.3548269999997,3343.9304509999997,2872.1324100000002,3208.2463490000005,3982.214379,5793.4655190000003,5343.1658960000004,4680.1140400000004,7701.0427059999993,4455.3973569999998,3309.464974,2628.2477280000003,2573.5779320000001,3129.0389970000001,2455.0871730000003,"-","-","-"]
[null,"Solar fotovoltaica",10.391,12.96,21.983999999999998,26.105999999999998,36.128,40.742000000000004,51.927,56.504000000000005,60.428000000000004,57.695999999999998,54.375999999999998,54.66,59.578000000000003,73.40100000000001,108.56200000000001,131.04400000000001,137.02099999999999,196.40899999999999,240.44200000000001,298.52500000000003,328.08499999999998,334.32799999999997,335.40200000000004,255.15899999999999,261.25799999999998,396.22799999999995,528.73199999999997,569.73800000000006,672.34699999999998,643.83199999999999,717.298,663.41,511.53100000000001,502.20600000000002,361.99299999999999,243.81700000000001,263.11899999999997,305.07099999999997,481.50900000000001,590.40700000000004,711.44200000000001,685.33100000000002,785.81499999999994,723.07,631.37599999999998,548.48400000000004,382.17600000000004,314.97199999999998,351.25704199999996,505.13897400000002,536.66086899999993,661.69363200000009,748.62546699999996,812.11594999999988,859.51952499999993,808.57601499999998,735.89510600000006,629.61145800000008,365.45011899999997,426.20822299999998,504.68662200000006,660.32954900000004,770.14251500000012,658.51844600000004,863.50596499999995,875.87502500000005,941.61867299999994,865.18406500000003,692.37256400000001,595.43097599999999,372.48646200000002,402.10828300000003,446.28364399999998,527.71839899999998,566.71979299999998,763.80427199999997,872.918678,930.952541,974.75945400000001,896.90155000000004,759.63497499999994,634.76695299999994,513.57505900000001,439.23927800000001,377.51872800000001,434.38339999999999,735.97062399999993,791.98590600000011,924.51519599999995,903.76552099999992,951.57779199999993,914.03523199999995,686.9727069999999,647.94019800000001,385.42102100000005,453.83980600000001,518.44025699999997,494.22751599999998,713.26182699999993,755.91011600000002,924.09243099999992,889.20622199999991,933.15770399999997,831.90100700000005,722.20393200000001,537.71161700000005,529.69866400000001,393.74961200000001,364.45826199999999,480.08144100000004,709.28949999999998,721.480234,807.00342100000012,924.0523199999999,918.53036899999995,895.83873499999993,766.07023200000003,584.44481900000005,426.51325400000002,379.70459800000003,476.15505699999994,445.43688500000002,717.34857599999998,836.60470299999997,872.97963399999992,881.51588800000002,917.55959599999994,819.23192199999994,775.73392299999989,682.14999499999999,540.32345800000007,432.067069,444.31957599999998,510.23763100000002,590.64223700000002,700.87219300000015,812.49557899999991,818.32591300000001,929.38433400000008,841.11832900000002,666.32017599999995,"-","-","-"]
[null,"Solar térmica",0,0,0.43099999999999999,0.34200000000000003,0.55800000000000005,0.88300000000000001,1.256,1.1160000000000001,0.63900000000000001,1.214,0.997,0.191,1.0840000000000001,0.79700000000000004,1.4610000000000001,0.95799999999999996,0.94199999999999995,1.9630000000000001,2.0379999999999998,1.98,0.85899999999999999,0.86599999999999999,1.27,1.1599999999999999,0.69,1.236,2.323,7.2039999999999997,7.6580000000000004,6.7519999999999998,12.414,23.867999999999999,17.539000000000001,23.446000000000002,16.183,10.51,13.151999999999999,11.682,23.731999999999999,36.92,69.084000000000003,72.531999999999996,104.59,121.9,100.917,71.745000000000005,31.619,33.747,39.743130000000001,88.657368000000005,98.457166999999998,137.83512100000002,160.44092499999999,247.970979,284.05997400000001,235.32909799999999,228.55802400000002,172.94973899999999,81.173647000000003,86.466376999999994,117.342049,200.34185399999998,235.11348100000001,177.77704500000002,348.382183,414.74907200000001,541.31674100000009,485.12652700000001,368.64290099999999,289.15457700000002,133.961873,135.585309,113.494435,204.009049,125.370378,300.89360499999998,499.267989,647.33005299999991,758.52291099999991,661.85580500000003,478.95522799999998,294.24195199999997,199.223861,158.362269,79.800654999999992,103.26450199999999,385.17531600000001,435.52705900000001,729.93555500000002,687.28808200000003,811.15318400000001,833.17848000000004,389.59590299999996,289.33703000000003,90.187433999999996,124.47172599999999,176.95139600000002,190.92526000000001,415.82866200000001,393.16048599999999,694.83874000000003,734.05393700000002,888.91770999999994,607.62348800000007,483.25015300000001,188.16886600000001,226.81775099999999,84.699065000000004,59.913641000000005,133.00979000000001,387.86076199999997,408.32323200000002,498.79538199999996,813.99067100000002,825.32457999999997,805.81879700000002,595.62669299999993,284.70289100000002,139.69961799999999,118.13564500000001,149.21208100000001,88.740902000000006,340.84468499999997,535.25547800000004,607.89817700000003,761.902153,812.88028599999996,692.43517500000007,608.14265499999999,398.79322200000001,220.652322,131.161056,112.387517,229.80815100000001,233.95594299999999,325.935092,477.20963399999999,551.29260299999999,858.89464800000007,688.557997,465.63993599999998,"-","-","-"]
[null,"Térmica renovable/Otras renovables",216.57900000000001,190.44399999999999,202.655,201.31399999999999,212.92099999999999,208.53500000000003,222.32499999999999,223.34399999999999,210.393,242.72399999999999,222.18800000000002,235.54599999999999,240.54300000000001,235.363,243.89999999999998,241.16800000000001,240.34899999999999,235.23099999999999,223.648,239.89500000000001,225.512,247.172,248.54500000000002,247.38200000000001,267.15800000000002,253.47299999999998,264.57600000000002,300.05200000000002,272.99799999999999,253.04599999999999,260.84899999999999,260.46300000000002,287.976,347.83600000000001,272.58799999999997,276.327,274.84199999999998,245.35900000000001,262.31099999999998,277.04300000000001,300.03700000000003,288.51100000000002,278.10199999999998,284.791,267.96199999999999,284.303,273.09999999999997,295.99899999999997,309.53941400000002,288.16413500000004,304.18363499999998,301.262449,311.49708700000002,277.16630900000001,311.49470799999995,315.060451,330.49963600000001,324.59757799999994,315.31492699999995,325.253939,323.44696399999998,310.30986899999999,320.46749499999999,298.75463300000001,314.13914399999999,326.04110000000003,327.98126099999996,295.04480299999994,282.00825199999997,314.36652600000002,327.117999,351.40537299999994,358.30979500000001,330.34016800000001,355.45151900000002,364.848568,371.370676,347.35634900000002,386.75047999999998,370.01897100000002,349.040144,356.57301999999999,358.83186500000005,385.39388400000001,380.89558700000003,293.997433,305.87824900000004,266.46750900000001,330.19200600000005,330.073196,338.21408199999996,349.91252600000001,333.10012699999999,300.49895900000001,288.09028500000005,298.99575799999997,301.80383599999999,245.32970900000001,274.297685,201.67778900000002,274.88919899999996,288.140649,309.89189199999998,317.50308199999995,307.42931800000002,314.764745,307.12618899999995,289.73782799999998,270.62455900000003,261.56710900000002,255.63042000000002,209.99403299999997,277.22120700000005,287.56065699999999,311.07962699999996,326.72704499999998,307.66266100000001,306.35809699999999,304.81659500000001,306.42281800000001,327.46052900000001,289.71982500000001,269.56085000000002,232.81675199999998,298.76736100000005,302.61686900000001,333.388938,316.02745400000003,309.49632200000002,309.76402100000001,307.75329699999998,312.56960799999996,296.33144100000004,301.60146800000001,270.09188899999998,237.806487,291.74627799999996,304.38883600000003,324.14899300000002,317.27380400000004,320.02910299999996,"-","-","-"]
[null,"Térmica no renovable/Cogeneración y resto/Cogeneración",1995.5450000000001,1768.9959999999999,1879.5849999999998,1844.2359999999999,1838.9460000000001,1904.7730000000001,2000.027,1879.0259999999998,1965.914,2104.393,2108.9319999999998,2160.0570000000002,2263.8589999999999,2239.8829999999998,2285.25,2241.5010000000002,2119.1759999999999,2090.9559999999997,2229.8599999999997,2028.0640000000001,2188.578,2370.777,2326.19,2337.056,2435.4610000000002,2252.732,2408.4,2350.433,2364.2140000000004,2321.6890000000003,2408.567,2045.8420000000001,2349.3010000000004,2475.8960000000002,2583.23,2604.9659999999999,2672.7280000000001,2486.873,2628.8110000000001,2562.366,2593.181,2552.884,2625.9669999999996,2177.1619999999998,2550.5650000000001,2661.3690000000001,2677.2269999999999,2784.1910000000003,2641.33329,2474.4980799999998,2771.8159479999999,2559.9713710000001,2609.202777,2488.7474570000004,2499.9218899999996,2079.1206430000002,2507.9004789999999,2621.3494019999998,2631.2407529999996,2708.1496339999999,2825.383523,2691.0004239999998,2859.2394360000003,2710.8220289999999,2739.873145,2611.1313210000003,2710.2183569999997,2276.7618740000003,2651.5529420000003,2807.8666229999999,2750.4110449999998,2810.0243840000003,2902.01379,2593.755627,2805.7447770000003,2743.6452260000001,2755.7108470000003,2583.4810070000003,2574.9578590000001,1993.272714,2403.376831,2473.8731939999998,2474.8560069999999,2530.9767099999999,2550.4624210000002,1876.056059,1831.1794970000001,1618.6634349999999,1931.1749909999999,2075.296108,2119.3482570000001,1985.6609480000002,2113.6617499999998,2127.4588550000003,1934.806734,1989.474827,2164.1626329999999,1925.0522810000002,2080.709938,2013.602705,2076.4639269999998,2063.674739,2160.6293680000003,2039.3747389999999,2151.1692800000001,2214.3574169999997,2130.0192729999999,2181.6614660000005,2130.9728569999997,1970.7744270000001,2072.5601029999998,1995.5406879999998,2115.728102,2171.0857920000003,2242.7072220000005,2123.5300029999999,2138.07377,2321.3905340000001,2298.3205709999997,2327.9594900000002,2452.616587,2209.5645749999999,2394.489806,2235.4759369999997,2329.2435479999999,2318.1374340000002,2401.1339720000001,2261.1461940000004,2275.7699640000001,2396.3149149999999,2444.639807,2493.0081359999999,2483.6320450000003,2254.164393,2337.8219810000001,2355.5717629999999,2420.884775,2407.0033799999997,2435.6083699999999,2361.847334,2394.3984729999997,"-","-","-"]
[null,"Residuos no renovables","-","-","-","-","-","-","-","-","-","-","-","-","-","-","-","-","-","-","-","-","-","-","-","-","-","-","-","-","-","-","-","-","-","-","-","-","-","-","-","-","-","-","-","-","-","-","-","-",113.96656,102.09047850000002,89.328484000000003,112.23982400000001,76.401109500000004,100.921817,89.393425000000008,98.236345,110.88978299999999,136.75470949999999,126.6079135,130.940031,135.12554,121.20418249999999,119.799284,137.51646199999999,131.01281599999999,114.01839600000001,127.0878165,140.736839,141.68199149999998,149.98868149999998,128.81465299999999,142.42923200000001,149.21606449999999,143.40074000000001,147.87344400000001,87.793574500000005,119.9344755,112.49038849999999,121.699202,131.15392349999999,148.49702000000002,152.81405799999999,143.9126895,158.45044849999999,143.22052199999999,122.56464450000001,112.14240800000002,137.93853799999999,162.033556,165.420421,171.4439505,181.39715049999998,190.69954200000001,190.5400775,178.30236249999999,210.17387099999999,197.69496649999999,177.613708,207.61285950000001,168.03479149999998,207.88727750000001,210.36838650000001,223.35545099999999,226.59905999999998,217.54282599999999,230.57767250000001,217.71525299999999,195.1067165,209.91118649999999,192.98724650000003,218.08644899999999,191.97432950000001,151.878568,209.614598,254.60589400000001,256.24243099999995,250.021142,244.20475349999998,214.70403250000001,212.73313400000001,224.8531165,198.534402,220.08596749999998,187.774349,187.24357799999999,225.84302600000001,215.10953950000001,229.90147299999998,228.79097350000001,242.89244500000001,217.89177899999999,229.04889399999999,234.5740625,209.15052299999999,227.1195505,180.40752700000002,148.02814699999999,190.54532699999999,214.466498,210.08752750000002,202.9028615,"-","-","-"]
[null,"Residuos renovables","-","-","-","-","-","-","-","-","-","-","-","-","-","-","-","-","-","-","-","-","-","-","-","-","-","-","-","-","-","-","-","-","-","-","-","-","-","-","-","-","-","-","-","-","-","-","-","-",64.676535999999999,57.9214105,39.859917000000003,60.267739000000006,47.065160500000005,69.572035,70.694942999999995,64.463544999999996,61.982925999999999,66.642919499999991,63.632651500000009,69.275960999999995,67.258019000000004,53.332264500000001,40.775378000000003,62.179900000000004,50.964812000000009,64.279336999999998,70.588013500000002,67.696396000000007,63.80987549999999,61.960437500000005,58.540096999999996,58.405467000000002,59.5268765,53.118248000000008,46.529089999999997,25.230527500000001,29.502280500000005,27.608296500000002,31.754573999999998,47.027261500000009,62.914835000000004,55.457450999999992,56.3724615,60.697600499999993,49.339647999999997,35.868039500000002,32.435465999999998,51.170320000000004,60.551003999999999,58.360806999999994,67.005232500000005,55.681831500000001,68.960821999999993,64.805283500000002,60.3019465,73.591172,64.152761499999997,59.516463000000002,72.007513500000002,47.499358500000007,64.893153499999997,73.037460499999995,73.160616000000005,70.309055999999998,70.194001,75.951562499999994,74.485474999999994,72.842281499999999,66.351435499999994,53.484914500000002,66.529240000000001,39.262202500000001,39.159787000000001,69.139427999999995,75.307697000000005,73.403188999999998,75.079728000000003,74.217034499999997,74.12118550000001,79.339188000000007,72.733759500000005,63.647489,70.866812499999995,61.681896000000002,45.922100999999998,81.467664000000013,83.370790499999998,80.36790400000001,77.904931500000004,80.609651999999997,77.92410799999999,80.508979000000011,77.266070499999998,67.136116999999999,77.633272500000004,77.872185000000002,35.345674000000002,65.936057000000005,79.704862999999989,81.187428499999996,78.622101499999999,"-","-","-"]
[null,"Régimen especial",4735.7489999999998,5346.5139999999992,5744.5599999999995,3984.3760000000002,5238.9570000000003,4386.1779999999999,4524.7469999999994,4885.5010000000002,4479.2029999999995,4520.3540000000003,5345.8249999999998,5077.1149999999998,5570.1369999999997,4818.6259999999993,7073.009,6585.2339999999995,4880.1670000000004,5232.1170000000002,5260.8590000000004,4867.4840000000004,5103.3740000000007,5660.1399999999994,6796.8520000000008,7054.8309999999983,7013.6080000000002,6777.5829999999996,6889.4450000000015,6835.5139999999992,6624.9560000000001,6047.2180000000008,6246.7309999999998,5569.3220000000001,5899.2070000000012,6718.8170000000009,8517.9440000000013,8686.8389999999999,8292.6419999999998,8303.4650000000001,8751.2749999999996,6824.2749999999996,8017.9840000000004,6823.5160000000005,7099.8359999999993,6586.4320000000007,6169.2649999999994,7852.1130000000012,8298.3260000000009,8770.5969999999998,8234.3250029999999,8084.763199,9235.1540459999997,7858.6887930000003,7635.0070699999987,7383.5392400000001,7816.2608309999996,6693.3854810000003,6566.0371009999999,7326.0564329999997,7848.81855,8824.7766039999988,7984.2021219999988,9424.8249689999993,8519.5656830000025,9855.7608189999992,8833.1713570000011,8323.4671079999989,8101.2663419999999,7579.8018710000015,8357.3506709999983,7640.2094109999998,8809.0060179999982,9998.1003650000002,11026.005588,9925.6336350000001,10675.212601000001,9578.488037000001,9424.6995020000013,9206.0822970000008,8283.913047,7963.1990070000011,7753.6016489999993,8307.8702810000013,10741.143946,9226.3301460000002,"-","-","-","-","-","-","-","-","-","-","-","-","-","-","-","-","-","-","-","-","-","-","-","-","-","-","-","-","-","-","-","-","-","-","-","-","-","-","-","-","-","-","-","-","-","-","-","-","-","-","-","-","-","-","-","-","-","-","-","-"]
[null,"Generación",25719.488000000005,22954.533999999996,24452.118999999995,22003.053,23012.906999999999,22966.162000000004,24936.715000000004,23265.954000000005,23435.868000000002,24003.326000000001,25200.691999999999,26257.472999999998,26637.895999999997,24855.868000000002,25193.45,24233.997000000007,23194.431999999997,23723.217999999997,25871.494000000002,24224.238000000001,23625.609999999997,23825.584000000003,24636.264999999999,25891.927,26485.004999999994,22927.397999999997,22648.807000000001,21212.037000000004,21546.824000000004,22838.731999999996,25115.418999999998,23715.411,22693.608541999998,22842.437999999998,23115.955512,24916.352999999996,26092.968900999997,24132.276808999995,25178.200139999997,22122.995989999996,22437.026774999998,22721.261938999996,25770.807038000003,23895.009246000001,23225.248044,23388.545201999998,24104.594372999993,25414.37255,25910.417593999995,23137.124004999998,25072.284531000001,21683.056393999999,21868.305707999993,22544.609041000003,23957.878134999992,23359.276855,23043.893082000002,22239.627522999999,22631.363990999995,23905.985317999999,25291.730649999998,26002.033018000006,23861.670963,22356.162350999999,22657.332132000003,22962.608732999997,23969.535179999999,23944.556563000002,22589.751630000002,22812.522484000005,22556.777969000002,24112.611209000002,24797.643867000003,22839.951814999997,23783.988413999996,21862.708323000006,21167.566641000001,21048.113376000001,24340.560791,22777.041141999995,21964.124372999999,21961.793687999994,22786.655394999998,23862.912477000002,24033.265818,22532.110570999997,22791.587876000005,21031.575034999998,21310.054323000004,21399.503645000001,23182.893422999998,22009.792363,22141.686087000002,21576.125532000002,21175.115792999997,23277.272894000002,24591.982586999999,23183.600728999998,23198.119716000001,20615.966569,21214.854401000004,21737.055151999997,25298.618726000004,22875.295150999998,21263.689079000003,20897.443362999995,20948.235933,21628.987729000004,22682.954323000002,21666.409198000001,23045.054902999997,21727.260152999999,20606.489100999999,20618.054828,22867.446884000001,22033.548119999999,21164.434871999998,21755.901377000002,21765.361636000001,21902.776088999995,25304.377052,20993.318284000001,21142.563109000002,19415.513127999999,20233.318166999998,22087.737512,22798.594934000001,21699.271912999997,20247.136275000001,21398.096679999999,22694.260275000001,24290.381363,22869.183042000001,21843.799081000001,24277.634547999998,20758.442070999998,20138.006541999999,19816.850111999996,21810.707503000005,22321.127995000003,20989.488814000004,"-","-","-"]
[null,"Consumos en bombeo",-371.77600000000001,-395.87900000000002,-384.16800000000001,-293.39699999999999,-397.62200000000001,-356.25400000000002,-333.52100000000002,-371.38200000000001,-345.92500000000001,-317.00099999999998,-384.15499999999997,-481.20699999999999,-430.83600000000001,-419.30500000000001,-401.79399999999998,-219.05799999999999,-206.07300000000001,-285.255,-253.78200000000001,-190.80199999999999,-226.55600000000001,-297.14499999999998,-411.25599999999997,-460.64,-492.22699999999998,-392.03500000000003,-281.47199999999998,-255.75899999999999,-247.49799999999999,-224.59399999999999,-241.018,-245.006,-254.49299999999999,-284.12299999999999,-397.50099999999998,-478.46300000000002,-756.58548100000007,-554.72222199999999,-544.66441799999996,-303.16059899999999,-279.94919199999998,-230.155124,-199.16812999999999,-231.14395499999998,-233.69566899999998,-346.11598499999997,-322.22366899999997,-456.19813299999998,-433.11024748,-283.74152552800001,-349.30097691799995,-300.04761586399997,-160.64980081600001,-141.781322192,-175.847837008,-183.38067148799999,-178.11245619200002,-303.85738500000002,-327.17254042400003,-404.49143771999996,-451.82722167200001,-450.44684829599998,-434.615101686,-569.28791355999999,-362.23293290399999,-324.50380338400004,-288.75519004800003,-368.94573709600002,-457.46286814400003,-398.68789700000002,-405.02623852800002,-547.33924728,-699.75148337600001,-564.56846524000002,-1023.591614206,-874.07915915199999,-454.16733199999999,-388.94544047199997,-259.73799365600001,-234.30714860799998,-214.34712908799997,-306.95237199999997,-350.92624557600004,-584.40170843999999,-859.99467229599998,-629.04720457600001,-527.52226513400001,-512.77154843999995,-436.98039667199998,-326.96377761599996,-276.14044000000001,-220.375546576,-218.081517768,-410.46434799999997,-519.91368062399999,-447.51346185599999,-482.10123765399999,-545.62121219999995,-480.74035167200003,-406.66995899999995,-371.185291608,-155.118774608,-168.70420066400001,-303.45802009599998,-246.401091288,-375.05830500000002,-439.22496628800002,-537.96802052800001,-897.52000399999997,-716.57851924000011,-590.27206849200002,-584.37827990400001,-474.93249372000002,-211.03821543999999,-141.90742776799999,-161.324649776,-122.898689,-230.009151952,-353.599471376,-343.12609700000002,-434.60426672,-482.99988120800003,-334.470282166,-342.53471273999997,-229.22229382399999,-192.691575,-174.03281200000001,-204.91962000000001,-164.38873100000001,-222.16092699999999,-270.17416399999996,-555.38172199999997,-391.47835200000003,-253.86108900000002,-733.49642400000005,-560.06841218400007,-213.24354462900001,-83.652090872000002,-57.940257936000002,-68.902296153999998,-80.573028000000008,"-","-","-"]
[null,"Saldo intercambios internacionales",94.564999999999998,-235.49199999999999,-243.36199999999999,-261.05399999999997,-494.78800000000001,-223.46299999999999,-289.77800000000002,-314.01400000000001,-846.57600000000002,-1153.7719999999999,-1052.93,-729.80100000000004,-456.80399999999997,-655.58699999999999,-1199.348,-1291.615,-761.27499999999998,-1052.3420000000001,-907.81299999999999,-796.07299999999998,-935.81,-1102.0160000000001,-948.447,-932.45600000000002,-897.62800000000004,-474.27699999999999,-192.952,-548.93399999999997,-437.37599999999998,-769.16099999999994,-944.90899999999999,-817.41700000000003,-711.16800000000001,-941.36500000000001,-897.21199999999999,-454.01499999999999,-304.71344599999998,-506.196753,-560.11404599999992,-729.095102,-542.81502899999998,-821.22575100000006,-1000.6535670000001,-758.60105700000008,-964.2554520000001,-1295.5098870000002,-593.21057400000007,-256.28839399999998,-611.33580500000005,-358.84235899999999,-762.63600899999994,-1074.8113170000001,-233.62379999999999,-404.76718699999998,-470.93457000000001,-197.10088099999999,-548.75685799999997,-381.58426100000003,-579.51663300000007,-466.21665400000001,-525.29093599999999,-1375.7932209999999,-869.96906999999999,-1211.9197819999999,-939.84038100000009,-625.32935199999997,-629.52545599999996,-646.20974899999999,-1047.302604,-1457.208903,-791.40693099999999,-1080.1572060000001,-364.45221100000003,-642.39397799999995,-430.41725799999995,-411.18220100000002,-132.05559299999999,-358.69515000000001,-1060.4316310000002,-517.67452200000002,-821.87308799999994,-679.119191,-892.91131900000005,-420.92630800000001,28.099829000000003,-490.54062400000004,-225.94670300000001,-652.23227599999996,-256.41148300000003,-285.58111300000002,-481.72024800000003,-236.69277,-336.25484,-303.548856,195.372657,-360.667597,-259.102957,-558.85504600000002,-396.75677899999999,-295.55073599999997,180.77279000000001,0.88915499999999992,-184.17543000000001,-251.793361,-169.94083300000003,436.52793199999996,453.107913,911.71418900000003,847.59026500000004,960.57577300000003,174.92662100000001,-106.684112,762.50236499999994,1083.2692120000002,917.73114199999998,1034.6561139999999,1121.321048,-433.77812599999999,357.21121500000004,938.722174,-531.54929799999991,541.13476000000003,1457.080766,1040.955944,1444.9895649999999,1128.8756839999999,1273.4433959999999,1827.9167399999999,1393.3093409999999,282.97961800000002,-350.214877,-339.92811599999999,1340.2982630000001,857.10299299999997,-273.62203199999999,882.59852599999999,1368.3609369999999,1863.9643000000001,1893.727091,1244.0220749999999,1124.4621510000002,"-","-","-"]
[null,"Demanda transporte (b.c.)",25442.277000000002,22323.162999999997,23824.588999999993,21448.601999999999,22120.496999999999,22386.445000000003,24313.416000000005,22580.558000000005,22243.367000000002,22532.553,23763.607,25046.465,25750.255999999998,23780.976000000002,23592.307999999997,22723.324000000004,22227.083999999995,22385.620999999996,24709.899000000005,23237.363000000001,22463.243999999995,22426.423000000003,23276.561999999998,24498.831000000002,25095.149999999994,22061.085999999999,22174.382999999998,20407.344000000005,20861.950000000004,21844.976999999995,23929.491999999998,22652.987999999998,21727.947541999998,21616.949999999997,21821.242512000001,23983.874999999996,25031.669973999997,23071.357833999995,24073.421675999998,21090.740288999998,21614.262553999997,21669.881063999994,24570.985341000003,22905.264234000002,22027.296922999998,21746.919329999997,23189.160129999993,24701.886022999999,24865.971541519997,22494.540120472,23960.347545082001,20308.197461135998,21474.03210718399,21998.060531808002,23311.095727991989,22978.795302512,22317.023767808001,21554.185877,21724.674817575997,23035.277226279999,24314.612492327997,24175.792948704006,22557.086791314003,20574.954655439997,21355.258818096001,22012.775577615997,23051.254533952,22929.401076904,21084.986157856001,20956.625684000006,21360.344799472001,22485.114755720002,23733.440172624003,21632.989371759995,22329.979541793993,20577.446962848007,20581.343715999999,20300.472785528,23020.391166344001,22025.059471391993,20927.904155911998,20975.722124999993,21542.817830423999,22857.584460560003,23201.370974703997,21412.522742423997,22038.118907866003,19866.57121056,20616.662443328005,20786.958754383999,22425.032734999997,21552.724046423999,21587.349729231999,20862.112327999999,20850.574769375999,22469.091835144001,23850.778392346001,22079.124470799998,22320.622585328001,19913.745874,21024.441899392004,21582.825532391998,24945.739095336005,22320.043769903998,20847.347154712003,20958.912989999997,20962.118879712001,22002.733897472004,22633.024583999999,21910.406451760002,22629.709455507997,21036.197761095998,20894.05897228,21490.28582456,23643.270598232,22906.879584224,22162.857230999998,21092.114099048002,21768.973379624,22498.372165999994,24338.223487279996,21051.453162792001,22265.173592834002,20113.934359260002,21449.085438175996,23023.921620999998,23898.005517999998,23322.269032999997,21476.056885000002,21458.915370999999,22073.871234000002,23395.071525000003,23818.002953000003,22447.040985,23270.516091999998,21080.972184816001,21293.123934371,21597.162321127995,23646.494336064006,23496.247773846004,22033.377937000005,"-","-","-"]
[]
[null,"Balance eléctrico anual peninsular (GWh)",1990,1991,1992,1993,1994,1995,1996,1997,1998,1999,2000,2001,2002,2003,2004,2005,2006,2007,2008,2009,2010,2011,2012,2013,2014,2015,2016,2017,2018,2019,2020,2021]
[null,"Hidráulica",23540.760600000001,24727.9339,16556.8675,21514.489699999995,25008.665699999998,20239.087800000001,36324.757399999995,31681.262700000003,31855.535200000002,21297.382000000005,24057.834800000004,36104.5772,17325.872599999999,35008.3632,26120.459100000004,14430.614099999992,21226.384899999994,22978.978099999993,18295.638600000002,20732.3027,35009.454188100004,25041.283889210004,15945.719241297998,30098.396723939997,39178.524159204004,28379.011570850002,36111.434365772002,18445.894516660002,27981.527430086,"-","-","-"]
[null,"Turbinación bombeo",727.49040000000002,1002.9131,1953.4935,1321.2912999999999,941.77229999999986,1457.2081999999998,1065.8326000000002,1232.6223,1811.4277999999999,2566.4659999999999,3434.8202000000001,2891.8847999999998,4869.6773999999987,3274.6938,3223.2948999999999,4449.8628999999992,3743.8611000000001,3102.6008999999999,2661.7513999999996,2655.9322999999999,3120.4478038999996,2183.53623079,3201.889743702,3289.6771840599995,3415.9960267959996,2895.3657881499998,3134.3289102280005,2248.9644183400001,1516.8344439140001,"-","-","-"]
[null,"Nuclear",51905.668000000005,53162.400000000009,53360.06,53665.29,52995.802999999993,53138.097999999998,54112.745999999999,53048.341999999997,56572.047000000013,56378.196999999993,59530.32,60985.213000000003,60288.447,59219.589999999989,60875.742000000006,54901.832999999999,57353.705999999998,52638.926999999996,56460.290999999997,50549.445000000007,59242.321647000004,55005.874867000006,58595.438798999996,54210.788118999997,54781.281335,54661.803305000009,56021.682058999999,55539.561502000004,39930.403362999998,"-","-","-"]
[null,"Carbón",55338.808000000005,55804.307000000001,59825.894999999997,57851.097999999998,57174.709000000003,61234.712,49468.669000000002,58519.805999999997,56925.974999999999,68405.633000000002,72228.170999999988,64448.903999999995,74555.690999999992,68293.165999999997,72120.106,72994.088999999993,62126.065000000002,67686.248000000007,43409.537000000004,31622.562000000002,20599.255834,40412.479847999995,51097.323936000001,37090.897312000001,41058.278770999998,50754.794511,35010.909780000002,42422.113335000002,24817.980824999999,"-","-","-"]
[null,"Fuel + Gas",2865.9459999999999,4041.6849999999999,7463.5830000000014,1777.1469999999999,1412.1849999999999,3661.1629999999996,2043.33,6552.5410000000002,5338.8809999999994,9350.6630000000005,9565.2989999999991,11579.619000000001,15545.682000000004,7431.6419999999998,7089.4679999999998,9294.3179999999993,5396.0580000000009,2090.7650000000003,2074.895,1789.5900000000001,1566.0229999999999,-10.012343000000001,-3.8126409999999997,-2.012715,-0.81973099999999999,1.6618000000000001E-2,2.3499999999999999E-4,-9.9999999999999995E-7,-9.9999999999999995E-7,"-","-","-"]
[null,"Ciclo combinado",0,0,0,0.21299999999999999,0,0,0,0,0,0,0,0,5155.6730000000007,14626.086000000003,28312.845000000001,47846.789000000004,62122.434000000001,66572.867999999988,89100.732000000004,76379.284,62954.940244999991,49193.213946000011,37316.789670999999,24126.557304999998,21120.508624999999,25034.545559999999,25463.066257999999,33647.985853999999,17843.609035000001,"-","-","-"]
[null,"Régimen ordinario",134378.67300000001,138739.239,139159.899,136129.52899999998,137533.13500000001,139730.269,143015.33499999999,151034.57399999999,152503.86600000001,157998.34100000001,168816.44500000001,176010.198,177741.04300000001,187853.541,197741.91500000001,203917.50599999999,211968.50899999999,215070.38700000002,212002.845,183729.11600000001,182492.44271799998,171826.37643800004,166153.34875,148814.30392899999," "," "," "," "," "," "," "," "]
[null,"Hidráulica/Resto hidráulica",982.63199996000014,1704.7810000000002,2081.7730000000001,2234.2280000000001,2475.268,2222.8739999999998,3543.8470000000002,3428.9950000000003,3578.4739169999993,3740.3226119999995,3836.0999330000004,4287.5226330000005,3899.4523389999999,5088.644045,4749.5783850000016,3817.5829390000013,4148.5638790000012,4125.3249999999998,4638.143,5453.6730000000007,6824.32,5394.3795110000001,4706.0782939999999,7284.0088070000002," "," "," "," "," "," "," "," "]
[null,"Eólica",2.18699998,2.8650000000000002,17.361000000000001,84.768000000000001,72.859999999999985,159.85699999999997,304.12899999999996,619.88499999999999,1236.6567059999998,2474.0332980000003,4462.4960500000007,6594.1481130000002,9259.2966869999982,11720.246133000002,15754.117769000002,20857.665958999998,22880.856075000003,27249.154999999999,31757.850000000006,37888.576999999997,43208.396000000001,42115.787093000006,48156.257946999998,54344.500782000003,50636.662464000008,47715.882144999996,47298.163668000001,47508.431816000004,35750.124093999999,"-","-","-"]
[null,"Solar fotovoltaica",0,0,12.055999999999999,12.000000000000002,15.295899999999996,1.0619999999999998,0.89100000000000001,1.127,1.1702970000000001,1.341181,1.269817,1.639643,4.5614520000000001,8.9301049999999957,17.794010999999976,40.088349000000001,102.37499899999992,462.577,2406.0700000000002,5829.0049999999992,6139.7820000000002,7105.8708019999995,7830.0693760000004,7918.3761040000009,7802.7909199999995,7845.3145369999993,7579.2182119999998,8000.0706869999985,6003.7693920000002,"-","-","-"]
[null,"Solar térmica",0,0,0,0,0,0,0,0,0,0,0,0,0,0,0,0,0,7.6269999999999998,15.378,129.82299999999998,691.62,1861.6415489999997,3447.4936120000002,4441.5275350000002,4958.9149259999995,5085.235514,5071.2017019999994,5347.9181920000001,3943.681521,"-","-","-"]
[null,"Térmica renovable/Otras renovables",0,0.85399999999999987,16.548999999999999,58.82200000000001,322.45,671.26900000000001,815.08,648.375,748.74632699999995,908.25367599999993,961.11038600000018,1738.4584279999999,1453.0152859999998,1737.0417380000004,1818.0936319999998,1987.8580699999998,2182.6066820000001,2375.6849999999999,2651.4889999999996,3044.2870000000003,3171.7989999999995,3705.130529,3782.4631420000005,4325.2771579999999,3805.563474,3422.5667469999999,3415.0193380000001,3598.7498260000002,2655.9777049999998,"-","-","-"]
[null,"Térmica no renovable/Cogeneración y resto/Cogeneración",654.85700006000002,1435.9839999999997,1902.8819999999998,3307.5039999999999,5311.9911000000002,6540.7530000000006,8991.82,11462.615999999998,14168.280752999999,17137.272233000003,17379.554813999999,17656.688182999998,20831.652236000002,22845.346978999998,23528.704202999998,23263.703683,22318.939364999995,23327.756999999998,26575.975999999999,28465.934000000001,30789.052000000003,30555.110683999999,32417.788433000005,30809.943766999997,24128.021298,25169.328039000004,25873.942241999997,28175.296641000001,21424.935633000001,"-","-","-"]
[null,"Residuos no renovables"," "," "," "," "," "," "," "," "," "," "," "," "," "," "," "," "," "," "," "," "," ",1160.5408360000004,1465.4718790000002,1500.150535,1833.3435570000001,2324.7147409999998,2471.3086454999998,2459.1138890000002,1711.3341385000001,"-","-","-"]
[null,"Residuos renovables"," "," "," "," "," "," "," "," "," "," "," "," "," "," "," "," "," "," "," "," "," ",608.82609999999988,595.84598200000005,438.65400899999997,545.53808600000002,662.65547500000002,649.73991049999995,728.15043300000002,534.75588349999998,"-","-","-"]
[null,"Régimen especial",1639.6760000000002,3144.4839999999999,4030.6210000000001,5697.3220000000001,8197.8649999999998,9595.8150000000005,13655.767,16160.997999999998,19733.327999999998,24261.223000000005,26640.531000000003,30278.456999999999,35447.978000000003,41400.209000000003,45868.288,49966.898999999998,51633.341,57548.125999999997,68044.906000000003,80811.298999999999,90824.969000000012,92507.287104000017,102401.46866500001,111062.43869699999," "," "," "," "," "," "," "," "]
[null,"Generación",136018.34900000002,141883.723,143190.52000000002,141826.85099999997,145731,149326.084,156671.10199999998,167195.57199999999,172237.19400000002,182259.56400000001,195456.97600000002,206288.655,213189.02100000001,229253.75,243610.20300000001,253884.405,263601.84999999998,272618.51300000004,280047.75099999999,264540.41500000004,273317.41171799996,264333.66354199999,268554.817415,259876.74262599999,253264.60391099998,253951.23455100003,248100.01532599999,248122.25110900003,184114.93346299999,"-","-","-"]
[null,"Consumos en bombeo",-1039.2719999999997,-1432.7330000000002,-2790.7050000000004,-1887.5589999999997,-1345.3890000000001,-2081.7260000000001,-1522.6180000000002,-1760.8889999999997,-2587.7539999999999,-3666.38,-4906.8859999999995,-4131.264000000001,-6956.6819999999998,-4678.134,-4604.7070000000003,-6356.9470000000001,-5348.3729999999996,-4432.2870000000003,-3802.502,-3794.1889999999999,-4457.7825769999999,-3241.4938166299999,-5059.130999598,-5955.7760918139993,-5385.7688595580003,-4512.2514306059993,-4827.5850676680011,-3607.5809876580001,-2443.2154947749996,"-","-","-"]
[null,"Enlace Península-Baleares","-","-","-","-","-","-","-","-","-","-","-","-","-","-","-","-","-","-","-","-","-",-0.66324899999999998,-575.56301800000006,-1268.5085999999999,-1298.258934,-1335.7925440000001,-1250.5839679999999,-1179.306642,-963.70680900000002,"-","-","-"]
[null,"Saldo intercambios internacionales",-419.57900000000012,-676.58600000000001,641.12400000000002,1267.0719999999997,1855.105,4489.0450000000001,1059.3659999999998,-3072.8720000000003,3401.864,5719.244999999999,4440.5950000000003,3457.9599999999996,5328.768,1263.9020000000003,-3027.0179999999996,-1343.394,-3272.518,-5750.4650000000001,-11039.585999999999,-8086.4139999999998,-8332.6790579999997,-6090.1263339999996,-11199.953591,-6732.1324500000001,-3406.1240240000002,-133.16316299999994,7658.0436910000008,9168.9935229999992,10300.914304,"-","-","-"]
[null,"Demanda transporte (b.c.)",134559.49800000002,139774.40399999998,141040.93900000004,141206.36399999994,146240.71600000001,151733.40300000002,156207.85,162361.81099999999,173051.30400000003,184312.429,194990.68500000003,205615.351,211561.10700000002,225839.51800000001,235978.478,246184.06399999998,254980.95899999997,262435.761,265205.663,252659.81200000003,260526.95008299997,255001.38014236998,251720.169806402,245920.32548418597,243174.45209344197,247970.02741339404,249679.889981332,252504.35700234203,191008.92546322499,"-","-","-"]
[]
[null,"Balance eléctrico anual Islas Baleares (MWh)",2006,2007,2008,2009,2010,2011,2012,2013,2014,2015,2016,2017,2018,2019,2020,2021]
[null,"Carbón",3077310,2943855,3098826,3170463,3101357.5659999996,2764984.5290000006,2682567.2370000002,2350640.4040000001,2187777.7260000003,1861683.0870000001,2302867.9710000004,2598502.4430000004,1914447.2919999999,"-","-","-"]
[null,"Motores diesel",964902,1005606,1047081,971825,1027620.046,923462.36399999994,933288.9,738661.98199999996,666783.55999999994,724983.97100000002,961260.82,795987.56,502130.72899999999,"-","-","-"]
[null,"Turbina de gas",292054.95199999999,311441,272502,339369,299414.36599999998,350604.37099999998,340449.78,514338.98800000001,585387.88199999998,586589.29900000012,339758.26499999996,556524.57400000002,643242.902,"-","-","-"]
[null,"Fuel + Gas",1256956.952,1317047,1319583,1311194,1327034.412,1274066.7349999999,1273738.6800000002,1253000.97,1252171.4419999998,1311573.27,1301019.085,1352512.1339999998,1145373.6310000001,"-","-","-"]
[null,"Ciclo combinado",1341915,1583995,1523490,1292183,1135633.7220000001,1323108.338,885979.71200000006,407330.72799999994,419633.12,804686.98600000003,535082.09499999997,420429.35599999997,396627.5120000001,"-","-","-"]
[null,"Generación auxiliar",6350.2199999999721,12612,5931,5566,6694.3319999999994,8721.7180000000008,8807.9369999999981,6759.8550000000014,7694.0940000000001,10578.49,10092.819,14746.465,12535.229000000001,"-","-","-"]
[null,"Régimen ordinario",5682532.1719999993,5857509,5947830,5779406,5570720.0320000006,5370881.3200000003,4851093.5660000006,4017731.9569999999," "," "," "," "," "," "," "," "]
[null,"Eólica",4877.3560000000007,5656,5497,5543,5571,5785.915,6504.6989999999996,6159.4680000000008,5839.5779999999995,5318.2280000000001,5416.058,2924.2759999999998,2162.5140000000001,"-","-","-"]
[null,"Solar fotovoltaica",1100.7949999999998,1952,28380,80933,87757,101810.916,115593.26899999997,122112.85199999998,122765.68900000001,122619.80299999999,120507.53,123336.93899999998,91990.467999999993,"-","-","-"]
[null,"Térmica renovable/Otras renovables",0,0,0,0,0,87.793000000000006,569.82999999999993,505.69299999999998,1945.6589999999999,1971.549,1309.7150000000001,1626.7410000000002,1072.0360000000001,"-","-","-"]
[null,"Térmica no renovable/Cogeneración y resto/Cogeneración",139112.84899999999,113933,140332,127042,176244,13333.673999999999,26496.670000000002,25720.821999999996,25222.583999999995,31549.726999999995,34701.317000000003,36244.234000000004,25996.880999999998,"-","-","-"]
[null,"Residuos no renovables"," "," "," "," "," ",123712.03350000001,122789.53600000001,113066.595,128084.32949999999,151097.72949999999,130805.0665,143878.66800000001,101701.76650000001,"-","-","-"]
[null,"Residuos renovables"," "," "," "," "," ",123712.03350000001,122789.53600000001,113066.595,128084.32949999999,151097.72949999999,130805.0665,143878.66800000001,101701.76650000001,"-","-","-"]
[null,"Régimen especial",145091,121541,174209,213518,269572,368442.36499999999,394743.54,380632.02499999991," "," "," "," "," "," "," "," "]
[null,"Generación",5827623.1719999993,5979050,6122039,5992924,5840292.0320000006,5739323.6849999996,5245837.1060000015,4398363.9819999998,4279218.551,4452176.5990000004,4572606.7230000002,4838079.9239999996,3793609.0959999994,"-","-","-"]
[null,"Enlace Península-Baleares","-","-","-","-","-",663.24900000000002,575563.01800000004,1268508.5999999999,1298258.9339999999,1335792.544,1250583.9679999999,1179306.642,963706.80900000012,"-","-","-"]
[null,"Demanda transporte (b.c.)",5827623.1719999993,5979050,6122039,5992924,5840292.0320000006,5739986.9339999994,5821400.1240000017,5666872.5819999995,5577477.4849999994,5787969.1430000002,5823190.6909999996,6017386.5659999996,4757315.9049999993,"-","-","-"]
[null,null,null,null,null,null,null,0,0,0,0,0,0,0,0]
[null,"Balance eléctrico anual Islas Canarias (MWh)",2006,2007,2008,2009,2010,2011,2012,2013,2014,2015,2016,2017,2018,2019,2020,2021]
[null,"Hidráulica",0,0,0,0,0,-21.155000000000001,-22.201999999999998,-18.221,3461.0559999999996,3568.393,3453.9609999999993,3271.9790000000003,2393.7060000000001,"-","-","-"]
[null,"Motores diesel",2007664,2042002,2103766,2140699,2183387.7719999999,2161308.3939999994,2108442.9610000001,2066569.1229999999,2138198.4350000001,2202337.5219999999,2222301.5430000005,2242328.7749999999,1589981.4339999999,"-","-","-"]
[null,"Turbina de gas",824431.12,699470,473526,342172.054,343281.65700000001,528797.92800000007,598670.31000000006,368830.79299999995,360744.29499999998,327805.27100000001,275900.62400000001,314281.59499999997,214646.07099999997,"-","-","-"]
[null,"Turbina de  vapor",3429991,3306805,3414241,3243628,2972587.1049999995,2634295.1170000006,2681695.9269999997,2463796.9990000003,2070771.4279999998,2222950.5670000003,2536143.003,2674344.3740000003,1822238.6639999999,"-","-","-"]
[null,"Fuel + Gas",6262086.1200000001,6048277,5991533,5726499.0539999995,5499256.534,5324401.4390000002,5388809.1979999999,4899196.915,4569714.1579999998,4753094.3599999994,5034345.17,5230954.743999999,3626866.1690000002,"-","-","-"]
[null,"Ciclo combinado",2007397,2443275,2573317,2552328,2708410.1850000001,2914626.4579999996,2870324.4979999997,2946150.3710000003,3240591.696,3188056.7890000003,3008333.7410000004,2997377.2830000003,2203269.6079999995,"-","-","-"]
[null,"Generación auxiliar",0,132840,89747,33788,0,0,0,0,0,0,0,0,0,"-","-","-"]
[null,"Régimen ordinario",8269483.1200000001,8624392,8654597,8312615.0540000005,8207666.7189999996,8239006.7419999996,8259111.4939999999,7845329.0650000004," "," "," "," "," "," "," "," "]
[null,"Hidroeólica","-","-","-","-","-","-","-","-",728.83699999999999,8207.4240000000009,17891.935999999998,20233.057000000001,20971.712,"-","-","-"]
[null,"Hidráulica/Resto hidráulica",0,1176,1673,398,0,1675.9260000000002,1791.3010000000002,3049.5040000000004," "," "," "," "," "," "," "," "]
[null,"Eólica",326063.57899999997,356840,396475,358707,331363,355677.76100000006,361767.32500000007,362733.48499999999,389528.80599999998,396687.14299999998,393080.58299999998,395927.34799999994,522850.19500000001,"-","-","-"]
[null,"Solar fotovoltaica",2915.5499999999997,19373,63500,162330,195166,232999.19000000006,256513.386,286703.31700000004,282285.68899999995,275546.60499999998,277661.34299999999,273622.21100000001,217902.77399999998,"-","-","-"]
[null,"Térmica renovable/Otras renovables",218199.68400000001,213283,217219,273055,160561,8815.9460000000017,8050.4470000000001,8502.5880000000016,8806.5839999999989,8053.625,9335.7749999999996,9565.259,6368.558,"-","-","-"]
[null,"Térmica no renovable/Cogeneración y resto/Cogeneración",2832.1869999999999,0,0,20,0,24807.366000000002,0,0,0,0,0,0,0,"-","-","-"]
[null,"Régimen especial",550011,590672,678867,794510,687090,623976.18900000013,628122.45900000015,660988.89400000009," "," "," "," "," "," "," "," "]
[null,"Generación",8819494.120000001,9215064,9333464,9107125.0540000014,8894756.7190000005,8862982.9309999999,8887233.9530000016,8506317.9589999989,8495116.8259999994,8633213.3389999997,8744102.5089999996,8930951.8809999991,6600622.722000001,"-","-","-"]
[null,"Demanda transporte (b.c.)",8819494.120000001,9215064,9333464,9107125.0540000014,8894756.7190000005,8862982.9309999999,8887233.9530000016,8506317.9589999989,8495116.8259999994,8633213.3389999997,8744102.5089999996,8930951.8809999991,6600622.722000001,"-","-","-"]
[]
[null,"Balance eléctrico anual Ceuta (MWh)",2007,2008,2009,2010,2011,2012,2013,2014,2015,2016,2017,2018,2019,2020]
[null,"Motores diesel",202644,209671,208316,214666.24400000001,202666.87700000001,211510.78899999999,201705.39200000002,212152.62499999997,203257.30900000001,210557.99200000003,202648.20499999996,154798.79699999999,"-","-"]
[null,"Turbina de gas",0,0,3253,2868.8669999999997,306.01600000000002,561.12199999999996,259.54299999999995,92.531999999999996,765.78100000000006,122.944,212.49499999999998,23.392000000000003,"-","-"]
[null,"Fuel + Gas",202644,209671,211569,217535.111,202972.89300000001,212071.91099999999,201964.93500000003,212245.15699999998,204023.09,210680.93600000005,202860.69999999998,154822.18900000001,"-","-"]
[null,"Régimen ordinario",202644,209671,211569,217535.111,202972.89300000001,212071.91099999999,201964.93500000003," "," "," "," "," "," "," "]
[null,"Generación",202644,209671,211569,217535.111,202972.89299999998,212071.91099999996,201964.935,212245.15700000001,204023.09,210680.93600000005,202860.69999999998,154822.18900000001,"-","-"]
[null,"Demanda transporte (b.c.)",202644,209671,211569,217535.111,202972.89299999998,212071.91099999996,201964.935,212245.15700000001,204023.09,210680.93600000005,202860.69999999998,154822.18900000001,"-","-"]
[]
[null,"Balance eléctrico anual Melilla (MWh)",2007,2008,2009,2010,2011,2012,2013,2014,2015,2016,2017,2018,2019,2020]
[null,"Motores diesel",181867.74,193125,197553,204717.97099999996,207238.52499999997,214800.20499999996,201456.99900000001,200050.45799999998,203917.10199999998,198250.31599999996,200316.96400000004,152640.27499999999,"-","-"]
[null,"Turbina de gas",2412.2599999999998,3081,545,498.45600000000002,533.90800000000002,140.22,93.680999999999997,766.31,611.49799999999993,255.46899999999999,77.272999999999996,66.391000000000005,"-","-"]
[null,"Fuel + gas",184280,196206,198098,205216.42699999997,207772.43299999996,214940.42499999996,201550.68000000002,200816.76799999998,204528.60000000003,198505.78499999997,200394.23700000002,152706.666,"-","-"]
[null,"Régimen ordinario",184280,196206,198098,205216.42699999997,207772.43299999996,214940.42499999996,201550.68000000002," "," "," "," "," "," "," "]
[null,"Solar fotovoltaica",0,6,122,67,71.472000000000008,83.11399999999999,82.322999999999993,83.832999999999998,79.959999999999994,80.09999999999998,76.868999999999986,53.334000000000003,"-","-"]
[null,"Térmica no renovable/Cogeneración y resto/Cogeneración",8740,4842,7735,8028,0,0,0,0,"-","-","-","-","-","-"]
[null,"Residuos no renovables","-","-","-","-",3517.6105000000002,1154.479,4018.8984999999993,4449.1570000000002,4296.4980000000005,4850.0525000000016,4976.9860000000008,4246.1190000000006,"-","-"]
[null,"Residuos renovables","-","-","-","-",3517.6105000000002,1154.479,4018.8984999999993,4449.1570000000002,4296.4980000000005,4850.0525000000016,4976.9860000000008,4246.1190000000006,"-","-"]
[null,"Régimen especial",8740,4848,7857,8095,7106.6930000000011,2392.0720000000001,8120.119999999999," "," "," "," "," "," "," "]
[null,"Generación",193020,201054,205955,213311.42699999997,214879.12599999996,217332.497,209670.80000000002,209798.91500000004,213201.55600000001,208285.99,210425.07800000001,161252.23800000001,"-","-"]
[null,"Demanda transporte (b.c.)",193020,201054,205955,213311.42699999997,214879.12599999996,217332.497,209670.80000000002,209798.91500000004,213201.55600000001,208285.99,210425.07800000001,161252.23800000001,"-","-"]
[]
[null,"Balance eléctrico anual nacional (GWh)",2007,2008,2009,2010,2011,2012,2013,2014,2015,2016,2017,2018,2019,2020]
[null,"Hidráulica",22978.978099999993,18295.638600000002,20732.3027,35009.454188100004,25041.262734210006,15945.697039297998,30098.378502939999,39181.985215204004,28382.579963850003,36114.888326772001,18449.166495660003,27983.921136085999,"-","-"]
[null,"Turbinación bombeo",3102.6008999999999,2661.7513999999996,2655.9322999999999,3120.4478038999996,2183.53623079,3201.889743702,3289.6771840599995,3415.9960267959996,2895.3657881499998,3134.3289102280005,2248.9644183400001,1516.8344439140001,"-","-"]
[null,"Nuclear",52638.926999999996,56460.290999999997,50549.445000000007,59242.321647000004,55005.874867000006,58595.438798999996,54210.788118999997,54781.281335,54661.803305000009,56021.682058999999,55539.561502000004,39930.403362999998,"-","-"]
[null,"Carbón",70630.103000000003,46508.363000000005,34793.025000000001,23700.613399999998,43177.464376999997,53779.891173000004,39441.537715999999,43246.056496999998,52616.477597999998,37313.777751000001,45020.615777999999,26732.428116999999,"-","-"]
[null,"Fuel + Gas",9988.4650000000001,9887.5660000000007,9276.3040540000002,8821.7598159999998,7007.9228750000002,7094.5555099999992,6560.4606399999993,6241.8218880000004,6483.8144279999979,6754.6440300000004,7001.4682789999979,5092.3038830000005,"-","-"]
[null,"Ciclo combinado",70600.137999999992,93197.539000000004,80223.794999999998,66798.98415199999,53430.948742000008,41073.093881000001,27480.038403999999,24780.733440999997,29027.289334999998,29006.482093999999,37065.792493000001,20443.506155000003,"-","-"]
[null,"Régimen ordinario",229939.212,227011.14899999998,198230.80405400001,196693.581007,185847.00982600002,179690.56614600003,161080.88056599998]
[null,"Hidroeólica"," "," "," "," "," "," "," ",0.72883699999999996,8.2074240000000014,17.891935999999998,20.233057000000002,20.971712,"-","-"]
[null,"Hidráulica/Resto hidráulica",4126.5010000000002,4639.8159999999998,5454.0710000000008,6824.32,5396.055437,4707.8695950000001,7287.0583109999998]
[null,"Eólica",27611.650999999998,32159.822000000007,38252.826999999997,43545.33,42477.250769000006,48524.529970999996,54713.393735000005,51032.030848000009,48117.887515999995,47696.660308999999,47907.283440000007,36275.136803000001,"-","-"]
[null,"Solar fotovoltaica",483.90199999999999,2497.9560000000001,6072.3899999999994,6422.7719999999999,7440.7523799999999,8202.259145,8327.2745960000011,8207.9261310000002,8243.5609049999985,7977.4671849999995,8397.1067059999987,6313.7159680000004,"-","-"]
[null,"Solar térmica",7.6269999999999998,15.378,129.82299999999998,691.62,1861.6415489999997,3447.4936120000002,4441.5275350000002,4958.9149259999995,5085.235514,5071.2017019999994,5347.9181920000001,3943.681521,"-","-"]
[null,"Térmica renovable/Otras renovables",2588.9679999999998,2868.7079999999996,3317.3420000000001,3332.3599999999997,3714.0342679999999,3791.0834190000005,4334.2854390000002,3816.3157169999999,3432.5919209999997,3425.6648279999999,3609.9418260000002,2663.4182989999999,"-","-"]
[null,"Térmica no renovable/Cogeneración y resto/Cogeneración",23450.429999999997,26721.149999999998,28600.731,30973.324000000004,30593.251723999998,32444.285103000006,30835.664588999996,24153.243881999999,25200.877766000005,25908.643558999996,28211.540875000002,21450.932514,"-","-"]
[null,"Residuos no renovables"," "," "," "," ",1287.7704800000004,1589.4158940000002,1617.2360285,1965.8770435000001,2480.1089684999997,2606.9637644999998,2607.9695430000002,1817.2820240000001,"-","-"]
[null,"Residuos renovables"," "," "," "," ",736.05574399999989,719.78999700000008,555.73950249999996,678.0715725,818.04970249999997,785.39502949999996,877.00608699999998,640.70376899999997,"-","-"]
[null,"Régimen especial",58269.078999999998,68902.83,81827.183999999994,91789.72600000001,93506.812351000015,103426.726736,112112.17973600001]
[null,"Generación",288208.29099999997,295913.97899999999,280057.98805400002,288483.30700700002,279353.82217699999,283117.29288200004,273193.06030200003,266460.98335999995,267453.85013500002,261835.69148399998,262304.568692,194825.23970800004,"-","-"]
[null,"Consumos en bombeo",-4432.2870000000003,-3802.502,-3794.1889999999999,-4457.7825769999999,-3241.4938166299999,-5059.130999598,-5955.7760918139993,-5385.7688595580003,-4512.2514306059993,-4827.5850676680011,-3607.5809876580001,-2443.2154947749996,"-","-"]
[null,"Saldo intercambios internacionales",-5750.4650000000001,-11039.585999999999,-8086.4139999999998,-8332.6790579999997,-6090.1263339999996,-11199.953591,-6732.1324500000001,-3406.1240240000002,-133.16316299999994,7658.0436910000008,9168.9935229999992,10300.914304,"-","-"]
[null,"Demanda transporte (b.c.)",278025.53899999993,281071.891,268177.38505400001,275692.84537200007,270022.20202637004,266858.20829140203,260505.15176018604,257669.09047644195,262808.43554139399,264666.15010733198,267865.98122734198,202682.93851722503,"-","-"]

{"sheet":"Mozart Reports","index":14,"n_rows":6,"n_cols":2,"rows_kept":6,"cut":false,"hidden":true,"merged":[]}
[5,"4bb814b188c449799d30b5ac3ccb56c3"]
["<mi app=\"e\" ver=\"22\"><rptloc guid=\"13af3534735e4c4ca05137df4b7861a7\" rank=\"0\" ds=\"1\"><ri hasPG=\"0\" name=\"Serie mensual Balance Ceuta\" id=\"6F2CD6824FBB0B41F382AAA8194FBE87\" path=\"Objetos públicos\\Informes\\Informes macros\\Series Estadisticas\\Serie mensual Balance Ceuta\" cf=\"0\" prompt=\"1\" ve=\"0\" vm=\"0\" flashpth=\"d:\\Usuarios\\RODORTJO\\AppData\\Local\\Temp\\1\\\" fimagepth=\"d:\\Usuarios\\RODORTJO\\AppData\\Local\\Temp\\1\\\" swfn=\"DashboardViewer.swf\" fvars=\"\" dvis=\"\"><ans /><ci ps=\"BI\" srv=\"apcpr64b\" prj=\"BDEbi\" prjid=\"D066E1C611E6257C10D00080EF253B44\" li=\"RODORTJO\" am=\"s\" /><lu ut=\"10/09/2018 09:08:05\" si=\"2.0000000124028323805efda0ab8a16c037829c4df8da8d6c6457d53234911da9999b80cbd0ced326b54dd5fc6ef78a540800104f3efc46dfdf489c2e7f9fbd0eacdf34e68f0309ac91cc31db96120efe2b7ccfc6b934382bb055480a57cef8281ec5e307f867ba580d603fb73a9690fbc215d82d7c952c4c2f063444b3b9bff886f2.3082.0.1.Europe/Madrid.upriv*_1*_pidn2*_1*_session*-lat*_1.00000001618bda47b77f67759975db0c2399dc3f93bcab4f96754efe1130489796470d0e555f55489acf57ee0737a48676b40ad8597f1a1d.00000001495fa96992d17abd5dd2f227a272e40fbf8b3a3307c8194d00725d7321eebcd5e7688f42d44ebe4c5c243ff35da887fadf571ce4.0.1.1.BDEbi.D066E1C611E6257C10D00080EF253B44.0-3082.1.1_-0.1.0_-3082.1.1_5.5.0.*0.00000001e95a7c59765d6aff098005cf502eb763c911585a47a8ee1ceeeaa47c76162f916868e333.0.10*.25*.15*.214.23.10*.4*.0400*.0074J.e.000000014c3f63c3a38e8ce2c259de411dfb5465c911585a2f796800bec52298917355475f99b4c0.0\" msgID=\"55F22C2E11E8CBA27BE70080EFB5621A\" /></ri><do pa=\"6\" cfmt=\"0\" fmt=\"1\" saf=\"0\" hd=\"0\" afg=\"1\" rafg=\"1\" arh=\"1\" gosdo=\"0\" cwd=\"1\" ab=\"0\" af=\"1\" om=\"0\" ag=\"0\" lck=\"0\" ppt=\"3\" wpt=\"3\" dai=\"0\" rscd=\"1\" rsrgb=\"1\" rsrl=\"1\" cit=\"2\" c2d=\"1\" cdf=\"0\" cdt=\"0\" dtlk=\"1\" gaf=\"17\" fqg=\"0\" xqg=\"0\" don=\"0\" dcom=\"0\" oaw=\"0\" tws=\"0\" ssm=\"1\" ssn=\"MSTRStyle.Todos\" glo=\"11101\" pgsel=\"4\" phdr=\"1\" rdc=\"0\" adt=\"0\" rsoox=\"0\" eco=\"1\" ecfw=\"400\" ecfh=\"300\" ecfsu=\"1\" ecwr=\"100\" echr=\"100\" eclar=\"1\" ecrups=\"1\"><details dbit=\"11169976358211\" dsel=\"239\" /></do><excel><epo ews=\"BDE\" ece=\"A77\" enr=\"MSTR.Serie_mensual_Balance_Ceuta\" ptn=\"\" qtn=\"\" rows=\"7\" cols=\"94\" /><esdo ews=\"\" ece=\"\" ptn=\"\" /></excel><pgs><pg rows=\"4\" cols=\"93\" nrr=\"24\" nrc=\"553\"><pg /><bls><bl sr=\"1\" sc=\"1\" rfetch=\"4\" cfetch=\"93\" posid=\"1\" darows=\"0\" dacols=\"1\"><excel><epo ews=\"BDE\" ece=\"A77\" enr=\"MSTR.Serie_mensual_Balance_Ceuta\" ptn=\"\" qtn=\"\" rows=\"7\" cols=\"94\" /><esdo ews=\"\" ece=\"\" ptn=\"\" /></excel><gridRng><sect id=\"TITLE_AREA\" rngprop=\"1:1:3:1\" /><sect id=\"ROWHEADERS_AREA\" rngprop=\"4:1:4:1\" /><sect id=\"COLUMNHEADERS_AREA\" rngprop=\"1:2:3:93\" /><sect id=\"DATA_AREA\" rngprop=\"4:2:4:93\" /></gridRng><shapes /></bl></bls></pg></pgs></rptloc></mi>"]
["<mi app=\"e\" ver=\"22\"><rptloc guid=\"e59ff9b2b5394000907d97b26d4ae788\" rank=\"0\" ds=\"1\"><ri hasPG=\"0\" name=\"Serie mensual Balance Melilla\" id=\"F47A0BA049B29C2D1C7978B503DCBE43\" path=\"Objetos públicos\\Informes\\Informes macros\\Series Estadisticas\\Serie mensual Balance Melilla\" cf=\"0\" prompt=\"1\" ve=\"0\" vm=\"0\" flashpth=\"d:\\Usuarios\\RODORTJO\\AppData\\Local\\Temp\\1\\\" fimagepth=\"d:\\Usuarios\\RODORTJO\\AppData\\Local\\Temp\\1\\\" swfn=\"DashboardViewer.swf\" fvars=\"\" dvis=\"\"><ans /><ci ps=\"BI\" srv=\"apcpr64b\" prj=\"BDEbi\" prjid=\"D066E1C611E6257C10D00080EF253B44\" li=\"RODORTJO\" am=\"s\" /><lu ut=\"10/09/2018 09:08:07\" si=\"2.0000000124028323805efda0ab8a16c037829c4df8da8d6c6457d53234911da9999b80cbd0ced326b54dd5fc6ef78a540800104f3efc46dfdf489c2e7f9fbd0eacdf34e68f0309ac91cc31db96120efe2b7ccfc6b934382bb055480a57cef8281ec5e307f867ba580d603fb73a9690fbc215d82d7c952c4c2f063444b3b9bff886f2.3082.0.1.Europe/Madrid.upriv*_1*_pidn2*_1*_session*-lat*_1.00000001618bda47b77f67759975db0c2399dc3f93bcab4f96754efe1130489796470d0e555f55489acf57ee0737a48676b40ad8597f1a1d.00000001495fa96992d17abd5dd2f227a272e40fbf8b3a3307c8194d00725d7321eebcd5e7688f42d44ebe4c5c243ff35da887fadf571ce4.0.1.1.BDEbi.D066E1C611E6257C10D00080EF253B44.0-3082.1.1_-0.1.0_-3082.1.1_5.5.0.*0.00000001e95a7c59765d6aff098005cf502eb763c911585a47a8ee1ceeeaa47c76162f916868e333.0.10*.25*.15*.214.23.10*.4*.0400*.0074J.e.000000014c3f63c3a38e8ce2c259de411dfb5465c911585a2f796800bec52298917355475f99b4c0.0\" msgID=\"560480B811E8CBA27BE70080EF45831C\" /></ri><do pa=\"6\" cfmt=\"0\" fmt=\"1\" saf=\"0\" hd=\"0\" afg=\"1\" rafg=\"1\" arh=\"1\" gosdo=\"0\" cwd=\"1\" ab=\"0\" af=\"1\" om=\"0\" ag=\"0\" lck=\"0\" ppt=\"3\" wpt=\"3\" dai=\"0\" rscd=\"1\" rsrgb=\"1\" rsrl=\"1\" cit=\"2\" c2d=\"1\" cdf=\"0\" cdt=\"0\" dtlk=\"1\" gaf=\"17\" fqg=\"0\" xqg=\"0\" don=\"0\" dcom=\"0\" oaw=\"0\" tws=\"0\" ssm=\"1\" ssn=\"MSTRStyle.Todos\" glo=\"11101\" pgsel=\"4\" phdr=\"1\" rdc=\"0\" adt=\"0\" rsoox=\"0\" eco=\"1\" ecfw=\"400\" ecfh=\"300\" ecfsu=\"1\" ecwr=\"100\" echr=\"100\" eclar=\"1\" ecrups=\"1\"><details dbit=\"11169976358211\" dsel=\"239\" /></do><excel><epo ews=\"BDE\" ece=\"A87\" enr=\"MSTR.Serie_mensual_Balance_Melilla\" ptn=\"\" qtn=\"\" rows=\"10\" cols=\"94\" /><esdo ews=\"\" ece=\"\" ptn=\"\" /></excel><pgs><pg rows=\"7\" cols=\"93\" nrr=\"42\" nrc=\"553\"><pg /><bls><bl sr=\"1\" sc=\"1\" rfetch=\"7\" cfetch=\"93\" posid=\"1\" darows=\"0\" dacols=\"1\"><excel><epo ews=\"BDE\" ece=\"A87\" enr=\"MSTR.Serie_mensual_Balance_Melilla\" ptn=\"\" qtn=\"\" rows=\"10\" cols=\"94\" /><esdo ews=\"\" ece=\"\" ptn=\"\" /></excel><gridRng><sect id=\"TITLE_AREA\" rngprop=\"1:1:3:1\" /><sect id=\"ROWHEADERS_AREA\" rngprop=\"4:1:7:1\" /><sect id=\"COLUMNHEADERS_AREA\" rngprop=\"1:2:3:93\" /><sect id=\"DATA_AREA\" rngprop=\"4:2:7:93\" /></gridRng><shapes /></bl></bls></pg></pgs></rptloc></mi>"]
["<mi app=\"e\" ver=\"22\"><rptloc guid=\"90f221476e2f44209624066d52a5f0d1\" rank=\"0\" ds=\"1\"><ri hasPG=\"0\" name=\"Serie mensual Balance Peninsular\" id=\"96A0EAFC4AE8A78EF67C2F993551FF61\" path=\"Objetos públicos\\Informes\\Informes macros\\Series Estadisticas\\Serie mensual Balance Peninsular\" cf=\"0\" prompt=\"1\" ve=\"0\" vm=\"0\" flashpth=\"d:\\Usuarios\\RODORTJO\\AppData\\Local\\Temp\\1\\\" fimagepth=\"d:\\Usuarios\\RODORTJO\\AppData\\Local\\Temp\\1\\\" swfn=\"DashboardViewer.swf\" fvars=\"\" dvis=\"\"><ans /><ci ps=\"BI\" srv=\"apcpr64b\" prj=\"BDEbi\" prjid=\"D066E1C611E6257C10D00080EF253B44\" li=\"RODORTJO\" am=\"s\" /><lu ut=\"10/09/2018 09:09:17\" si=\"2.0000000124028323805efda0ab8a16c037829c4df8da8d6c6457d53234911da9999b80cbd0ced326b54dd5fc6ef78a540800104f3efc46dfdf489c2e7f9fbd0eacdf34e68f0309ac91cc31db96120efe2b7ccfc6b934382bb055480a57cef8281ec5e307f867ba580d603fb73a9690fbc215d82d7c952c4c2f063444b3b9bff886f2.3082.0.1.Europe/Madrid.upriv*_1*_pidn2*_1*_session*-lat*_1.00000001618bda47b77f67759975db0c2399dc3f93bcab4f96754efe1130489796470d0e555f55489acf57ee0737a48676b40ad8597f1a1d.00000001495fa96992d17abd5dd2f227a272e40fbf8b3a3307c8194d00725d7321eebcd5e7688f42d44ebe4c5c243ff35da887fadf571ce4.0.1.1.BDEbi.D066E1C611E6257C10D00080EF253B44.0-3082.1.1_-0.1.0_-3082.1.1_5.5.0.*0.00000001e95a7c59765d6aff098005cf502eb763c911585a47a8ee1ceeeaa47c76162f916868e333.0.10*.25*.15*.214.23.10*.4*.0400*.0074J.e.000000014c3f63c3a38e8ce2c259de411dfb5465c911585a2f796800bec52298917355475f99b4c0.0\" msgID=\"55E13A4111E8CBA27BE70080EF05031B\" /></ri><do pa=\"6\" cfmt=\"0\" fmt=\"1\" saf=\"0\" hd=\"0\" afg=\"1\" rafg=\"1\" arh=\"1\" gosdo=\"0\" cwd=\"1\" ab=\"0\" af=\"1\" om=\"0\" ag=\"0\" lck=\"0\" ppt=\"3\" wpt=\"3\" dai=\"0\" rscd=\"1\" rsrgb=\"1\" rsrl=\"1\" cit=\"2\" c2d=\"1\" cdf=\"0\" cdt=\"0\" dtlk=\"1\" gaf=\"17\" fqg=\"0\" xqg=\"0\" don=\"0\" dcom=\"0\" oaw=\"0\" tws=\"0\" ssm=\"1\" ssn=\"MSTRStyle.Todos\" glo=\"11101\" pgsel=\"4\" phdr=\"1\" rdc=\"0\" adt=\"0\" rsoox=\"0\" eco=\"1\" ecfw=\"400\" ecfh=\"300\" ecfsu=\"1\" ecwr=\"100\" echr=\"100\" eclar=\"1\" ecrups=\"1\"><details dbit=\"11169976358211\" dsel=\"239\" /></do><excel><epo ews=\"BDE\" ece=\"A7\" enr=\"MSTR.Serie_mensual_Balance_Peninsular\" ptn=\"\" qtn=\"\" rows=\"21\" cols=\"94\" /><esdo ews=\"\" ece=\"\" ptn=\"\" /></excel><pgs><pg rows=\"18\" cols=\"93\" nrr=\"216\" nrc=\"853\"><pg><attEl aeid=\"BB:5EAE1F1D48ED4011B00BAC90762C13F0:1:2:0:2:1:3:1:Península\" aedn=\"Península\" aen=\"Sistema Eléctrico\" /><attEl aeid=\"BB:AB973FBD4D0CA7EE4892009A2825B4C6:1:2:0:2:1:3:3:PUBLICADO\" aedn=\"PUBLICADO\" aen=\"Versión\" /></pg><bls><bl sr=\"1\" sc=\"1\" rfetch=\"18\" cfetch=\"93\" posid=\"1\" darows=\"0\" dacols=\"1\"><excel><epo ews=\"BDE\" ece=\"A7\" enr=\"MSTR.Serie_mensual_Balance_Peninsular\" ptn=\"\" qtn=\"\" rows=\"21\" cols=\"94\" /><esdo ews=\"\" ece=\"\" ptn=\"\" /></excel><gridRng><sect id=\"TITLE_AREA\" rngprop=\"1:1:3:1\" /><sect id=\"ROWHEADERS_AREA\" rngprop=\"4:1:18:1\" /><sect id=\"COLUMNHEADERS_AREA\" rngprop=\"1:2:3:93\" /><sect id=\"DATA_AREA\" rngprop=\"4:2:18:93\" /></gridRng><shapes /></bl></bls></pg></pgs></rptloc></mi>"]
["<mi app=\"e\" ver=\"22\"><rptloc guid=\"95b8c730cb95430298fde918f076b6cf\" rank=\"0\" ds=\"1\"><ri hasPG=\"0\" name=\"Serie mensual Balance Baleares\" id=\"DEC196524A40A58AC65C1DA090B9AE0E\" path=\"Objetos públicos\\Informes\\Informes macros\\Series Estadisticas\\Serie mensual Balance Baleares\" cf=\"0\" prompt=\"1\" ve=\"0\" vm=\"0\" flashpth=\"d:\\Usuarios\\RODORTJO\\AppData\\Local\\Temp\\1\\\" fimagepth=\"d:\\Usuarios\\RODORTJO\\AppData\\Local\\Temp\\1\\\" swfn=\"DashboardViewer.swf\" fvars=\"\" dvis=\"\"><ans /><ci ps=\"BI\" srv=\"apcpr64b\" prj=\"BDEbi\" prjid=\"D066E1C611E6257C10D00080EF253B44\" li=\"RODORTJO\" am=\"s\" /><lu ut=\"10/09/2018 09:08:08\" si=\"2.0000000124028323805efda0ab8a16c037829c4df8da8d6c6457d53234911da9999b80cbd0ced326b54dd5fc6ef78a540800104f3efc46dfdf489c2e7f9fbd0eacdf34e68f0309ac91cc31db96120efe2b7ccfc6b934382bb055480a57cef8281ec5e307f867ba580d603fb73a9690fbc215d82d7c952c4c2f063444b3b9bff886f2.3082.0.1.Europe/Madrid.upriv*_1*_pidn2*_1*_session*-lat*_1.00000001618bda47b77f67759975db0c2399dc3f93bcab4f96754efe1130489796470d0e555f55489acf57ee0737a48676b40ad8597f1a1d.00000001495fa96992d17abd5dd2f227a272e40fbf8b3a3307c8194d00725d7321eebcd5e7688f42d44ebe4c5c243ff35da887fadf571ce4.0.1.1.BDEbi.D066E1C611E6257C10D00080EF253B44.0-3082.1.1_-0.1.0_-3082.1.1_5.5.0.*0.00000001e95a7c59765d6aff098005cf502eb763c911585a47a8ee1ceeeaa47c76162f916868e333.0.10*.25*.15*.214.23.10*.4*.0400*.0074J.e.000000014c3f63c3a38e8ce2c259de411dfb5465c911585a2f796800bec52298917355475f99b4c0.0\" msgID=\"55E139DD11E8CBA27BE70080EFC5831B\" /></ri><do pa=\"6\" cfmt=\"0\" fmt=\"1\" saf=\"0\" hd=\"0\" afg=\"1\" rafg=\"1\" arh=\"1\" gosdo=\"0\" cwd=\"1\" ab=\"0\" af=\"1\" om=\"0\" ag=\"0\" lck=\"0\" ppt=\"3\" wpt=\"3\" dai=\"0\" rscd=\"1\" rsrgb=\"1\" rsrl=\"1\" cit=\"2\" c2d=\"1\" cdf=\"0\" cdt=\"0\" dtlk=\"1\" gaf=\"17\" fqg=\"0\" xqg=\"0\" don=\"0\" dcom=\"0\" oaw=\"0\" tws=\"0\" ssm=\"1\" ssn=\"MSTRStyle.Todos\" glo=\"11101\" pgsel=\"4\" phdr=\"1\" rdc=\"0\" adt=\"0\" rsoox=\"0\" eco=\"1\" ecfw=\"400\" ecfh=\"300\" ecfsu=\"1\" ecwr=\"100\" echr=\"100\" eclar=\"1\" ecrups=\"1\"><details dbit=\"11169976358211\" dsel=\"239\" /></do><excel><epo ews=\"BDE\" ece=\"A37\" enr=\"MSTR.Serie_mensual_Balance_Baleares\" ptn=\"\" qtn=\"\" rows=\"17\" cols=\"94\" /><esdo ews=\"\" ece=\"\" ptn=\"\" /></excel><pgs><pg rows=\"14\" cols=\"93\" nrr=\"140\" nrc=\"681\"><pg><attEl aeid=\"BB:5EAE1F1D48ED4011B00BAC90762C13F0:1:2:0:2:1:3:4:Baleares\" aedn=\"Baleares\" aen=\"Sistema Eléctrico\" /><attEl aeid=\"BB:AB973FBD4D0CA7EE4892009A2825B4C6:1:2:0:2:1:3:3:PUBLICADO\" aedn=\"PUBLICADO\" aen=\"Versión\" /></pg><bls><bl sr=\"1\" sc=\"1\" rfetch=\"14\" cfetch=\"93\" posid=\"1\" darows=\"0\" dacols=\"1\"><excel><epo ews=\"BDE\" ece=\"A37\" enr=\"MSTR.Serie_mensual_Balance_Baleares\" ptn=\"\" qtn=\"\" rows=\"17\" cols=\"94\" /><esdo ews=\"\" ece=\"\" ptn=\"\" /></excel><gridRng><sect id=\"TITLE_AREA\" rngprop=\"1:1:3:1\" /><sect id=\"ROWHEADERS_AREA\" rngprop=\"4:1:14:1\" /><sect id=\"COLUMNHEADERS_AREA\" rngprop=\"1:2:3:93\" /><sect id=\"DATA_AREA\" rngprop=\"4:2:14:93\" /></gridRng><shapes /></bl></bls></pg></pgs></rptloc></mi>"]
["<mi app=\"e\" ver=\"22\"><rptloc guid=\"308c3eaec61b4e15bc09b15f200740d1\" rank=\"0\" ds=\"1\"><ri hasPG=\"0\" name=\"Serie mensual Balance Canarias\" id=\"0D4A433A4CF4D0C4C4E4E1BEA007E1BE\" path=\"Objetos públicos\\Informes\\Informes macros\\Series Estadisticas\\Serie mensual Balance Canarias\" cf=\"0\" prompt=\"1\" ve=\"0\" vm=\"0\" flashpth=\"d:\\Usuarios\\RODORTJO\\AppData\\Local\\Temp\\1\\\" fimagepth=\"d:\\Usuarios\\RODORTJO\\AppData\\Local\\Temp\\1\\\" swfn=\"DashboardViewer.swf\" fvars=\"\" dvis=\"\"><ans /><ci ps=\"BI\" srv=\"apcpr64b\" prj=\"BDEbi\" prjid=\"D066E1C611E6257C10D00080EF253B44\" li=\"RODORTJO\" am=\"s\" /><lu ut=\"10/09/2018 09:08:06\" si=\"2.0000000124028323805efda0ab8a16c037829c4df8da8d6c6457d53234911da9999b80cbd0ced326b54dd5fc6ef78a540800104f3efc46dfdf489c2e7f9fbd0eacdf34e68f0309ac91cc31db96120efe2b7ccfc6b934382bb055480a57cef8281ec5e307f867ba580d603fb73a9690fbc215d82d7c952c4c2f063444b3b9bff886f2.3082.0.1.Europe/Madrid.upriv*_1*_pidn2*_1*_session*-lat*_1.00000001618bda47b77f67759975db0c2399dc3f93bcab4f96754efe1130489796470d0e555f55489acf57ee0737a48676b40ad8597f1a1d.00000001495fa96992d17abd5dd2f227a272e40fbf8b3a3307c8194d00725d7321eebcd5e7688f42d44ebe4c5c243ff35da887fadf571ce4.0.1.1.BDEbi.D066E1C611E6257C10D00080EF253B44.0-3082.1.1_-0.1.0_-3082.1.1_5.5.0.*0.00000001e95a7c59765d6aff098005cf502eb763c911585a47a8ee1ceeeaa47c76162f916868e333.0.10*.25*.15*.214.23.10*.4*.0400*.0074J.e.000000014c3f63c3a38e8ce2c259de411dfb5465c911585a2f796800bec52298917355475f99b4c0.0\" msgID=\"55F22BCA11E8CBA27BE70080EFE5C41D\" /></ri><do pa=\"6\" cfmt=\"0\" fmt=\"1\" saf=\"0\" hd=\"0\" afg=\"1\" rafg=\"1\" arh=\"1\" gosdo=\"0\" cwd=\"1\" ab=\"0\" af=\"1\" om=\"0\" ag=\"0\" lck=\"0\" ppt=\"3\" wpt=\"3\" dai=\"0\" rscd=\"1\" rsrgb=\"1\" rsrl=\"1\" cit=\"2\" c2d=\"1\" cdf=\"0\" cdt=\"0\" dtlk=\"1\" gaf=\"17\" fqg=\"0\" xqg=\"0\" don=\"0\" dcom=\"0\" oaw=\"0\" tws=\"0\" ssm=\"1\" ssn=\"MSTRStyle.Todos\" glo=\"11101\" pgsel=\"4\" phdr=\"1\" rdc=\"0\" adt=\"0\" rsoox=\"0\" eco=\"1\" ecfw=\"400\" ecfh=\"300\" ecfsu=\"1\" ecwr=\"100\" echr=\"100\" eclar=\"1\" ecrups=\"1\"><details dbit=\"11169976358211\" dsel=\"239\" /></do><excel><epo ews=\"BDE\" ece=\"A57\" enr=\"MSTR.Serie_mensual_Balance_Canarias\" ptn=\"\" qtn=\"\" rows=\"15\" cols=\"94\" /><esdo ews=\"\" ece=\"\" ptn=\"\" /></excel><pgs><pg rows=\"12\" cols=\"93\" nrr=\"84\" nrc=\"645\"><pg /><bls><bl sr=\"1\" sc=\"1\" rfetch=\"12\" cfetch=\"93\" posid=\"1\" darows=\"0\" dacols=\"1\"><excel><epo ews=\"BDE\" ece=\"A57\" enr=\"MSTR.Serie_mensual_Balance_Canarias\" ptn=\"\" qtn=\"\" rows=\"15\" cols=\"94\" /><esdo ews=\"\" ece=\"\" ptn=\"\" /></excel><gridRng><sect id=\"TITLE_AREA\" rngprop=\"1:1:3:1\" /><sect id=\"ROWHEADERS_AREA\" rngprop=\"4:1:12:1\" /><sect id=\"COLUMNHEADERS_AREA\" rngprop=\"1:2:3:93\" /><sect id=\"DATA_AREA\" rngprop=\"4:2:12:93\" /></gridRng><shapes /></bl></bls></pg></pgs></rptloc></mi>"]

{"sheet":"Año","index":15,"n_rows":30,"n_cols":26,"rows_kept":30,"cut":false,"hidden":true,"merged":[]}
[null,null,null,null,null,null,null,null,null,null,null,null,null,null,null,null,null,null,null,null,null,null,null,null,1,1]
["Mensual","1990-1991",1990,"1990-1997","2006-2013","2007-2013",null,null,null,null,null,null,null,null,"Nacional","Mensual"]
["Trimestral","1992-1993",1991,"1998-2005","2014-2021","2014-2020",null,null,null,null,null,null,null,null,"Peninsular","Anual"]
["Anual","1994-1995",1992,"2006-2013",null,null,null,null,null,null,null,null,null,null,"Canarias"]
[null,"1996-1997",1993,"2014-2021",null,null,null,null,null,null,null,null,null,null,"Baleares"]
[null,"1998-1999",1994,null,null,null,null,null,null,null,null,null,null,null,"Ceuta"]
[null,"2000-2001",1995,null,null,null,null,null,null,null,null,null,null,null,"Melilla"]
[null,"2002-2003",1996]
[null,"2004-2005",1997]
[null,"2006-2007",1998]
[null,"2008-2009",1999]
[null,"2010-2011",2000]
[null,"2012-2013",2001]
[null,"2014-2015",2002]
[null,"2016-2017",2003]
[null,null,2004]
[null,null,2005]
[null,null,2006]
[null,null,2007]
[null,null,2008]
[null,null,2009]
[null,null,2010]
[null,null,2011]
[null,null,2012]
[null,null,2013]
[null,null,2014]
[null,null,2015]
[null,null,2016]
[null,null,2017]
[null,null,2018]