{"text_format":"1","workbook":"xlsx","n_sheets":19,"sheets":["AVISO LEGAL","RdT anual Nacional","RdT anual Peninsular","RdT anual Baleares","RdT anual Canarias","Calidad anual Peninsular","Calidad mensual Peninsular","Calidad anual Baleares","Calidad mensual Baleares","Calidad anual Canarias","Calidad mensual Canarias","Indisp. anual peninsular","Indisp. mensual peninsular","Indisp. anual Baleares","Indisp. mensual Baleares","Indisp. anual Canarias","Indisp. mensual Canarias","Red de transporte","Año"],"not_rendered":{"charts":0,"images":1,"macros":1,"external_links":0,"defined_names":17,"comments":0,"pivot_tables":0},"unopened":[],"bounds":{"document_bytes":16777216,"sheet_cells":100000,"rows_first":2000,"rows_last":500,"rows_between":2000,"halvings":0,"cell_chars":16384,"cell_head_chars":4096},"cells_cut":0,"cells_raw":0,"read":"whole","date_system":"1900"}

{"sheet":"AVISO LEGAL","index":0,"n_rows":23,"n_cols":10,"rows_kept":23,"cut":false,"hidden":false,"merged":[[26,0,26,2]]}
[]
[null,null,null,null,null,null,null,"Fecha de actualización:",null,"2018-11-14"]
[]
[]
[]
[]
[]
[]
[]
[]
[]
[]
[]
[]
[]
[]
[]
[]
[]
[]
[]
[]
[null,null,null,null,null,null,null,null,null,"www.ree.es"]

{"sheet":"RdT anual Nacional","index":1,"n_rows":14,"n_cols":12,"rows_kept":14,"cut":false,"hidden":false,"merged":[[12,1,12,11],[13,1,13,11]]}
[null,null,null,null,null,null,null,null,null,null,null,3]
[]
[null,null,null,null,null,null,null,null,"Concepto"]
[null,null,null,null,null,null,null,null,"Sistema eléctrico"]
[null,null,null,null,null,null,null,null,"Horizonte temporal"]
[null,null,null,null,null,null,null,null,"Periodo"]
[]
[null,null,{"$f":"OFFSET('Red de transporte'!C7,0,($L$1-1)*10)","v":2018},{"$f":"OFFSET('Red de transporte'!D7,0,($L$1-1)*10)","v":2019},{"$f":"OFFSET('Red de transporte'!E7,0,($L$1-1)*10)","v":2020},{"$f":"OFFSET('Red de transporte'!F7,0,($L$1-1)*10)","v":2021},{"$f":"OFFSET('Red de transporte'!G7,0,($L$1-1)*10)","v":2022},{"$f":"OFFSET('Red de transporte'!H7,0,($L$1-1)*10)","v":2023},{"$f":"OFFSET('Red de transporte'!I7,0,($L$1-1)*10)","v":2024},{"$f":"OFFSET('Red de transporte'!J7,0,($L$1-1)*10)","v":2025},{"$f":"OFFSET('Red de transporte'!K7,0,($L$1-1)*10)","v":2026},{"$f":"OFFSET('Red de transporte'!L7,0,($L$1-1)*10)","v":2027}]
[]
[null,"Kilómetros de circuito a 400 kV",{"$f":"OFFSET('Red de transporte'!C104,0,($L$1-1)*10)","v":21732.688999999998},{"$f":"OFFSET('Red de transporte'!D104,0,($L$1-1)*10)","v":"-"},{"$f":"OFFSET('Red de transporte'!E104,0,($L$1-1)*10)","v":"-"},{"$f":"OFFSET('Red de transporte'!F104,0,($L$1-1)*10)","v":"-"},{"$f":"OFFSET('Red de transporte'!G104,0,($L$1-1)*10)","v":"-"},{"$f":"OFFSET('Red de transporte'!H104,0,($L$1-1)*10)","v":"-"},{"$f":"OFFSET('Red de transporte'!I104,0,($L$1-1)*10)","v":"-"},{"$f":"OFFSET('Red de transporte'!J104,0,($L$1-1)*10)","v":"-"},{"$f":"OFFSET('Red de transporte'!K104,0,($L$1-1)*10)","v":"-"},{"$f":"OFFSET('Red de transporte'!L104,0,($L$1-1)*10)","v":"-"}]
[null,"Kilómetros de circuito ≤ 220 kV",{"$f":"OFFSET('Red de transporte'!C105,0,($L$1-1)*10)","v":22331.248270000004},{"$f":"OFFSET('Red de transporte'!D105,0,($L$1-1)*10)","v":"-"},{"$f":"OFFSET('Red de transporte'!E105,0,($L$1-1)*10)","v":"-"},{"$f":"OFFSET('Red de transporte'!F105,0,($L$1-1)*10)","v":"-"},{"$f":"OFFSET('Red de transporte'!G105,0,($L$1-1)*10)","v":"-"},{"$f":"OFFSET('Red de transporte'!H105,0,($L$1-1)*10)","v":"-"},{"$f":"OFFSET('Red de transporte'!I105,0,($L$1-1)*10)","v":"-"},{"$f":"OFFSET('Red de transporte'!J105,0,($L$1-1)*10)","v":"-"},{"$f":"OFFSET('Red de transporte'!K105,0,($L$1-1)*10)","v":"-"},{"$f":"OFFSET('Red de transporte'!L105,0,($L$1-1)*10)","v":"-"}]
[null,"Total Kilómetros",{"$f":"OFFSET('Red de transporte'!C106,0,($L$1-1)*10)","v":44063.937270000002},{"$f":"OFFSET('Red de transporte'!D106,0,($L$1-1)*10)","v":"-"},{"$f":"OFFSET('Red de transporte'!E106,0,($L$1-1)*10)","v":"-"},{"$f":"OFFSET('Red de transporte'!F106,0,($L$1-1)*10)","v":"-"},{"$f":"OFFSET('Red de transporte'!G106,0,($L$1-1)*10)","v":"-"},{"$f":"OFFSET('Red de transporte'!H106,0,($L$1-1)*10)","v":"-"},{"$f":"OFFSET('Red de transporte'!I106,0,($L$1-1)*10)","v":"-"},{"$f":"OFFSET('Red de transporte'!J106,0,($L$1-1)*10)","v":"-"},{"$f":"OFFSET('Red de transporte'!K106,0,($L$1-1)*10)","v":"-"},{"$f":"OFFSET('Red de transporte'!L106,0,($L$1-1)*10)","v":"-"}]
[null,{"$f":"IF(MONTH(FACT)=1,\"Datos a 31 de diciembre.\",CONCATENATE(\"Datos a 31 de diciembre. Para el año \",YEAR(FACT), \" datos hasta \",TEXT(FACT-30,\"mmmm\"),\".\"))","v":"Datos a 31 de diciembre. Para el año 2018 datos hasta octubre."}]
[null,"Incluye los activos de la red de transporte del resto de empresas."]

{"sheet":"RdT anual Peninsular","index":2,"n_rows":14,"n_cols":13,"rows_kept":14,"cut":false,"hidden":false,"merged":[[12,1,12,11],[13,1,13,11]]}
[]
[]
[null,null,null,null,null,null,null,null,"Concepto"]
[null,null,null,null,null,null,null,null,"Sistema eléctrico"]
[null,null,null,null,null,null,null,null,"Horizonte temporal",null,null,null,3]
[null,null,null,null,null,null,null,null,"Periodo"]
[]
[null,null,{"$f":"OFFSET('Red de transporte'!C2,0,($M$5-1)*10)","v":2010},{"$f":"OFFSET('Red de transporte'!D2,0,($M$5-1)*10)","v":2011},{"$f":"OFFSET('Red de transporte'!E2,0,($M$5-1)*10)","v":2012},{"$f":"OFFSET('Red de transporte'!F2,0,($M$5-1)*10)","v":2013},{"$f":"OFFSET('Red de transporte'!G2,0,($M$5-1)*10)","v":2014},{"$f":"OFFSET('Red de transporte'!H2,0,($M$5-1)*10)","v":2015},{"$f":"OFFSET('Red de transporte'!I2,0,($M$5-1)*10)","v":2016},{"$f":"OFFSET('Red de transporte'!J2,0,($M$5-1)*10)","v":2017},{"$f":"OFFSET('Red de transporte'!K2,0,($M$5-1)*10)","v":2018},{"$f":"OFFSET('Red de transporte'!L2,0,($M$5-1)*10)","v":2019}]
[]
[null,"Kilómetros de circuito a 400 kV",{"$f":"OFFSET('Red de transporte'!C3,0,($M$5-1)*10)","v":18792.418999999998},{"$f":"OFFSET('Red de transporte'!D3,0,($M$5-1)*10)","v":19671.349999999999},{"$f":"OFFSET('Red de transporte'!E3,0,($M$5-1)*10)","v":20108.846000000001},{"$f":"OFFSET('Red de transporte'!F3,0,($M$5-1)*10)","v":20639.478000000003},{"$f":"OFFSET('Red de transporte'!G3,0,($M$5-1)*10)","v":21093.728000000003},{"$f":"OFFSET('Red de transporte'!H3,0,($M$5-1)*10)","v":21183.826000000001},{"$f":"OFFSET('Red de transporte'!I3,0,($M$5-1)*10)","v":21619.966},{"$f":"OFFSET('Red de transporte'!J3,0,($M$5-1)*10)","v":21728.155000000002},{"$f":"OFFSET('Red de transporte'!K3,0,($M$5-1)*10)","v":21732.688999999998},{"$f":"OFFSET('Red de transporte'!L3,0,($M$5-1)*10)","v":"-"}]
[null,"Kilómetros de circuito ≤ 220 kV",{"$f":"OFFSET('Red de transporte'!C4,0,($M$5-1)*10)","v":17403.404000000002},{"$f":"OFFSET('Red de transporte'!D4,0,($M$5-1)*10)","v":18003.668000000005},{"$f":"OFFSET('Red de transporte'!E4,0,($M$5-1)*10)","v":18372.541060000003},{"$f":"OFFSET('Red de transporte'!F4,0,($M$5-1)*10)","v":18645.841060000002},{"$f":"OFFSET('Red de transporte'!G4,0,($M$5-1)*10)","v":18784.958560000006},{"$f":"OFFSET('Red de transporte'!H4,0,($M$5-1)*10)","v":18925.261560000006},{"$f":"OFFSET('Red de transporte'!I4,0,($M$5-1)*10)","v":19013.238560000009},{"$f":"OFFSET('Red de transporte'!J4,0,($M$5-1)*10)","v":19038.601270000006},{"$f":"OFFSET('Red de transporte'!K4,0,($M$5-1)*10)","v":19069.701270000005},{"$f":"OFFSET('Red de transporte'!L4,0,($M$5-1)*10)","v":"-"}]
[null,"Total Kilómetros",{"$f":"OFFSET('Red de transporte'!C5,0,($M$5-1)*10)","v":36195.823000000004},{"$f":"OFFSET('Red de transporte'!D5,0,($M$5-1)*10)","v":37675.018000000004},{"$f":"OFFSET('Red de transporte'!E5,0,($M$5-1)*10)","v":38481.387060000008},{"$f":"OFFSET('Red de transporte'!F5,0,($M$5-1)*10)","v":39285.319060000009},{"$f":"OFFSET('Red de transporte'!G5,0,($M$5-1)*10)","v":39878.686560000009},{"$f":"OFFSET('Red de transporte'!H5,0,($M$5-1)*10)","v":40109.087560000007},{"$f":"OFFSET('Red de transporte'!I5,0,($M$5-1)*10)","v":40633.204560000013},{"$f":"OFFSET('Red de transporte'!J5,0,($M$5-1)*10)","v":40766.756270000013},{"$f":"OFFSET('Red de transporte'!K5,0,($M$5-1)*10)","v":40802.390270000004},{"$f":"OFFSET('Red de transporte'!L5,0,($M$5-1)*10)","v":"-"}]
[null,{"$f":"IF(MONTH(FACT)=1,\"Datos a 31 de diciembre.\",CONCATENATE(\"Datos a 31 de diciembre. Para el año \",YEAR(FACT), \" datos hasta \",TEXT(FACT-30,\"mmmm\"),\".\"))","v":"Datos a 31 de diciembre. Para el año 2018 datos hasta octubre."}]
[null,"Incluye los activos de la red de transporte del resto de empresas."]

{"sheet":"RdT anual Baleares","index":3,"n_rows":14,"n_cols":12,"rows_kept":14,"cut":false,"hidden":false,"merged":[[12,1,12,11],[13,1,13,11]]}
[null,null,null,null,null,null,null,null,null,null,null,3]
[]
[null,null,null,null,null,null,null,null,"Concepto"]
[null,null,null,null,null,null,null,null,"Sistema eléctrico"]
[null,null,null,null,null,null,null,null,"Horizonte temporal"]
[null,null,null,null,null,null,null,null,"Periodo"]
[]
[null,null,{"$f":"OFFSET('Red de transporte'!C7,0,($L$1-1)*10)","v":2018},{"$f":"OFFSET('Red de transporte'!D7,0,($L$1-1)*10)","v":2019},{"$f":"OFFSET('Red de transporte'!E7,0,($L$1-1)*10)","v":2020},{"$f":"OFFSET('Red de transporte'!F7,0,($L$1-1)*10)","v":2021},{"$f":"OFFSET('Red de transporte'!G7,0,($L$1-1)*10)","v":2022},{"$f":"OFFSET('Red de transporte'!H7,0,($L$1-1)*10)","v":2023},{"$f":"OFFSET('Red de transporte'!I7,0,($L$1-1)*10)","v":2024},{"$f":"OFFSET('Red de transporte'!J7,0,($L$1-1)*10)","v":2025},{"$f":"OFFSET('Red de transporte'!K7,0,($L$1-1)*10)","v":2026},{"$f":"OFFSET('Red de transporte'!L7,0,($L$1-1)*10)","v":2027}]
[]
[null,"Kilómetros de circuito a 220 kV",{"$f":"OFFSET('Red de transporte'!C8,0,($L$1-1)*10)","v":432.214},{"$f":"OFFSET('Red de transporte'!D8,0,($L$1-1)*10)","v":"-"},{"$f":"OFFSET('Red de transporte'!E8,0,($L$1-1)*10)","v":"-"},{"$f":"OFFSET('Red de transporte'!F8,0,($L$1-1)*10)","v":"-"},{"$f":"OFFSET('Red de transporte'!G8,0,($L$1-1)*10)","v":"-"},{"$f":"OFFSET('Red de transporte'!H8,0,($L$1-1)*10)","v":"-"},{"$f":"OFFSET('Red de transporte'!I8,0,($L$1-1)*10)","v":"-"},{"$f":"OFFSET('Red de transporte'!J8,0,($L$1-1)*10)","v":"-"},{"$f":"OFFSET('Red de transporte'!K8,0,($L$1-1)*10)","v":"-"},{"$f":"OFFSET('Red de transporte'!L8,0,($L$1-1)*10)","v":"-"}]
[null,"Kilómetros de circuito ≤ 132 kV",{"$f":"OFFSET('Red de transporte'!C9,0,($L$1-1)*10)","v":1376.1900000000003},{"$f":"OFFSET('Red de transporte'!D9,0,($L$1-1)*10)","v":"-"},{"$f":"OFFSET('Red de transporte'!E9,0,($L$1-1)*10)","v":"-"},{"$f":"OFFSET('Red de transporte'!F9,0,($L$1-1)*10)","v":"-"},{"$f":"OFFSET('Red de transporte'!G9,0,($L$1-1)*10)","v":"-"},{"$f":"OFFSET('Red de transporte'!H9,0,($L$1-1)*10)","v":"-"},{"$f":"OFFSET('Red de transporte'!I9,0,($L$1-1)*10)","v":"-"},{"$f":"OFFSET('Red de transporte'!J9,0,($L$1-1)*10)","v":"-"},{"$f":"OFFSET('Red de transporte'!K9,0,($L$1-1)*10)","v":"-"},{"$f":"OFFSET('Red de transporte'!L9,0,($L$1-1)*10)","v":"-"}]
[null,"Total Kilómetros",{"$f":"OFFSET('Red de transporte'!C10,0,($L$1-1)*10)","v":1808.4040000000002},{"$f":"OFFSET('Red de transporte'!D10,0,($L$1-1)*10)","v":"-"},{"$f":"OFFSET('Red de transporte'!E10,0,($L$1-1)*10)","v":"-"},{"$f":"OFFSET('Red de transporte'!F10,0,($L$1-1)*10)","v":"-"},{"$f":"OFFSET('Red de transporte'!G10,0,($L$1-1)*10)","v":"-"},{"$f":"OFFSET('Red de transporte'!H10,0,($L$1-1)*10)","v":"-"},{"$f":"OFFSET('Red de transporte'!I10,0,($L$1-1)*10)","v":"-"},{"$f":"OFFSET('Red de transporte'!J10,0,($L$1-1)*10)","v":"-"},{"$f":"OFFSET('Red de transporte'!K10,0,($L$1-1)*10)","v":"-"},{"$f":"OFFSET('Red de transporte'!L10,0,($L$1-1)*10)","v":"-"}]
[null,{"$f":"IF(MONTH(FACT)=1,\"Datos a 31 de diciembre.\",CONCATENATE(\"Datos a 31 de diciembre. Para el año \",YEAR(FACT), \" datos hasta \",TEXT(FACT-30,\"mmmm\"),\".\"))","v":"Datos a 31 de diciembre. Para el año 2018 datos hasta octubre."}]
[null,"Incluye los activos de la red de transporte del resto de empresas."]

{"sheet":"RdT anual Canarias","index":4,"n_rows":13,"n_cols":12,"rows_kept":13,"cut":false,"hidden":false,"merged":[[12,1,12,11],[13,1,13,11]]}
[null,null,null,null,null,null,null,null,null,null,null,3]
[]
[null,null,null,null,null,null,null,null,"Concepto"]
[null,null,null,null,null,null,null,null,"Sistema eléctrico"]
[null,null,null,null,null,null,null,null,"Horizonte temporal"]
[null,null,null,null,null,null,null,null,"Periodo"]
[]
[null,null,{"$f":"OFFSET('Red de transporte'!C12,0,($L$1-1)*10)","v":2018},{"$f":"OFFSET('Red de transporte'!D12,0,($L$1-1)*10)","v":2019},{"$f":"OFFSET('Red de transporte'!E12,0,($L$1-1)*10)","v":2020},{"$f":"OFFSET('Red de transporte'!F12,0,($L$1-1)*10)","v":2021},{"$f":"OFFSET('Red de transporte'!G12,0,($L$1-1)*10)","v":2022},{"$f":"OFFSET('Red de transporte'!H12,0,($L$1-1)*10)","v":2023},{"$f":"OFFSET('Red de transporte'!I12,0,($L$1-1)*10)","v":2024},{"$f":"OFFSET('Red de transporte'!J12,0,($L$1-1)*10)","v":2025},{"$f":"OFFSET('Red de transporte'!K12,0,($L$1-1)*10)","v":2026},{"$f":"OFFSET('Red de transporte'!L12,0,($L$1-1)*10)","v":2027}]
[]
[null,"Kilómetros de circuito a 220 kV",{"$f":"OFFSET('Red de transporte'!C13,0,($L$1-1)*10)","v":220.24300000000002},{"$f":"OFFSET('Red de transporte'!D13,0,($L$1-1)*10)","v":"-"},{"$f":"OFFSET('Red de transporte'!E13,0,($L$1-1)*10)","v":"-"},{"$f":"OFFSET('Red de transporte'!F13,0,($L$1-1)*10)","v":"-"},{"$f":"OFFSET('Red de transporte'!G13,0,($L$1-1)*10)","v":"-"},{"$f":"OFFSET('Red de transporte'!H13,0,($L$1-1)*10)","v":"-"},{"$f":"OFFSET('Red de transporte'!I13,0,($L$1-1)*10)","v":"-"},{"$f":"OFFSET('Red de transporte'!J13,0,($L$1-1)*10)","v":"-"},{"$f":"OFFSET('Red de transporte'!K13,0,($L$1-1)*10)","v":"-"},{"$f":"OFFSET('Red de transporte'!L13,0,($L$1-1)*10)","v":"-"}]
[null,"Kilómetros de circuito ≤ 132 kV",{"$f":"OFFSET('Red de transporte'!C14,0,($L$1-1)*10)","v":1232.8999999999999},{"$f":"OFFSET('Red de transporte'!D14,0,($L$1-1)*10)","v":"-"},{"$f":"OFFSET('Red de transporte'!E14,0,($L$1-1)*10)","v":"-"},{"$f":"OFFSET('Red de transporte'!F14,0,($L$1-1)*10)","v":"-"},{"$f":"OFFSET('Red de transporte'!G14,0,($L$1-1)*10)","v":"-"},{"$f":"OFFSET('Red de transporte'!H14,0,($L$1-1)*10)","v":"-"},{"$f":"OFFSET('Red de transporte'!I14,0,($L$1-1)*10)","v":"-"},{"$f":"OFFSET('Red de transporte'!J14,0,($L$1-1)*10)","v":"-"},{"$f":"OFFSET('Red de transporte'!K14,0,($L$1-1)*10)","v":"-"},{"$f":"OFFSET('Red de transporte'!L14,0,($L$1-1)*10)","v":"-"}]
[null,"Total Kilómetros",{"$f":"OFFSET('Red de transporte'!C15,0,($L$1-1)*10)","v":1453.1429999999998},{"$f":"OFFSET('Red de transporte'!D15,0,($L$1-1)*10)","v":"-"},{"$f":"OFFSET('Red de transporte'!E15,0,($L$1-1)*10)","v":"-"},{"$f":"OFFSET('Red de transporte'!F15,0,($L$1-1)*10)","v":"-"},{"$f":"OFFSET('Red de transporte'!G15,0,($L$1-1)*10)","v":"-"},{"$f":"OFFSET('Red de transporte'!H15,0,($L$1-1)*10)","v":"-"},{"$f":"OFFSET('Red de transporte'!I15,0,($L$1-1)*10)","v":"-"},{"$f":"OFFSET('Red de transporte'!J15,0,($L$1-1)*10)","v":"-"},{"$f":"OFFSET('Red de transporte'!K15,0,($L$1-1)*10)","v":"-"},{"$f":"OFFSET('Red de transporte'!L15,0,($L$1-1)*10)","v":"-"}]
[null,{"$f":"IF(MONTH(FACT)=1,\"Datos a 31 de diciembre.\",CONCATENATE(\"Datos a 31 de diciembre. Para el año \",YEAR(FACT), \" datos hasta \",TEXT(FACT-30,\"mmmm\"),\".\"))","v":"Datos a 31 de diciembre. Para el año 2018 datos hasta octubre."}]

{"sheet":"Calidad anual Peninsular","index":5,"n_rows":16,"n_cols":12,"rows_kept":16,"cut":false,"hidden":false,"merged":[[12,1,12,11],[13,1,13,11],[14,1,14,11]]}
[null,null,null,null,null,null,null,null,null,null,null,2]
[]
[null,null,null,null,null,null,null,null,"Concepto"]
[null,null,null,null,null,null,null,null,"Sistema eléctrico"]
[null,null,null,null,null,null,null,null,"Horizonte temporal"]
[null,null,null,null,null,null,null,null,"Periodo"]
[]
[null,null,{"$f":"OFFSET('Red de transporte'!C60,0,($L$1-1)*10)","v":"2013"},{"$f":"OFFSET('Red de transporte'!D60,0,($L$1-1)*10)","v":"2014"},{"$f":"OFFSET('Red de transporte'!E60,0,($L$1-1)*10)","v":"2015"},{"$f":"OFFSET('Red de transporte'!F60,0,($L$1-1)*10)","v":"2016"},{"$f":"OFFSET('Red de transporte'!G60,0,($L$1-1)*10)","v":"2017"},{"$f":"OFFSET('Red de transporte'!H60,0,($L$1-1)*10)","v":"2018"},{"$f":"OFFSET('Red de transporte'!I60,0,($L$1-1)*10)","v":"2019"},{"$f":"OFFSET('Red de transporte'!J60,0,($L$1-1)*10)","v":"2020"},{"$f":"OFFSET('Red de transporte'!K60,0,($L$1-1)*10)","v":"2021"},{"$f":"OFFSET('Red de transporte'!L60,0,($L$1-1)*10)","v":"2022"}]
[]
[null,"Número de cortes",{"$f":"OFFSET('Red de transporte'!C61,0,($L$1-1)*10)","v":18},{"$f":"OFFSET('Red de transporte'!D61,0,($L$1-1)*10)","v":24},{"$f":"OFFSET('Red de transporte'!E61,0,($L$1-1)*10)","v":18},{"$f":"OFFSET('Red de transporte'!F61,0,($L$1-1)*10)","v":15},{"$f":"OFFSET('Red de transporte'!G61,0,($L$1-1)*10)","v":12},{"$f":"OFFSET('Red de transporte'!H61,0,($L$1-1)*10)","v":11},{"$f":"OFFSET('Red de transporte'!I61,0,($L$1-1)*10)","v":"-"},{"$f":"OFFSET('Red de transporte'!J61,0,($L$1-1)*10)","v":"-"},{"$f":"OFFSET('Red de transporte'!K61,0,($L$1-1)*10)","v":"-"},{"$f":"OFFSET('Red de transporte'!L61,0,($L$1-1)*10)","v":"-"}]
[null,"Energía no suministrada (MWh)",{"$f":"OFFSET('Red de transporte'!C62,0,($L$1-1)*10)","v":1156.18},{"$f":"OFFSET('Red de transporte'!D62,0,($L$1-1)*10)","v":204.34000000000003},{"$f":"OFFSET('Red de transporte'!E62,0,($L$1-1)*10)","v":52.769999999999996},{"$f":"OFFSET('Red de transporte'!F62,0,($L$1-1)*10)","v":77.965000000000003},{"$f":"OFFSET('Red de transporte'!G62,0,($L$1-1)*10)","v":60.152999999999999},{"$f":"OFFSET('Red de transporte'!H62,0,($L$1-1)*10)","v":207.95999999999998},{"$f":"OFFSET('Red de transporte'!I62,0,($L$1-1)*10)","v":"-"},{"$f":"OFFSET('Red de transporte'!J62,0,($L$1-1)*10)","v":"-"},{"$f":"OFFSET('Red de transporte'!K62,0,($L$1-1)*10)","v":"-"},{"$f":"OFFSET('Red de transporte'!L62,0,($L$1-1)*10)","v":"-"}]
[null,"Tiempo de interrupción medio (minutos)",{"$f":"OFFSET('Red de transporte'!C63,0,($L$1-1)*10)","v":2.4670000000000001},{"$f":"OFFSET('Red de transporte'!D63,0,($L$1-1)*10)","v":0.441},{"$f":"OFFSET('Red de transporte'!E63,0,($L$1-1)*10)","v":0.112},{"$f":"OFFSET('Red de transporte'!F63,0,($L$1-1)*10)","v":0.16400000000000001},{"$f":"OFFSET('Red de transporte'!G63,0,($L$1-1)*10)","v":0.125},{"$f":"OFFSET('Red de transporte'!H63,0,($L$1-1)*10)","v":0.42699999999999999},{"$f":"OFFSET('Red de transporte'!I63,0,($L$1-1)*10)","v":"-"},{"$f":"OFFSET('Red de transporte'!J63,0,($L$1-1)*10)","v":"-"},{"$f":"OFFSET('Red de transporte'!K63,0,($L$1-1)*10)","v":"-"},{"$f":"OFFSET('Red de transporte'!L63,0,($L$1-1)*10)","v":"-"}]
[null,"TIM = ENS / Potencia media del sistema."]
[null,{"$f":"IF(MONTH(FACT)=1,\"Datos acumulados a 31 de diciembre.\",CONCATENATE(\"Datos acumulados a 31 de diciembre. Para el año \",YEAR(FACT), \" datos acumulados a \",TEXT(FACT-30,\"mmmm\"),\" de \",YEAR(FACT),\".\"))","v":"Datos acumulados a 31 de diciembre. Para el año 2018 datos acumulados a octubre de 2018."}]
[null,"Los indicadores de calidad del servicio de cada año son auditados en septiembre del año siguiente."]
[null,"(1) Datos acumulados a julio de 2013."]

{"sheet":"Calidad mensual Peninsular","index":6,"n_rows":14,"n_cols":15,"rows_kept":14,"cut":false,"hidden":false,"merged":[[12,1,12,14],[13,1,13,14]]}
[null,null,null,null,null,null,null,null,null,null,null,null,null,null,16]
[]
[null,null,null,null,null,null,null,null,null,null,null,"   Concepto"]
[null,null,null,null,null,null,null,null,null,null,null,"   Sistema eléctrico"]
[null,null,null,null,null,null,null,null,null,null,null,"   Horizonte temporal"]
[null,null,null,null,null,null,null,null,null,null,null,"   Periodo"]
[]
[null,null,"Ene.","Feb.","Mar.","Abr.","May.","Jun.","Jul.","Ago.","Sep.","Oct.","Nov.","Dic.",{"$f":"OFFSET(Año!D2,($O$1-1),0)","v":2018}]
[]
[null,"Número de cortes",{"$f":"OFFSET('Red de transporte'!C18,0,($O$1-1)*13)","v":0},{"$f":"OFFSET('Red de transporte'!D18,0,($O$1-1)*13)","v":1},{"$f":"OFFSET('Red de transporte'!E18,0,($O$1-1)*13)","v":1},{"$f":"OFFSET('Red de transporte'!F18,0,($O$1-1)*13)","v":1},{"$f":"OFFSET('Red de transporte'!G18,0,($O$1-1)*13)","v":2},{"$f":"OFFSET('Red de transporte'!H18,0,($O$1-1)*13)","v":2},{"$f":"OFFSET('Red de transporte'!I18,0,($O$1-1)*13)","v":1},{"$f":"OFFSET('Red de transporte'!J18,0,($O$1-1)*13)","v":1},{"$f":"OFFSET('Red de transporte'!K18,0,($O$1-1)*13)","v":2},{"$f":"OFFSET('Red de transporte'!L18,0,($O$1-1)*13)","v":0},{"$f":"OFFSET('Red de transporte'!M18,0,($O$1-1)*13)","v":"-"},{"$f":"OFFSET('Red de transporte'!N18,0,($O$1-1)*13)","v":"-"},{"$f":"OFFSET('Red de transporte'!O18,0,($O$1-1)*13)","v":11}]
[null,"Energía no suministrada (MWh)",{"$f":"OFFSET('Red de transporte'!C19,0,($O$1-1)*13)","v":0},{"$f":"OFFSET('Red de transporte'!D19,0,($O$1-1)*13)","v":6.5000000000000002E-2},{"$f":"OFFSET('Red de transporte'!E19,0,($O$1-1)*13)","v":17.77},{"$f":"OFFSET('Red de transporte'!F19,0,($O$1-1)*13)","v":0.41},{"$f":"OFFSET('Red de transporte'!G19,0,($O$1-1)*13)","v":5.43},{"$f":"OFFSET('Red de transporte'!H19,0,($O$1-1)*13)","v":0.17499999999999999},{"$f":"OFFSET('Red de transporte'!I19,0,($O$1-1)*13)","v":8.75},{"$f":"OFFSET('Red de transporte'!J19,0,($O$1-1)*13)","v":174.98},{"$f":"OFFSET('Red de transporte'!K19,0,($O$1-1)*13)","v":0.38},{"$f":"OFFSET('Red de transporte'!L19,0,($O$1-1)*13)","v":0},{"$f":"OFFSET('Red de transporte'!M19,0,($O$1-1)*13)","v":"-"},{"$f":"OFFSET('Red de transporte'!N19,0,($O$1-1)*13)","v":"-"},{"$f":"OFFSET('Red de transporte'!O19,0,($O$1-1)*13)","v":207.95999999999998}]
[null,"Tiempo de interrupción medio (minutos)",{"$f":"OFFSET('Red de transporte'!C20,0,($O$1-1)*13)","v":0},{"$f":"OFFSET('Red de transporte'!D20,0,($O$1-1)*13)","v":1.2E-4},{"$f":"OFFSET('Red de transporte'!E20,0,($O$1-1)*13)","v":3.5979999999999998E-2},{"$f":"OFFSET('Red de transporte'!F20,0,($O$1-1)*13)","v":8.8999999999999995E-4},{"$f":"OFFSET('Red de transporte'!G20,0,($O$1-1)*13)","v":1.208E-2},{"$f":"OFFSET('Red de transporte'!H20,0,($O$1-1)*13)","v":3.6999999999999999E-4},{"$f":"OFFSET('Red de transporte'!I20,0,($O$1-1)*13)","v":1.762E-2},{"$f":"OFFSET('Red de transporte'!J20,0,($O$1-1)*13)","v":0.35552},{"$f":"OFFSET('Red de transporte'!K20,0,($O$1-1)*13)","v":7.9000000000000001E-4},{"$f":"OFFSET('Red de transporte'!L20,0,($O$1-1)*13)","v":0},{"$f":"OFFSET('Red de transporte'!M20,0,($O$1-1)*13)","v":"-"},{"$f":"OFFSET('Red de transporte'!N20,0,($O$1-1)*13)","v":"-"},{"$f":"OFFSET('Red de transporte'!O20,0,($O$1-1)*13)","v":0.43}]
[null,"TIM = ENS / Potencia media del sistema."]
[null,{"$f":"'Calidad anual Peninsular'!B15","v":"Los indicadores de calidad del servicio de cada año son auditados en septiembre del año siguiente."}]

{"sheet":"Calidad anual Baleares","index":7,"n_rows":16,"n_cols":12,"rows_kept":16,"cut":false,"hidden":false,"merged":[[12,1,12,11],[13,1,13,11],[14,1,14,11]]}
[null,null,null,null,null,null,null,null,null,null,null,2]
[]
[null,null,null,null,null,null,null,null,"Concepto"]
[null,null,null,null,null,null,null,null,"Sistema eléctrico"]
[null,null,null,null,null,null,null,null,"Horizonte temporal"]
[null,null,null,null,null,null,null,null,"Periodo"]
[]
[null,null,{"$f":"OFFSET('Red de transporte'!C65,0,($L$1-1)*10)","v":"2015"},{"$f":"OFFSET('Red de transporte'!D65,0,($L$1-1)*10)","v":"2016"},{"$f":"OFFSET('Red de transporte'!E65,0,($L$1-1)*10)","v":"2017"},{"$f":"OFFSET('Red de transporte'!F65,0,($L$1-1)*10)","v":"2018"},{"$f":"OFFSET('Red de transporte'!G65,0,($L$1-1)*10)","v":"2019"},{"$f":"OFFSET('Red de transporte'!H65,0,($L$1-1)*10)","v":"2020"},{"$f":"OFFSET('Red de transporte'!I65,0,($L$1-1)*10)","v":"2021"},{"$f":"OFFSET('Red de transporte'!J65,0,($L$1-1)*10)","v":"2022"},{"$f":"OFFSET('Red de transporte'!K65,0,($L$1-1)*10)","v":"2023"},{"$f":"OFFSET('Red de transporte'!L65,0,($L$1-1)*10)","v":"2024"}]
[]
[null,"Número de cortes",{"$f":"OFFSET('Red de transporte'!C66,0,($L$1-1)*10)","v":5},{"$f":"OFFSET('Red de transporte'!D66,0,($L$1-1)*10)","v":1},{"$f":"OFFSET('Red de transporte'!E66,0,($L$1-1)*10)","v":5},{"$f":"OFFSET('Red de transporte'!F66,0,($L$1-1)*10)","v":2},{"$f":"OFFSET('Red de transporte'!G66,0,($L$1-1)*10)","v":"-"},{"$f":"OFFSET('Red de transporte'!H66,0,($L$1-1)*10)","v":"-"},{"$f":"OFFSET('Red de transporte'!I66,0,($L$1-1)*10)","v":"-"},{"$f":"OFFSET('Red de transporte'!J66,0,($L$1-1)*10)","v":"-"},{"$f":"OFFSET('Red de transporte'!K66,0,($L$1-1)*10)","v":"-"},{"$f":"OFFSET('Red de transporte'!L66,0,($L$1-1)*10)","v":"-"}]
[null,"Energía no suministrada (MWh)",{"$f":"OFFSET('Red de transporte'!C67,0,($L$1-1)*10)","v":29.36},{"$f":"OFFSET('Red de transporte'!D67,0,($L$1-1)*10)","v":0.3},{"$f":"OFFSET('Red de transporte'!E67,0,($L$1-1)*10)","v":33.07},{"$f":"OFFSET('Red de transporte'!F67,0,($L$1-1)*10)","v":33.81},{"$f":"OFFSET('Red de transporte'!G67,0,($L$1-1)*10)","v":"-"},{"$f":"OFFSET('Red de transporte'!H67,0,($L$1-1)*10)","v":"-"},{"$f":"OFFSET('Red de transporte'!I67,0,($L$1-1)*10)","v":"-"},{"$f":"OFFSET('Red de transporte'!J67,0,($L$1-1)*10)","v":"-"},{"$f":"OFFSET('Red de transporte'!K67,0,($L$1-1)*10)","v":"-"},{"$f":"OFFSET('Red de transporte'!L67,0,($L$1-1)*10)","v":"-"}]
[null,"Tiempo de interrupción medio (minutos)",{"$f":"OFFSET('Red de transporte'!C68,0,($L$1-1)*10)","v":2.6619999999999999},{"$f":"OFFSET('Red de transporte'!D68,0,($L$1-1)*10)","v":2.7E-2},{"$f":"OFFSET('Red de transporte'!E68,0,($L$1-1)*10)","v":2.883},{"$f":"OFFSET('Red de transporte'!F68,0,($L$1-1)*10)","v":2.7879999999999998},{"$f":"OFFSET('Red de transporte'!G68,0,($L$1-1)*10)","v":"-"},{"$f":"OFFSET('Red de transporte'!H68,0,($L$1-1)*10)","v":"-"},{"$f":"OFFSET('Red de transporte'!I68,0,($L$1-1)*10)","v":"-"},{"$f":"OFFSET('Red de transporte'!J68,0,($L$1-1)*10)","v":"-"},{"$f":"OFFSET('Red de transporte'!K68,0,($L$1-1)*10)","v":"-"},{"$f":"OFFSET('Red de transporte'!L68,0,($L$1-1)*10)","v":"-"}]
[null,"TIM = ENS / Potencia media del sistema."]
[null,{"$f":"IF(MONTH(FACT)=1,\"Datos acumulados a 31 de diciembre.\",CONCATENATE(\"Datos acumulados a 31 de diciembre. Para el año \",YEAR(FACT), \" datos acumulados a \",TEXT(FACT-30,\"mmmm\"),\" de \",YEAR(FACT),\".\"))","v":"Datos acumulados a 31 de diciembre. Para el año 2018 datos acumulados a octubre de 2018."}]
[null,{"$f":"'Calidad anual Peninsular'!B15","v":"Los indicadores de calidad del servicio de cada año son auditados en septiembre del año siguiente."}]
[null,"(1) Datos acumulados a julio de 2013."]

{"sheet":"Calidad mensual Baleares","index":8,"n_rows":14,"n_cols":15,"rows_kept":14,"cut":false,"hidden":false,"merged":[[12,1,12,14],[13,1,13,14]]}
[null,null,null,null,null,null,null,null,null,null,null,null,null,null,14]
[]
[null,null,null,null,null,null,null,null,null,null,null,"   Concepto"]
[null,null,null,null,null,null,null,null,null,null,null,"   Sistema eléctrico"]
[null,null,null,null,null,null,null,null,null,null,null,"   Horizonte temporal"]
[null,null,null,null,null,null,null,null,null,null,null,"   Periodo"]
[]
[null,null,"Ene.","Feb.","Mar.","Abr.","May.","Jun.","Jul.","Ago.","Sep.","Oct.","Nov.","Dic.",{"$f":"OFFSET(Año!D4,($O$1-1),0)","v":2018}]
[]
[null,"Número de cortes",{"$f":"OFFSET('Red de transporte'!C23,0,($O$1-1)*13)","v":0},{"$f":"OFFSET('Red de transporte'!D23,0,($O$1-1)*13)","v":0},{"$f":"OFFSET('Red de transporte'!E23,0,($O$1-1)*13)","v":0},{"$f":"OFFSET('Red de transporte'!F23,0,($O$1-1)*13)","v":0},{"$f":"OFFSET('Red de transporte'!G23,0,($O$1-1)*13)","v":0},{"$f":"OFFSET('Red de transporte'!H23,0,($O$1-1)*13)","v":0},{"$f":"OFFSET('Red de transporte'!I23,0,($O$1-1)*13)","v":0},{"$f":"OFFSET('Red de transporte'!J23,0,($O$1-1)*13)","v":1},{"$f":"OFFSET('Red de transporte'!K23,0,($O$1-1)*13)","v":1},{"$f":"OFFSET('Red de transporte'!L23,0,($O$1-1)*13)","v":0},{"$f":"OFFSET('Red de transporte'!M23,0,($O$1-1)*13)","v":"-"},{"$f":"OFFSET('Red de transporte'!N23,0,($O$1-1)*13)","v":"-"},{"$f":"OFFSET('Red de transporte'!O23,0,($O$1-1)*13)","v":2}]
[null,"Energía no suministrada (MWh)",{"$f":"OFFSET('Red de transporte'!C24,0,($O$1-1)*13)","v":0},{"$f":"OFFSET('Red de transporte'!D24,0,($O$1-1)*13)","v":0},{"$f":"OFFSET('Red de transporte'!E24,0,($O$1-1)*13)","v":0},{"$f":"OFFSET('Red de transporte'!F24,0,($O$1-1)*13)","v":0},{"$f":"OFFSET('Red de transporte'!G24,0,($O$1-1)*13)","v":0},{"$f":"OFFSET('Red de transporte'!H24,0,($O$1-1)*13)","v":0},{"$f":"OFFSET('Red de transporte'!I24,0,($O$1-1)*13)","v":0},{"$f":"OFFSET('Red de transporte'!J24,0,($O$1-1)*13)","v":33.11},{"$f":"OFFSET('Red de transporte'!K24,0,($O$1-1)*13)","v":0.7},{"$f":"OFFSET('Red de transporte'!L24,0,($O$1-1)*13)","v":0},{"$f":"OFFSET('Red de transporte'!M24,0,($O$1-1)*13)","v":"-"},{"$f":"OFFSET('Red de transporte'!N24,0,($O$1-1)*13)","v":"-"},{"$f":"OFFSET('Red de transporte'!O24,0,($O$1-1)*13)","v":33.81}]
[null,"Tiempo de interrupción medio (minutos)",{"$f":"OFFSET('Red de transporte'!C25,0,($O$1-1)*13)","v":0},{"$f":"OFFSET('Red de transporte'!D25,0,($O$1-1)*13)","v":0},{"$f":"OFFSET('Red de transporte'!E25,0,($O$1-1)*13)","v":0},{"$f":"OFFSET('Red de transporte'!F25,0,($O$1-1)*13)","v":0},{"$f":"OFFSET('Red de transporte'!G25,0,($O$1-1)*13)","v":0},{"$f":"OFFSET('Red de transporte'!H25,0,($O$1-1)*13)","v":0},{"$f":"OFFSET('Red de transporte'!I25,0,($O$1-1)*13)","v":0},{"$f":"OFFSET('Red de transporte'!J25,0,($O$1-1)*13)","v":2.1},{"$f":"OFFSET('Red de transporte'!K25,0,($O$1-1)*13)","v":5.1999999999999998E-2},{"$f":"OFFSET('Red de transporte'!L25,0,($O$1-1)*13)","v":0},{"$f":"OFFSET('Red de transporte'!M25,0,($O$1-1)*13)","v":"-"},{"$f":"OFFSET('Red de transporte'!N25,0,($O$1-1)*13)","v":"-"},{"$f":"OFFSET('Red de transporte'!O25,0,($O$1-1)*13)","v":2.8250000000000002}]
[null,"TIM = ENS / Potencia media del sistema."]
[null,{"$f":"'Calidad anual Peninsular'!B15","v":"Los indicadores de calidad del servicio de cada año son auditados en septiembre del año siguiente."}]

{"sheet":"Calidad anual Canarias","index":9,"n_rows":16,"n_cols":12,"rows_kept":16,"cut":false,"hidden":false,"merged":[[12,1,12,11],[13,1,13,11],[14,1,14,11]]}
[null,null,null,null,null,null,null,null,null,null,null,2]
[]
[null,null,null,null,null,null,null,null,"Concepto"]
[null,null,null,null,null,null,null,null,"Sistema eléctrico"]
[null,null,null,null,null,null,null,null,"Horizonte temporal"]
[null,null,null,null,null,null,null,null,"Periodo"]
[]
[null,null,{"$f":"OFFSET('Red de transporte'!C70,0,($L$1-1)*10)","v":"2015"},{"$f":"OFFSET('Red de transporte'!D70,0,($L$1-1)*10)","v":"2016"},{"$f":"OFFSET('Red de transporte'!E70,0,($L$1-1)*10)","v":"2017"},{"$f":"OFFSET('Red de transporte'!F70,0,($L$1-1)*10)","v":"2018"},{"$f":"OFFSET('Red de transporte'!G70,0,($L$1-1)*10)","v":"2019"},{"$f":"OFFSET('Red de transporte'!H70,0,($L$1-1)*10)","v":"2020"},{"$f":"OFFSET('Red de transporte'!I70,0,($L$1-1)*10)","v":"2021"},{"$f":"OFFSET('Red de transporte'!J70,0,($L$1-1)*10)","v":"2022"},{"$f":"OFFSET('Red de transporte'!K70,0,($L$1-1)*10)","v":"2023"},{"$f":"OFFSET('Red de transporte'!L70,0,($L$1-1)*10)","v":"2024"}]
[]
[null,"Número de cortes",{"$f":"OFFSET('Red de transporte'!C71,0,($L$1-1)*10)","v":12},{"$f":"OFFSET('Red de transporte'!D71,0,($L$1-1)*10)","v":14},{"$f":"OFFSET('Red de transporte'!E71,0,($L$1-1)*10)","v":12},{"$f":"OFFSET('Red de transporte'!F71,0,($L$1-1)*10)","v":3},{"$f":"OFFSET('Red de transporte'!G71,0,($L$1-1)*10)","v":"-"},{"$f":"OFFSET('Red de transporte'!H71,0,($L$1-1)*10)","v":"-"},{"$f":"OFFSET('Red de transporte'!I71,0,($L$1-1)*10)","v":"-"},{"$f":"OFFSET('Red de transporte'!J71,0,($L$1-1)*10)","v":"-"},{"$f":"OFFSET('Red de transporte'!K71,0,($L$1-1)*10)","v":"-"},{"$f":"OFFSET('Red de transporte'!L71,0,($L$1-1)*10)","v":"-"}]
[null,"Energía no suministrada (MWh)",{"$f":"OFFSET('Red de transporte'!C72,0,($L$1-1)*10)","v":149.71700000000001},{"$f":"OFFSET('Red de transporte'!D72,0,($L$1-1)*10)","v":457.11},{"$f":"OFFSET('Red de transporte'!E72,0,($L$1-1)*10)","v":46.910000000000004},{"$f":"OFFSET('Red de transporte'!F72,0,($L$1-1)*10)","v":7.91},{"$f":"OFFSET('Red de transporte'!G72,0,($L$1-1)*10)","v":"-"},{"$f":"OFFSET('Red de transporte'!H72,0,($L$1-1)*10)","v":"-"},{"$f":"OFFSET('Red de transporte'!I72,0,($L$1-1)*10)","v":"-"},{"$f":"OFFSET('Red de transporte'!J72,0,($L$1-1)*10)","v":"-"},{"$f":"OFFSET('Red de transporte'!K72,0,($L$1-1)*10)","v":"-"},{"$f":"OFFSET('Red de transporte'!L72,0,($L$1-1)*10)","v":"-"}]
[null,"Tiempo de interrupción medio (minutos)",{"$f":"OFFSET('Red de transporte'!C73,0,($L$1-1)*10)","v":9.0779999999999994},{"$f":"OFFSET('Red de transporte'!D73,0,($L$1-1)*10)","v":27.446999999999999},{"$f":"OFFSET('Red de transporte'!E73,0,($L$1-1)*10)","v":2.7519999999999998},{"$f":"OFFSET('Red de transporte'!F73,0,($L$1-1)*10)","v":0.20699999999999999},{"$f":"OFFSET('Red de transporte'!G73,0,($L$1-1)*10)","v":"-"},{"$f":"OFFSET('Red de transporte'!H73,0,($L$1-1)*10)","v":"-"},{"$f":"OFFSET('Red de transporte'!I73,0,($L$1-1)*10)","v":"-"},{"$f":"OFFSET('Red de transporte'!J73,0,($L$1-1)*10)","v":"-"},{"$f":"OFFSET('Red de transporte'!K73,0,($L$1-1)*10)","v":"-"},{"$f":"OFFSET('Red de transporte'!L73,0,($L$1-1)*10)","v":"-"}]
[null,"TIM = ENS / Potencia media del sistema."]
[null,{"$f":"IF(MONTH(FACT)=1,\"Datos acumulados a 31 de diciembre.\",CONCATENATE(\"Datos acumulados a 31 de diciembre. Para el año \",YEAR(FACT), \" datos acumulados a \",TEXT(FACT-30,\"mmmm\"),\" de \",YEAR(FACT),\".\"))","v":"Datos acumulados a 31 de diciembre. Para el año 2018 datos acumulados a octubre de 2018."}]
[null,{"$f":"'Calidad anual Peninsular'!B15","v":"Los indicadores de calidad del servicio de cada año son auditados en septiembre del año siguiente."}]
[null,"(1) Datos acumulados a julio de 2013."]

{"sheet":"Calidad mensual Canarias","index":10,"n_rows":14,"n_cols":15,"rows_kept":14,"cut":false,"hidden":false,"merged":[[12,1,12,14],[13,1,13,14]]}
[null,null,null,null,null,null,null,null,null,null,null,null,null,null,14]
[]
[null,null,null,null,null,null,null,null,null,null,null,"   Concepto"]
[null,null,null,null,null,null,null,null,null,null,null,"   Sistema eléctrico"]
[null,null,null,null,null,null,null,null,null,null,null,"   Horizonte temporal"]
[null,null,null,null,null,null,null,null,null,null,null,"   Periodo"]
[]
[null,null,"Ene.","Feb.","Mar.","Abr.","May.","Jun.","Jul.","Ago.","Sep.","Oct.","Nov.","Dic.",{"$f":"OFFSET(Año!D4,($O$1-1),0)","v":2018}]
[]
[null,"Número de cortes",{"$f":"OFFSET('Red de transporte'!C28,0,($O$1-1)*13)","v":0},{"$f":"OFFSET('Red de transporte'!D28,0,($O$1-1)*13)","v":0},{"$f":"OFFSET('Red de transporte'!E28,0,($O$1-1)*13)","v":1},{"$f":"OFFSET('Red de transporte'!F28,0,($O$1-1)*13)","v":1},{"$f":"OFFSET('Red de transporte'!G28,0,($O$1-1)*13)","v":1},{"$f":"OFFSET('Red de transporte'!H28,0,($O$1-1)*13)","v":0},{"$f":"OFFSET('Red de transporte'!I28,0,($O$1-1)*13)","v":0},{"$f":"OFFSET('Red de transporte'!J28,0,($O$1-1)*13)","v":0},{"$f":"OFFSET('Red de transporte'!K28,0,($O$1-1)*13)","v":0},{"$f":"OFFSET('Red de transporte'!L28,0,($O$1-1)*13)","v":1},{"$f":"OFFSET('Red de transporte'!M28,0,($O$1-1)*13)","v":"-"},{"$f":"OFFSET('Red de transporte'!N28,0,($O$1-1)*13)","v":"-"},{"$f":"OFFSET('Red de transporte'!O28,0,($O$1-1)*13)","v":4}]
[null,"Energía no suministrada (MWh)",{"$f":"OFFSET('Red de transporte'!C29,0,($O$1-1)*13)","v":0},{"$f":"OFFSET('Red de transporte'!D29,0,($O$1-1)*13)","v":0},{"$f":"OFFSET('Red de transporte'!E29,0,($O$1-1)*13)","v":1.55},{"$f":"OFFSET('Red de transporte'!F29,0,($O$1-1)*13)","v":1.04},{"$f":"OFFSET('Red de transporte'!G29,0,($O$1-1)*13)","v":5.32},{"$f":"OFFSET('Red de transporte'!H29,0,($O$1-1)*13)","v":0},{"$f":"OFFSET('Red de transporte'!I29,0,($O$1-1)*13)","v":0},{"$f":"OFFSET('Red de transporte'!J29,0,($O$1-1)*13)","v":0},{"$f":"OFFSET('Red de transporte'!K29,0,($O$1-1)*13)","v":0},{"$f":"OFFSET('Red de transporte'!L29,0,($O$1-1)*13)","v":63.5},{"$f":"OFFSET('Red de transporte'!M29,0,($O$1-1)*13)","v":"-"},{"$f":"OFFSET('Red de transporte'!N29,0,($O$1-1)*13)","v":"-"},{"$f":"OFFSET('Red de transporte'!O29,0,($O$1-1)*13)","v":71.41}]
[null,"Tiempo de interrupción medio (minutos)",{"$f":"OFFSET('Red de transporte'!C30,0,($O$1-1)*13)","v":0},{"$f":"OFFSET('Red de transporte'!D30,0,($O$1-1)*13)","v":0},{"$f":"OFFSET('Red de transporte'!E30,0,($O$1-1)*13)","v":9.5000000000000001E-2},{"$f":"OFFSET('Red de transporte'!F30,0,($O$1-1)*13)","v":6.4000000000000001E-2},{"$f":"OFFSET('Red de transporte'!G30,0,($O$1-1)*13)","v":0.33200000000000002},{"$f":"OFFSET('Red de transporte'!H30,0,($O$1-1)*13)","v":0},{"$f":"OFFSET('Red de transporte'!I30,0,($O$1-1)*13)","v":0},{"$f":"OFFSET('Red de transporte'!J30,0,($O$1-1)*13)","v":0},{"$f":"OFFSET('Red de transporte'!K30,0,($O$1-1)*13)","v":0},{"$f":"OFFSET('Red de transporte'!L30,0,($O$1-1)*13)","v":3.6720000000000002},{"$f":"OFFSET('Red de transporte'!M30,0,($O$1-1)*13)","v":"-"},{"$f":"OFFSET('Red de transporte'!N30,0,($O$1-1)*13)","v":"-"},{"$f":"OFFSET('Red de transporte'!O30,0,($O$1-1)*13)","v":1.6739999999999999}]
[null,"TIM = ENS / Potencia media del sistema."]
[null,{"$f":"'Calidad anual Peninsular'!B15","v":"Los indicadores de calidad del servicio de cada año son auditados en septiembre del año siguiente."}]

{"sheet":"Indisp. anual peninsular","index":11,"n_rows":21,"n_cols":12,"rows_kept":21,"cut":false,"hidden":false,"merged":[[16,1,16,11],[17,1,17,11],[18,1,18,11],[19,1,19,11]]}
[null,null,null,null,null,null,null,null,null,null,null,2]
[]
[null,null,null,null,null,null,null,null,"Concepto"]
[null,null,null,null,null,null,null,null,"Sistema eléctrico"]
[null,null,null,null,null,null,null,null,"Horizonte temporal"]
[null,null,null,null,null,null,null,null,"Periodo"]
[]
[null,null,{"$f":"OFFSET('Red de transporte'!C75,0,($L$1-1)*10)","v":"2014"},{"$f":"OFFSET('Red de transporte'!D75,0,($L$1-1)*10)","v":"2015"},{"$f":"OFFSET('Red de transporte'!E75,0,($L$1-1)*10)","v":"2016"},{"$f":"OFFSET('Red de transporte'!F75,0,($L$1-1)*10)","v":"2017"},{"$f":"OFFSET('Red de transporte'!G75,0,($L$1-1)*10)","v":"2018"},{"$f":"OFFSET('Red de transporte'!H75,0,($L$1-1)*10)","v":"2019"},{"$f":"OFFSET('Red de transporte'!I75,0,($L$1-1)*10)","v":"2020"},{"$f":"OFFSET('Red de transporte'!J75,0,($L$1-1)*10)","v":"2021"},{"$f":"OFFSET('Red de transporte'!K75,0,($L$1-1)*10)","v":"2022"},{"$f":"OFFSET('Red de transporte'!L75,0,($L$1-1)*10)","v":"2023"}]
[]
[null,"Mantenimiento preventivo y predictivo",{"$f":"OFFSET('Red de transporte'!C77,0,($L$1-1)*10)","v":0.62},{"$f":"OFFSET('Red de transporte'!D77,0,($L$1-1)*10)","v":0.64},{"$f":"OFFSET('Red de transporte'!E77,0,($L$1-1)*10)","v":0.73},{"$f":"OFFSET('Red de transporte'!F77,0,($L$1-1)*10)","v":0.76},{"$f":"OFFSET('Red de transporte'!G77,0,($L$1-1)*10)","v":0.73},{"$f":"OFFSET('Red de transporte'!H77,0,($L$1-1)*10)","v":"-"},{"$f":"OFFSET('Red de transporte'!I77,0,($L$1-1)*10)","v":"-"},{"$f":"OFFSET('Red de transporte'!J77,0,($L$1-1)*10)","v":"-"},{"$f":"OFFSET('Red de transporte'!K77,0,($L$1-1)*10)","v":"-"},{"$f":"OFFSET('Red de transporte'!L77,0,($L$1-1)*10)","v":"-"}]
[null,"Causas ajenas al mantenimiento",{"$f":"OFFSET('Red de transporte'!C78,0,($L$1-1)*10)","v":1.02},{"$f":"OFFSET('Red de transporte'!D78,0,($L$1-1)*10)","v":1.23},{"$f":"OFFSET('Red de transporte'!E78,0,($L$1-1)*10)","v":0.84},{"$f":"OFFSET('Red de transporte'!F78,0,($L$1-1)*10)","v":0.82},{"$f":"OFFSET('Red de transporte'!G78,0,($L$1-1)*10)","v":0.91},{"$f":"OFFSET('Red de transporte'!H78,0,($L$1-1)*10)","v":"-"},{"$f":"OFFSET('Red de transporte'!I78,0,($L$1-1)*10)","v":"-"},{"$f":"OFFSET('Red de transporte'!J78,0,($L$1-1)*10)","v":"-"},{"$f":"OFFSET('Red de transporte'!K78,0,($L$1-1)*10)","v":"-"},{"$f":"OFFSET('Red de transporte'!L78,0,($L$1-1)*10)","v":"-"}]
[null,"Mantenimiento correctivo",{"$f":"OFFSET('Red de transporte'!C79,0,($L$1-1)*10)","v":0.17},{"$f":"OFFSET('Red de transporte'!D79,0,($L$1-1)*10)","v":0.18},{"$f":"OFFSET('Red de transporte'!E79,0,($L$1-1)*10)","v":0.11},{"$f":"OFFSET('Red de transporte'!F79,0,($L$1-1)*10)","v":0.12},{"$f":"OFFSET('Red de transporte'!G79,0,($L$1-1)*10)","v":0.12},{"$f":"OFFSET('Red de transporte'!H79,0,($L$1-1)*10)","v":"-"},{"$f":"OFFSET('Red de transporte'!I79,0,($L$1-1)*10)","v":"-"},{"$f":"OFFSET('Red de transporte'!J79,0,($L$1-1)*10)","v":"-"},{"$f":"OFFSET('Red de transporte'!K79,0,($L$1-1)*10)","v":"-"},{"$f":"OFFSET('Red de transporte'!L79,0,($L$1-1)*10)","v":"-"}]
[null,"Circunstancias fortuitas previstas en las condiciones de diseño",{"$f":"OFFSET('Red de transporte'!C80,0,($L$1-1)*10)","v":0},{"$f":"OFFSET('Red de transporte'!D80,0,($L$1-1)*10)","v":0.01},{"$f":"OFFSET('Red de transporte'!E80,0,($L$1-1)*10)","v":0.01},{"$f":"OFFSET('Red de transporte'!F80,0,($L$1-1)*10)","v":0.01},{"$f":"OFFSET('Red de transporte'!G80,0,($L$1-1)*10)","v":0.01},{"$f":"OFFSET('Red de transporte'!H80,0,($L$1-1)*10)","v":"-"},{"$f":"OFFSET('Red de transporte'!I80,0,($L$1-1)*10)","v":"-"},{"$f":"OFFSET('Red de transporte'!J80,0,($L$1-1)*10)","v":"-"},{"$f":"OFFSET('Red de transporte'!K80,0,($L$1-1)*10)","v":"-"},{"$f":"OFFSET('Red de transporte'!L80,0,($L$1-1)*10)","v":"-"}]
[null,"Causa de fuerza mayor o acciones de terceros",{"$f":"OFFSET('Red de transporte'!C81,0,($L$1-1)*10)","v":0.23},{"$f":"OFFSET('Red de transporte'!D81,0,($L$1-1)*10)","v":0.16},{"$f":"OFFSET('Red de transporte'!E81,0,($L$1-1)*10)","v":0.19},{"$f":"OFFSET('Red de transporte'!F81,0,($L$1-1)*10)","v":0.45},{"$f":"OFFSET('Red de transporte'!G81,0,($L$1-1)*10)","v":0.24},{"$f":"OFFSET('Red de transporte'!H81,0,($L$1-1)*10)","v":"-"},{"$f":"OFFSET('Red de transporte'!I81,0,($L$1-1)*10)","v":"-"},{"$f":"OFFSET('Red de transporte'!J81,0,($L$1-1)*10)","v":"-"},{"$f":"OFFSET('Red de transporte'!K81,0,($L$1-1)*10)","v":"-"},{"$f":"OFFSET('Red de transporte'!L81,0,($L$1-1)*10)","v":"-"}]
[null,"Sin clasificar (1)",{"$f":"OFFSET('Red de transporte'!C82,0,($L$1-1)*10)","v":0},{"$f":"OFFSET('Red de transporte'!D82,0,($L$1-1)*10)","v":0},{"$f":"OFFSET('Red de transporte'!E82,0,($L$1-1)*10)","v":0},{"$f":"OFFSET('Red de transporte'!F82,0,($L$1-1)*10)","v":0},{"$f":"OFFSET('Red de transporte'!G82,0,($L$1-1)*10)","v":0},{"$f":"OFFSET('Red de transporte'!H82,0,($L$1-1)*10)","v":"-"},{"$f":"OFFSET('Red de transporte'!I82,0,($L$1-1)*10)","v":"-"},{"$f":"OFFSET('Red de transporte'!J82,0,($L$1-1)*10)","v":"-"},{"$f":"OFFSET('Red de transporte'!K82,0,($L$1-1)*10)","v":"-"},{"$f":"OFFSET('Red de transporte'!L82,0,($L$1-1)*10)","v":"-"}]
[null,"Total (2)",{"$f":"OFFSET('Red de transporte'!C83,0,($L$1-1)*10)","v":1.81},{"$f":"OFFSET('Red de transporte'!D83,0,($L$1-1)*10)","v":2.06},{"$f":"OFFSET('Red de transporte'!E83,0,($L$1-1)*10)","v":1.67},{"$f":"OFFSET('Red de transporte'!F83,0,($L$1-1)*10)","v":1.71},{"$f":"OFFSET('Red de transporte'!G83,0,($L$1-1)*10)","v":1.77},{"$f":"OFFSET('Red de transporte'!H83,0,($L$1-1)*10)","v":"-"},{"$f":"OFFSET('Red de transporte'!I83,0,($L$1-1)*10)","v":"-"},{"$f":"OFFSET('Red de transporte'!J83,0,($L$1-1)*10)","v":"-"},{"$f":"OFFSET('Red de transporte'!K83,0,($L$1-1)*10)","v":"-"},{"$f":"OFFSET('Red de transporte'!L83,0,($L$1-1)*10)","v":"-"}]
[null,"(1) Datos facilitados por otros transportistas pendientes de clasificar."]
[null,"(2) Según lo establecido en el Real Decreto 1955/2000, para el cálculo de la indisponibilidad de la red de transporte no se incluyen las indisponibilidades por causas de fuerza mayor o acciones de terceros."]
[null,{"$f":"IF(MONTH(FACT)=1,\"Datos acumulados a 31 de diciembre.\",CONCATENATE(\"Datos acumulados a 31 de diciembre. Para el año \",YEAR(FACT), \" datos acumulados a \",TEXT(FACT-30,\"mmmm\"),\" de \",YEAR(FACT),\".\"))","v":"Datos acumulados a 31 de diciembre. Para el año 2018 datos acumulados a octubre de 2018."}]
[null,{"$f":"'Calidad anual Peninsular'!B15","v":"Los indicadores de calidad del servicio de cada año son auditados en septiembre del año siguiente."}]
[null,"(3) Datos acumulados a julio de 2013."]

{"sheet":"Indisp. mensual peninsular","index":12,"n_rows":19,"n_cols":15,"rows_kept":19,"cut":false,"hidden":false,"merged":[[16,1,16,14],[17,1,17,14],[18,1,18,14]]}
[null,null,null,null,null,null,null,null,null,null,null,null,null,null,15]
[]
[null,null,null,null,null,null,null,null,null,null,null,"   Concepto"]
[null,null,null,null,null,null,null,null,null,null,null,"   Sistema eléctrico"]
[null,null,null,null,null,null,null,null,null,null,null,"   Horizonte temporal"]
[null,null,null,null,null,null,null,null,null,null,null,"   Periodo"]
[]
[null,null,"Ene.","Feb.","Mar.","Abr.","May.","Jun.","Jul.","Ago.","Sep.","Oct.","Nov.","Dic.",{"$f":"OFFSET(Año!D3,($O$1-1),0)","v":2018}]
[]
[null,"Mantenimiento preventivo y predictivo",{"$f":"OFFSET('Red de transporte'!C34,0,($O$1-1)*13)","v":0.1},{"$f":"OFFSET('Red de transporte'!D34,0,($O$1-1)*13)","v":0.48},{"$f":"OFFSET('Red de transporte'!E34,0,($O$1-1)*13)","v":0.32},{"$f":"OFFSET('Red de transporte'!F34,0,($O$1-1)*13)","v":0.94},{"$f":"OFFSET('Red de transporte'!G34,0,($O$1-1)*13)","v":1.2},{"$f":"OFFSET('Red de transporte'!H34,0,($O$1-1)*13)","v":0.75},{"$f":"OFFSET('Red de transporte'!I34,0,($O$1-1)*13)","v":0.53},{"$f":"OFFSET('Red de transporte'!J34,0,($O$1-1)*13)","v":0.64},{"$f":"OFFSET('Red de transporte'!K34,0,($O$1-1)*13)","v":1.4},{"$f":"OFFSET('Red de transporte'!L34,0,($O$1-1)*13)","v":1.27},{"$f":"OFFSET('Red de transporte'!M34,0,($O$1-1)*13)","v":"-"},{"$f":"OFFSET('Red de transporte'!N34,0,($O$1-1)*13)","v":"-"},{"$f":"OFFSET('Red de transporte'!O34,0,($O$1-1)*13)","v":0.76}]
[null,"Causas ajenas al mantenimiento",{"$f":"OFFSET('Red de transporte'!C35,0,($O$1-1)*13)","v":0.08},{"$f":"OFFSET('Red de transporte'!D35,0,($O$1-1)*13)","v":0.38},{"$f":"OFFSET('Red de transporte'!E35,0,($O$1-1)*13)","v":0.73},{"$f":"OFFSET('Red de transporte'!F35,0,($O$1-1)*13)","v":1.1200000000000001},{"$f":"OFFSET('Red de transporte'!G35,0,($O$1-1)*13)","v":1.25},{"$f":"OFFSET('Red de transporte'!H35,0,($O$1-1)*13)","v":1.28},{"$f":"OFFSET('Red de transporte'!I35,0,($O$1-1)*13)","v":0.97},{"$f":"OFFSET('Red de transporte'!J35,0,($O$1-1)*13)","v":1.1299999999999999},{"$f":"OFFSET('Red de transporte'!K35,0,($O$1-1)*13)","v":1.38},{"$f":"OFFSET('Red de transporte'!L35,0,($O$1-1)*13)","v":1.64},{"$f":"OFFSET('Red de transporte'!M35,0,($O$1-1)*13)","v":"-"},{"$f":"OFFSET('Red de transporte'!N35,0,($O$1-1)*13)","v":"-"},{"$f":"OFFSET('Red de transporte'!O35,0,($O$1-1)*13)","v":1}]
[null,"Mantenimiento correctivo",{"$f":"OFFSET('Red de transporte'!C36,0,($O$1-1)*13)","v":0.1},{"$f":"OFFSET('Red de transporte'!D36,0,($O$1-1)*13)","v":0.28000000000000003},{"$f":"OFFSET('Red de transporte'!E36,0,($O$1-1)*13)","v":0.25},{"$f":"OFFSET('Red de transporte'!F36,0,($O$1-1)*13)","v":0.1},{"$f":"OFFSET('Red de transporte'!G36,0,($O$1-1)*13)","v":0.06},{"$f":"OFFSET('Red de transporte'!H36,0,($O$1-1)*13)","v":0.06},{"$f":"OFFSET('Red de transporte'!I36,0,($O$1-1)*13)","v":0.05},{"$f":"OFFSET('Red de transporte'!J36,0,($O$1-1)*13)","v":0.08},{"$f":"OFFSET('Red de transporte'!K36,0,($O$1-1)*13)","v":0.05},{"$f":"OFFSET('Red de transporte'!L36,0,($O$1-1)*13)","v":0.16},{"$f":"OFFSET('Red de transporte'!M36,0,($O$1-1)*13)","v":"-"},{"$f":"OFFSET('Red de transporte'!N36,0,($O$1-1)*13)","v":"-"},{"$f":"OFFSET('Red de transporte'!O36,0,($O$1-1)*13)","v":0.12}]
[null,"Circunstancias fortuitas previstas en las condiciones de diseño",{"$f":"OFFSET('Red de transporte'!C37,0,($O$1-1)*13)","v":0},{"$f":"OFFSET('Red de transporte'!D37,0,($O$1-1)*13)","v":0.03},{"$f":"OFFSET('Red de transporte'!E37,0,($O$1-1)*13)","v":0.01},{"$f":"OFFSET('Red de transporte'!F37,0,($O$1-1)*13)","v":0},{"$f":"OFFSET('Red de transporte'!G37,0,($O$1-1)*13)","v":0},{"$f":"OFFSET('Red de transporte'!H37,0,($O$1-1)*13)","v":0},{"$f":"OFFSET('Red de transporte'!I37,0,($O$1-1)*13)","v":0},{"$f":"OFFSET('Red de transporte'!J37,0,($O$1-1)*13)","v":0},{"$f":"OFFSET('Red de transporte'!K37,0,($O$1-1)*13)","v":0.01},{"$f":"OFFSET('Red de transporte'!L37,0,($O$1-1)*13)","v":0},{"$f":"OFFSET('Red de transporte'!M37,0,($O$1-1)*13)","v":"-"},{"$f":"OFFSET('Red de transporte'!N37,0,($O$1-1)*13)","v":"-"},{"$f":"OFFSET('Red de transporte'!O37,0,($O$1-1)*13)","v":0.01}]
[null,"Causa de fuerza mayor o acciones de terceros",{"$f":"OFFSET('Red de transporte'!C38,0,($O$1-1)*13)","v":0.05},{"$f":"OFFSET('Red de transporte'!D38,0,($O$1-1)*13)","v":0.01},{"$f":"OFFSET('Red de transporte'!E38,0,($O$1-1)*13)","v":0.59},{"$f":"OFFSET('Red de transporte'!F38,0,($O$1-1)*13)","v":0.51},{"$f":"OFFSET('Red de transporte'!G38,0,($O$1-1)*13)","v":0.16},{"$f":"OFFSET('Red de transporte'!H38,0,($O$1-1)*13)","v":0.2},{"$f":"OFFSET('Red de transporte'!I38,0,($O$1-1)*13)","v":0.3},{"$f":"OFFSET('Red de transporte'!J38,0,($O$1-1)*13)","v":0.17},{"$f":"OFFSET('Red de transporte'!K38,0,($O$1-1)*13)","v":0.16},{"$f":"OFFSET('Red de transporte'!L38,0,($O$1-1)*13)","v":0.33},{"$f":"OFFSET('Red de transporte'!M38,0,($O$1-1)*13)","v":"-"},{"$f":"OFFSET('Red de transporte'!N38,0,($O$1-1)*13)","v":"-"},{"$f":"OFFSET('Red de transporte'!O38,0,($O$1-1)*13)","v":0.25}]
[null,"Sin clasificar (1)",{"$f":"OFFSET('Red de transporte'!C39,0,($O$1-1)*13)","v":0},{"$f":"OFFSET('Red de transporte'!D39,0,($O$1-1)*13)","v":0},{"$f":"OFFSET('Red de transporte'!E39,0,($O$1-1)*13)","v":0},{"$f":"OFFSET('Red de transporte'!F39,0,($O$1-1)*13)","v":0},{"$f":"OFFSET('Red de transporte'!G39,0,($O$1-1)*13)","v":0},{"$f":"OFFSET('Red de transporte'!H39,0,($O$1-1)*13)","v":0},{"$f":"OFFSET('Red de transporte'!I39,0,($O$1-1)*13)","v":0},{"$f":"OFFSET('Red de transporte'!J39,0,($O$1-1)*13)","v":0},{"$f":"OFFSET('Red de transporte'!K39,0,($O$1-1)*13)","v":0},{"$f":"OFFSET('Red de transporte'!L39,0,($O$1-1)*13)","v":0},{"$f":"OFFSET('Red de transporte'!M39,0,($O$1-1)*13)","v":"-"},{"$f":"OFFSET('Red de transporte'!N39,0,($O$1-1)*13)","v":"-"},{"$f":"OFFSET('Red de transporte'!O39,0,($O$1-1)*13)","v":0}]
[null,"Total (2)",{"$f":"OFFSET('Red de transporte'!C40,0,($O$1-1)*13)","v":0.28000000000000003},{"$f":"OFFSET('Red de transporte'!D40,0,($O$1-1)*13)","v":1.17},{"$f":"OFFSET('Red de transporte'!E40,0,($O$1-1)*13)","v":1.31},{"$f":"OFFSET('Red de transporte'!F40,0,($O$1-1)*13)","v":2.16},{"$f":"OFFSET('Red de transporte'!G40,0,($O$1-1)*13)","v":2.5099999999999998},{"$f":"OFFSET('Red de transporte'!H40,0,($O$1-1)*13)","v":2.09},{"$f":"OFFSET('Red de transporte'!I40,0,($O$1-1)*13)","v":1.55},{"$f":"OFFSET('Red de transporte'!J40,0,($O$1-1)*13)","v":1.85},{"$f":"OFFSET('Red de transporte'!K40,0,($O$1-1)*13)","v":2.84},{"$f":"OFFSET('Red de transporte'!L40,0,($O$1-1)*13)","v":3.07},{"$f":"OFFSET('Red de transporte'!M40,0,($O$1-1)*13)","v":"-"},{"$f":"OFFSET('Red de transporte'!N40,0,($O$1-1)*13)","v":"-"},{"$f":"OFFSET('Red de transporte'!O40,0,($O$1-1)*13)","v":1.89}]
[null,"(1) Datos facilitados por otros transportistas pendientes de clasificar."]
[null,"(2) Según lo establecido en el Real Decreto 1955/2000, para el cálculo de la indisponibilidad de la red de transporte no se incluyen las indisponibilidades por causas de fuerza mayor o acciones de terceros."]
[null,{"$f":"'Calidad anual Peninsular'!B15","v":"Los indicadores de calidad del servicio de cada año son auditados en septiembre del año siguiente."}]

{"sheet":"Indisp. anual Baleares","index":13,"n_rows":21,"n_cols":12,"rows_kept":21,"cut":false,"hidden":false,"merged":[[16,1,16,11],[17,1,17,11],[18,1,18,11],[19,1,19,11]]}
[null,null,null,null,null,null,null,null,null,null,null,2]
[]
[null,null,null,null,null,null,null,null,"Concepto"]
[null,null,null,null,null,null,null,null,"Sistema eléctrico"]
[null,null,null,null,null,null,null,null,"Horizonte temporal"]
[null,null,null,null,null,null,null,null,"Periodo"]
[]
[null,null,{"$f":"OFFSET('Red de transporte'!C85,0,($L$1-1)*10)","v":"2015"},{"$f":"OFFSET('Red de transporte'!D85,0,($L$1-1)*10)","v":"2016"},{"$f":"OFFSET('Red de transporte'!E85,0,($L$1-1)*10)","v":"2017"},{"$f":"OFFSET('Red de transporte'!F85,0,($L$1-1)*10)","v":"2018"},{"$f":"OFFSET('Red de transporte'!G85,0,($L$1-1)*10)","v":"2019"},{"$f":"OFFSET('Red de transporte'!H85,0,($L$1-1)*10)","v":"2020"},{"$f":"OFFSET('Red de transporte'!I85,0,($L$1-1)*10)","v":"2021"},{"$f":"OFFSET('Red de transporte'!J85,0,($L$1-1)*10)","v":"2022"},{"$f":"OFFSET('Red de transporte'!K85,0,($L$1-1)*10)","v":"2023"},{"$f":"OFFSET('Red de transporte'!L85,0,($L$1-1)*10)","v":"2024"}]
[]
[null,"Mantenimiento preventivo y predictivo",{"$f":"OFFSET('Red de transporte'!C86,0,($L$1-1)*10)","v":0.8},{"$f":"OFFSET('Red de transporte'!D86,0,($L$1-1)*10)","v":0.67},{"$f":"OFFSET('Red de transporte'!E86,0,($L$1-1)*10)","v":0.8},{"$f":"OFFSET('Red de transporte'!F86,0,($L$1-1)*10)","v":1.21},{"$f":"OFFSET('Red de transporte'!G86,0,($L$1-1)*10)","v":"-"},{"$f":"OFFSET('Red de transporte'!H86,0,($L$1-1)*10)","v":"-"},{"$f":"OFFSET('Red de transporte'!I86,0,($L$1-1)*10)","v":"-"},{"$f":"OFFSET('Red de transporte'!J86,0,($L$1-1)*10)","v":"-"},{"$f":"OFFSET('Red de transporte'!K86,0,($L$1-1)*10)","v":"-"},{"$f":"OFFSET('Red de transporte'!L86,0,($L$1-1)*10)","v":"-"}]
[null,"Causas ajenas al mantenimiento",{"$f":"OFFSET('Red de transporte'!C87,0,($L$1-1)*10)","v":2.2800000000000002},{"$f":"OFFSET('Red de transporte'!D87,0,($L$1-1)*10)","v":2.27},{"$f":"OFFSET('Red de transporte'!E87,0,($L$1-1)*10)","v":1.29},{"$f":"OFFSET('Red de transporte'!F87,0,($L$1-1)*10)","v":1.05},{"$f":"OFFSET('Red de transporte'!G87,0,($L$1-1)*10)","v":"-"},{"$f":"OFFSET('Red de transporte'!H87,0,($L$1-1)*10)","v":"-"},{"$f":"OFFSET('Red de transporte'!I87,0,($L$1-1)*10)","v":"-"},{"$f":"OFFSET('Red de transporte'!J87,0,($L$1-1)*10)","v":"-"},{"$f":"OFFSET('Red de transporte'!K87,0,($L$1-1)*10)","v":"-"},{"$f":"OFFSET('Red de transporte'!L87,0,($L$1-1)*10)","v":"-"}]
[null,"Mantenimiento correctivo",{"$f":"OFFSET('Red de transporte'!C88,0,($L$1-1)*10)","v":0.04},{"$f":"OFFSET('Red de transporte'!D88,0,($L$1-1)*10)","v":0.11},{"$f":"OFFSET('Red de transporte'!E88,0,($L$1-1)*10)","v":0.06},{"$f":"OFFSET('Red de transporte'!F88,0,($L$1-1)*10)","v":0.03},{"$f":"OFFSET('Red de transporte'!G88,0,($L$1-1)*10)","v":"-"},{"$f":"OFFSET('Red de transporte'!H88,0,($L$1-1)*10)","v":"-"},{"$f":"OFFSET('Red de transporte'!I88,0,($L$1-1)*10)","v":"-"},{"$f":"OFFSET('Red de transporte'!J88,0,($L$1-1)*10)","v":"-"},{"$f":"OFFSET('Red de transporte'!K88,0,($L$1-1)*10)","v":"-"},{"$f":"OFFSET('Red de transporte'!L88,0,($L$1-1)*10)","v":"-"}]
[null,"Circunstancias fortuitas previstas en las condiciones de diseño",{"$f":"OFFSET('Red de transporte'!C89,0,($L$1-1)*10)","v":0.01},{"$f":"OFFSET('Red de transporte'!D89,0,($L$1-1)*10)","v":0.01},{"$f":"OFFSET('Red de transporte'!E89,0,($L$1-1)*10)","v":0},{"$f":"OFFSET('Red de transporte'!F89,0,($L$1-1)*10)","v":0},{"$f":"OFFSET('Red de transporte'!G89,0,($L$1-1)*10)","v":"-"},{"$f":"OFFSET('Red de transporte'!H89,0,($L$1-1)*10)","v":"-"},{"$f":"OFFSET('Red de transporte'!I89,0,($L$1-1)*10)","v":"-"},{"$f":"OFFSET('Red de transporte'!J89,0,($L$1-1)*10)","v":"-"},{"$f":"OFFSET('Red de transporte'!K89,0,($L$1-1)*10)","v":"-"},{"$f":"OFFSET('Red de transporte'!L89,0,($L$1-1)*10)","v":"-"}]
[null,"Causa de fuerza mayor o acciones de terceros",{"$f":"OFFSET('Red de transporte'!C90,0,($L$1-1)*10)","v":0.14000000000000001},{"$f":"OFFSET('Red de transporte'!D90,0,($L$1-1)*10)","v":0.04},{"$f":"OFFSET('Red de transporte'!E90,0,($L$1-1)*10)","v":0},{"$f":"OFFSET('Red de transporte'!F90,0,($L$1-1)*10)","v":0.01},{"$f":"OFFSET('Red de transporte'!G90,0,($L$1-1)*10)","v":"-"},{"$f":"OFFSET('Red de transporte'!H90,0,($L$1-1)*10)","v":"-"},{"$f":"OFFSET('Red de transporte'!I90,0,($L$1-1)*10)","v":"-"},{"$f":"OFFSET('Red de transporte'!J90,0,($L$1-1)*10)","v":"-"},{"$f":"OFFSET('Red de transporte'!K90,0,($L$1-1)*10)","v":"-"},{"$f":"OFFSET('Red de transporte'!L90,0,($L$1-1)*10)","v":"-"}]
[null,"Sin clasificar (1)",{"$f":"OFFSET('Red de transporte'!C91,0,($L$1-1)*10)","v":0},{"$f":"OFFSET('Red de transporte'!D91,0,($L$1-1)*10)","v":0},{"$f":"OFFSET('Red de transporte'!E91,0,($L$1-1)*10)","v":0},{"$f":"OFFSET('Red de transporte'!F91,0,($L$1-1)*10)","v":0},{"$f":"OFFSET('Red de transporte'!G91,0,($L$1-1)*10)","v":"-"},{"$f":"OFFSET('Red de transporte'!H91,0,($L$1-1)*10)","v":"-"},{"$f":"OFFSET('Red de transporte'!I91,0,($L$1-1)*10)","v":"-"},{"$f":"OFFSET('Red de transporte'!J91,0,($L$1-1)*10)","v":"-"},{"$f":"OFFSET('Red de transporte'!K91,0,($L$1-1)*10)","v":"-"},{"$f":"OFFSET('Red de transporte'!L91,0,($L$1-1)*10)","v":"-"}]
[null,"Total (2)",{"$f":"OFFSET('Red de transporte'!C92,0,($L$1-1)*10)","v":3.12},{"$f":"OFFSET('Red de transporte'!D92,0,($L$1-1)*10)","v":3.06},{"$f":"OFFSET('Red de transporte'!E92,0,($L$1-1)*10)","v":2.15},{"$f":"OFFSET('Red de transporte'!F92,0,($L$1-1)*10)","v":2.29},{"$f":"OFFSET('Red de transporte'!G92,0,($L$1-1)*10)","v":"-"},{"$f":"OFFSET('Red de transporte'!H92,0,($L$1-1)*10)","v":"-"},{"$f":"OFFSET('Red de transporte'!I92,0,($L$1-1)*10)","v":"-"},{"$f":"OFFSET('Red de transporte'!J92,0,($L$1-1)*10)","v":"-"},{"$f":"OFFSET('Red de transporte'!K92,0,($L$1-1)*10)","v":"-"},{"$f":"OFFSET('Red de transporte'!L92,0,($L$1-1)*10)","v":"-"}]
[null,"(1) Datos facilitados por otros transportistas pendientes de clasificar."]
[null,"(2) Según lo establecido en el Real Decreto 1955/2000, para el cálculo de la indisponibilidad de la red de transporte no se incluyen las indisponibilidades por causas de fuerza mayor o acciones de terceros."]
[null,{"$f":"IF(MONTH(FACT)=1,\"Datos acumulados a 31 de diciembre.\",CONCATENATE(\"Datos acumulados a 31 de diciembre. Para el año \",YEAR(FACT), \" datos acumulados a \",TEXT(FACT-30,\"mmmm\"),\" de \",YEAR(FACT),\".\"))","v":"Datos acumulados a 31 de diciembre. Para el año 2018 datos acumulados a octubre de 2018."}]
[null,{"$f":"'Calidad anual Peninsular'!B15","v":"Los indicadores de calidad del servicio de cada año son auditados en septiembre del año siguiente."}]
[null,"(3) Datos acumulados a julio de 2013."]

{"sheet":"Indisp. mensual Baleares","index":14,"n_rows":19,"n_cols":15,"rows_kept":19,"cut":false,"hidden":false,"merged":[[16,1,16,14],[18,1,18,11],[18,12,18,14],[17,1,17,13]]}
[null,null,null,null,null,null,null,null,null,null,null,null,null,null,14]
[]
[null,null,null,null,null,null,null,null,null,null,null,"   Concepto"]
[null,null,null,null,null,null,null,null,null,null,null,"   Sistema eléctrico"]
[null,null,null,null,null,null,null,null,null,null,null,"   Horizonte temporal"]
[null,null,null,null,null,null,null,null,null,null,null,"   Periodo"]
[]
[null,null,"Ene.","Feb.","Mar.","Abr.","May.","Jun.","Jul.","Ago.","Sep.","Oct.","Nov.","Dic.",{"$f":"OFFSET(Año!D4,($O$1-1),0)","v":2018}]
[]
[null,"Mantenimiento preventivo y predictivo",{"$f":"OFFSET('Red de transporte'!C43,0,($O$1-1)*13)","v":0.78},{"$f":"OFFSET('Red de transporte'!D43,0,($O$1-1)*13)","v":1.1299999999999999},{"$f":"OFFSET('Red de transporte'!E43,0,($O$1-1)*13)","v":1.2},{"$f":"OFFSET('Red de transporte'!F43,0,($O$1-1)*13)","v":2.19},{"$f":"OFFSET('Red de transporte'!G43,0,($O$1-1)*13)","v":1.53},{"$f":"OFFSET('Red de transporte'!H43,0,($O$1-1)*13)","v":0.88},{"$f":"OFFSET('Red de transporte'!I43,0,($O$1-1)*13)","v":0.48},{"$f":"OFFSET('Red de transporte'!J43,0,($O$1-1)*13)","v":1.07},{"$f":"OFFSET('Red de transporte'!K43,0,($O$1-1)*13)","v":1.64},{"$f":"OFFSET('Red de transporte'!L43,0,($O$1-1)*13)","v":1.72},{"$f":"OFFSET('Red de transporte'!M43,0,($O$1-1)*13)","v":"-"},{"$f":"OFFSET('Red de transporte'!N43,0,($O$1-1)*13)","v":"-"},{"$f":"OFFSET('Red de transporte'!O43,0,($O$1-1)*13)","v":1.26}]
[null,"Causas ajenas al mantenimiento",{"$f":"OFFSET('Red de transporte'!C44,0,($O$1-1)*13)","v":0.26},{"$f":"OFFSET('Red de transporte'!D44,0,($O$1-1)*13)","v":0.59},{"$f":"OFFSET('Red de transporte'!E44,0,($O$1-1)*13)","v":0.71},{"$f":"OFFSET('Red de transporte'!F44,0,($O$1-1)*13)","v":3.49},{"$f":"OFFSET('Red de transporte'!G44,0,($O$1-1)*13)","v":2.48},{"$f":"OFFSET('Red de transporte'!H44,0,($O$1-1)*13)","v":1.4},{"$f":"OFFSET('Red de transporte'!I44,0,($O$1-1)*13)","v":0.18},{"$f":"OFFSET('Red de transporte'!J44,0,($O$1-1)*13)","v":0.31},{"$f":"OFFSET('Red de transporte'!K44,0,($O$1-1)*13)","v":0.1},{"$f":"OFFSET('Red de transporte'!L44,0,($O$1-1)*13)","v":2.23},{"$f":"OFFSET('Red de transporte'!M44,0,($O$1-1)*13)","v":"-"},{"$f":"OFFSET('Red de transporte'!N44,0,($O$1-1)*13)","v":"-"},{"$f":"OFFSET('Red de transporte'!O44,0,($O$1-1)*13)","v":1.17}]
[null,"Mantenimiento correctivo",{"$f":"OFFSET('Red de transporte'!C45,0,($O$1-1)*13)","v":0.03},{"$f":"OFFSET('Red de transporte'!D45,0,($O$1-1)*13)","v":0.01},{"$f":"OFFSET('Red de transporte'!E45,0,($O$1-1)*13)","v":0.01},{"$f":"OFFSET('Red de transporte'!F45,0,($O$1-1)*13)","v":0.02},{"$f":"OFFSET('Red de transporte'!G45,0,($O$1-1)*13)","v":0.02},{"$f":"OFFSET('Red de transporte'!H45,0,($O$1-1)*13)","v":0.04},{"$f":"OFFSET('Red de transporte'!I45,0,($O$1-1)*13)","v":0},{"$f":"OFFSET('Red de transporte'!J45,0,($O$1-1)*13)","v":0.01},{"$f":"OFFSET('Red de transporte'!K45,0,($O$1-1)*13)","v":0.09},{"$f":"OFFSET('Red de transporte'!L45,0,($O$1-1)*13)","v":0.24},{"$f":"OFFSET('Red de transporte'!M45,0,($O$1-1)*13)","v":"-"},{"$f":"OFFSET('Red de transporte'!N45,0,($O$1-1)*13)","v":"-"},{"$f":"OFFSET('Red de transporte'!O45,0,($O$1-1)*13)","v":0.05}]
[null,"Circunstancias fortuitas previstas en las condiciones de diseño",{"$f":"OFFSET('Red de transporte'!C46,0,($O$1-1)*13)","v":0},{"$f":"OFFSET('Red de transporte'!D46,0,($O$1-1)*13)","v":0},{"$f":"OFFSET('Red de transporte'!E46,0,($O$1-1)*13)","v":0},{"$f":"OFFSET('Red de transporte'!F46,0,($O$1-1)*13)","v":0},{"$f":"OFFSET('Red de transporte'!G46,0,($O$1-1)*13)","v":0},{"$f":"OFFSET('Red de transporte'!H46,0,($O$1-1)*13)","v":0},{"$f":"OFFSET('Red de transporte'!I46,0,($O$1-1)*13)","v":0},{"$f":"OFFSET('Red de transporte'!J46,0,($O$1-1)*13)","v":0},{"$f":"OFFSET('Red de transporte'!K46,0,($O$1-1)*13)","v":0},{"$f":"OFFSET('Red de transporte'!L46,0,($O$1-1)*13)","v":0},{"$f":"OFFSET('Red de transporte'!M46,0,($O$1-1)*13)","v":"-"},{"$f":"OFFSET('Red de transporte'!N46,0,($O$1-1)*13)","v":"-"},{"$f":"OFFSET('Red de transporte'!O46,0,($O$1-1)*13)","v":0}]
[null,"Causa de fuerza mayor o acciones de terceros",{"$f":"OFFSET('Red de transporte'!C47,0,($O$1-1)*13)","v":0.01},{"$f":"OFFSET('Red de transporte'!D47,0,($O$1-1)*13)","v":0},{"$f":"OFFSET('Red de transporte'!E47,0,($O$1-1)*13)","v":0},{"$f":"OFFSET('Red de transporte'!F47,0,($O$1-1)*13)","v":0.03},{"$f":"OFFSET('Red de transporte'!G47,0,($O$1-1)*13)","v":0},{"$f":"OFFSET('Red de transporte'!H47,0,($O$1-1)*13)","v":0},{"$f":"OFFSET('Red de transporte'!I47,0,($O$1-1)*13)","v":0.01},{"$f":"OFFSET('Red de transporte'!J47,0,($O$1-1)*13)","v":0.02},{"$f":"OFFSET('Red de transporte'!K47,0,($O$1-1)*13)","v":0},{"$f":"OFFSET('Red de transporte'!L47,0,($O$1-1)*13)","v":0.16},{"$f":"OFFSET('Red de transporte'!M47,0,($O$1-1)*13)","v":"-"},{"$f":"OFFSET('Red de transporte'!N47,0,($O$1-1)*13)","v":"-"},{"$f":"OFFSET('Red de transporte'!O47,0,($O$1-1)*13)","v":0.02}]
[null,"Sin clasificar (1)",{"$f":"OFFSET('Red de transporte'!C48,0,($O$1-1)*13)","v":0},{"$f":"OFFSET('Red de transporte'!D48,0,($O$1-1)*13)","v":0},{"$f":"OFFSET('Red de transporte'!E48,0,($O$1-1)*13)","v":0},{"$f":"OFFSET('Red de transporte'!F48,0,($O$1-1)*13)","v":0},{"$f":"OFFSET('Red de transporte'!G48,0,($O$1-1)*13)","v":0},{"$f":"OFFSET('Red de transporte'!H48,0,($O$1-1)*13)","v":0},{"$f":"OFFSET('Red de transporte'!I48,0,($O$1-1)*13)","v":0},{"$f":"OFFSET('Red de transporte'!J48,0,($O$1-1)*13)","v":0},{"$f":"OFFSET('Red de transporte'!K48,0,($O$1-1)*13)","v":0},{"$f":"OFFSET('Red de transporte'!L48,0,($O$1-1)*13)","v":0},{"$f":"OFFSET('Red de transporte'!M48,0,($O$1-1)*13)","v":"-"},{"$f":"OFFSET('Red de transporte'!N48,0,($O$1-1)*13)","v":"-"},{"$f":"OFFSET('Red de transporte'!O48,0,($O$1-1)*13)","v":0}]
[null,"Total (2)",{"$f":"OFFSET('Red de transporte'!C49,0,($O$1-1)*13)","v":1.07},{"$f":"OFFSET('Red de transporte'!D49,0,($O$1-1)*13)","v":1.73},{"$f":"OFFSET('Red de transporte'!E49,0,($O$1-1)*13)","v":1.92},{"$f":"OFFSET('Red de transporte'!F49,0,($O$1-1)*13)","v":5.7},{"$f":"OFFSET('Red de transporte'!G49,0,($O$1-1)*13)","v":4.03},{"$f":"OFFSET('Red de transporte'!H49,0,($O$1-1)*13)","v":2.3199999999999998},{"$f":"OFFSET('Red de transporte'!I49,0,($O$1-1)*13)","v":0.66},{"$f":"OFFSET('Red de transporte'!J49,0,($O$1-1)*13)","v":1.39},{"$f":"OFFSET('Red de transporte'!K49,0,($O$1-1)*13)","v":1.83},{"$f":"OFFSET('Red de transporte'!L49,0,($O$1-1)*13)","v":4.1900000000000004},{"$f":"OFFSET('Red de transporte'!M49,0,($O$1-1)*13)","v":"-"},{"$f":"OFFSET('Red de transporte'!N49,0,($O$1-1)*13)","v":"-"},{"$f":"OFFSET('Red de transporte'!O49,0,($O$1-1)*13)","v":2.48}]
[null,"(1) Datos facilitados por otros transportistas pendientes de clasificar."]
[null,"(2) Según lo establecido en el Real Decreto 1955/2000, para el cálculo de la indisponibilidad de la red de transporte no se incluyen las indisponibilidades por causas de fuerza mayor o acciones de terceros."]
[null,{"$f":"'Calidad anual Peninsular'!B15","v":"Los indicadores de calidad del servicio de cada año son auditados en septiembre del año siguiente."}]

{"sheet":"Indisp. anual Canarias","index":15,"n_rows":20,"n_cols":12,"rows_kept":20,"cut":false,"hidden":false,"merged":[[16,1,16,14],[17,1,17,11],[18,1,18,11]]}
[null,null,null,null,null,null,null,null,null,null,null,2]
[]
[null,null,null,null,null,null,null,null,"Concepto"]
[null,null,null,null,null,null,null,null,"Sistema eléctrico"]
[null,null,null,null,null,null,null,null,"Horizonte temporal"]
[null,null,null,null,null,null,null,null,"Periodo"]
[]
[null,null,{"$f":"OFFSET('Red de transporte'!C94,0,($L$1-1)*10)","v":"2015"},{"$f":"OFFSET('Red de transporte'!D94,0,($L$1-1)*10)","v":"2016"},{"$f":"OFFSET('Red de transporte'!E94,0,($L$1-1)*10)","v":"2017"},{"$f":"OFFSET('Red de transporte'!F94,0,($L$1-1)*10)","v":"2018"},{"$f":"OFFSET('Red de transporte'!G94,0,($L$1-1)*10)","v":"2019"},{"$f":"OFFSET('Red de transporte'!H94,0,($L$1-1)*10)","v":"2020"},{"$f":"OFFSET('Red de transporte'!I94,0,($L$1-1)*10)","v":"2021"},{"$f":"OFFSET('Red de transporte'!J94,0,($L$1-1)*10)","v":"2022"},{"$f":"OFFSET('Red de transporte'!K94,0,($L$1-1)*10)","v":"2023"},{"$f":"OFFSET('Red de transporte'!L94,0,($L$1-1)*10)","v":"2024"}]
[]
[null,"Mantenimiento preventivo y predictivo",{"$f":"OFFSET('Red de transporte'!C95,0,($L$1-1)*10)","v":0.65},{"$f":"OFFSET('Red de transporte'!D95,0,($L$1-1)*10)","v":0.68},{"$f":"OFFSET('Red de transporte'!E95,0,($L$1-1)*10)","v":0.78},{"$f":"OFFSET('Red de transporte'!F95,0,($L$1-1)*10)","v":1.01},{"$f":"OFFSET('Red de transporte'!G95,0,($L$1-1)*10)","v":"-"},{"$f":"OFFSET('Red de transporte'!H95,0,($L$1-1)*10)","v":"-"},{"$f":"OFFSET('Red de transporte'!I95,0,($L$1-1)*10)","v":"-"},{"$f":"OFFSET('Red de transporte'!J95,0,($L$1-1)*10)","v":"-"},{"$f":"OFFSET('Red de transporte'!K95,0,($L$1-1)*10)","v":"-"},{"$f":"OFFSET('Red de transporte'!L95,0,($L$1-1)*10)","v":"-"}]
[null,"Causas ajenas al mantenimiento",{"$f":"OFFSET('Red de transporte'!C96,0,($L$1-1)*10)","v":1.2},{"$f":"OFFSET('Red de transporte'!D96,0,($L$1-1)*10)","v":0.81},{"$f":"OFFSET('Red de transporte'!E96,0,($L$1-1)*10)","v":1.03},{"$f":"OFFSET('Red de transporte'!F96,0,($L$1-1)*10)","v":0.67},{"$f":"OFFSET('Red de transporte'!G96,0,($L$1-1)*10)","v":"-"},{"$f":"OFFSET('Red de transporte'!H96,0,($L$1-1)*10)","v":"-"},{"$f":"OFFSET('Red de transporte'!I96,0,($L$1-1)*10)","v":"-"},{"$f":"OFFSET('Red de transporte'!J96,0,($L$1-1)*10)","v":"-"},{"$f":"OFFSET('Red de transporte'!K96,0,($L$1-1)*10)","v":"-"},{"$f":"OFFSET('Red de transporte'!L96,0,($L$1-1)*10)","v":"-"}]
[null,"Mantenimiento correctivo",{"$f":"OFFSET('Red de transporte'!C97,0,($L$1-1)*10)","v":1.41},{"$f":"OFFSET('Red de transporte'!D97,0,($L$1-1)*10)","v":0.45},{"$f":"OFFSET('Red de transporte'!E97,0,($L$1-1)*10)","v":7.0000000000000007E-2},{"$f":"OFFSET('Red de transporte'!F97,0,($L$1-1)*10)","v":0.03},{"$f":"OFFSET('Red de transporte'!G97,0,($L$1-1)*10)","v":"-"},{"$f":"OFFSET('Red de transporte'!H97,0,($L$1-1)*10)","v":"-"},{"$f":"OFFSET('Red de transporte'!I97,0,($L$1-1)*10)","v":"-"},{"$f":"OFFSET('Red de transporte'!J97,0,($L$1-1)*10)","v":"-"},{"$f":"OFFSET('Red de transporte'!K97,0,($L$1-1)*10)","v":"-"},{"$f":"OFFSET('Red de transporte'!L97,0,($L$1-1)*10)","v":"-"}]
[null,"Circunstancias fortuitas previstas en las condiciones de diseño",{"$f":"OFFSET('Red de transporte'!C98,0,($L$1-1)*10)","v":0},{"$f":"OFFSET('Red de transporte'!D98,0,($L$1-1)*10)","v":0},{"$f":"OFFSET('Red de transporte'!E98,0,($L$1-1)*10)","v":0},{"$f":"OFFSET('Red de transporte'!F98,0,($L$1-1)*10)","v":0},{"$f":"OFFSET('Red de transporte'!G98,0,($L$1-1)*10)","v":"-"},{"$f":"OFFSET('Red de transporte'!H98,0,($L$1-1)*10)","v":"-"},{"$f":"OFFSET('Red de transporte'!I98,0,($L$1-1)*10)","v":"-"},{"$f":"OFFSET('Red de transporte'!J98,0,($L$1-1)*10)","v":"-"},{"$f":"OFFSET('Red de transporte'!K98,0,($L$1-1)*10)","v":"-"},{"$f":"OFFSET('Red de transporte'!L98,0,($L$1-1)*10)","v":"-"}]
[null,"Causa de fuerza mayor o acciones de terceros",{"$f":"OFFSET('Red de transporte'!C99,0,($L$1-1)*10)","v":0.08},{"$f":"OFFSET('Red de transporte'!D99,0,($L$1-1)*10)","v":0.01},{"$f":"OFFSET('Red de transporte'!E99,0,($L$1-1)*10)","v":0.01},{"$f":"OFFSET('Red de transporte'!F99,0,($L$1-1)*10)","v":0.05},{"$f":"OFFSET('Red de transporte'!G99,0,($L$1-1)*10)","v":"-"},{"$f":"OFFSET('Red de transporte'!H99,0,($L$1-1)*10)","v":"-"},{"$f":"OFFSET('Red de transporte'!I99,0,($L$1-1)*10)","v":"-"},{"$f":"OFFSET('Red de transporte'!J99,0,($L$1-1)*10)","v":"-"},{"$f":"OFFSET('Red de transporte'!K99,0,($L$1-1)*10)","v":"-"},{"$f":"OFFSET('Red de transporte'!L99,0,($L$1-1)*10)","v":"-"}]
[null,"Sin clasificar",{"$f":"OFFSET('Red de transporte'!C100,0,($L$1-1)*10)","v":0},{"$f":"OFFSET('Red de transporte'!D100,0,($L$1-1)*10)","v":0},{"$f":"OFFSET('Red de transporte'!E100,0,($L$1-1)*10)","v":0},{"$f":"OFFSET('Red de transporte'!F100,0,($L$1-1)*10)","v":0},{"$f":"OFFSET('Red de transporte'!G100,0,($L$1-1)*10)","v":"-"},{"$f":"OFFSET('Red de transporte'!H100,0,($L$1-1)*10)","v":"-"},{"$f":"OFFSET('Red de transporte'!I100,0,($L$1-1)*10)","v":"-"},{"$f":"OFFSET('Red de transporte'!J100,0,($L$1-1)*10)","v":"-"},{"$f":"OFFSET('Red de transporte'!K100,0,($L$1-1)*10)","v":"-"},{"$f":"OFFSET('Red de transporte'!L100,0,($L$1-1)*10)","v":"-"}]
[null,"Total (1)",{"$f":"OFFSET('Red de transporte'!C101,0,($L$1-1)*10)","v":3.26},{"$f":"OFFSET('Red de transporte'!D101,0,($L$1-1)*10)","v":1.94},{"$f":"OFFSET('Red de transporte'!E101,0,($L$1-1)*10)","v":1.88},{"$f":"OFFSET('Red de transporte'!F101,0,($L$1-1)*10)","v":1.71},{"$f":"OFFSET('Red de transporte'!G101,0,($L$1-1)*10)","v":"-"},{"$f":"OFFSET('Red de transporte'!H101,0,($L$1-1)*10)","v":"-"},{"$f":"OFFSET('Red de transporte'!I101,0,($L$1-1)*10)","v":"-"},{"$f":"OFFSET('Red de transporte'!J101,0,($L$1-1)*10)","v":"-"},{"$f":"OFFSET('Red de transporte'!K101,0,($L$1-1)*10)","v":"-"},{"$f":"OFFSET('Red de transporte'!L101,0,($L$1-1)*10)","v":"-"}]
[null,"(1) Según lo establecido en el Real Decreto 1955/2000, para el cálculo de la indisponibilidad de la red de transporte no se incluyen las indisponibilidades por causas de fuerza mayor o acciones de terceros."]
[null,{"$f":"IF(MONTH(FACT)=1,\"Datos acumulados a 31 de diciembre.\",CONCATENATE(\"Datos acumulados a 31 de diciembre. Para el año \",YEAR(FACT), \" datos acumulados a \",TEXT(FACT-30,\"mmmm\"),\" de \",YEAR(FACT),\".\"))","v":"Datos acumulados a 31 de diciembre. Para el año 2018 datos acumulados a octubre de 2018."}]
[null,{"$f":"'Calidad anual Peninsular'!B15","v":"Los indicadores de calidad del servicio de cada año son auditados en septiembre del año siguiente."}]
[null,"(3) Datos acumulados a julio de 2013."]

{"sheet":"Indisp. mensual Canarias","index":16,"n_rows":18,"n_cols":15,"rows_kept":18,"cut":false,"hidden":false,"merged":[[9,0,11,0],[16,1,16,14],[19,1,19,14],[17,1,17,14]]}
[null,null,null,null,null,null,null,null,null,null,null,null,null,null,14]
[]
[null,null,null,null,null,null,null,null,null,null,null,"   Concepto"]
[null,null,null,null,null,null,null,null,null,null,null,"   Sistema eléctrico"]
[null,null,null,null,null,null,null,null,null,null,null,"   Horizonte temporal"]
[null,null,null,null,null,null,null,null,null,null,null,"   Periodo"]
[]
[null,null,"Ene.","Feb.","Mar.","Abr.","May.","Jun.","Jul.","Ago.","Sep.","Oct.","Nov.","Dic.",{"$f":"OFFSET(Año!D4,($O$1-1),0)","v":2018}]
[]
[null,"Mantenimiento preventivo y predictivo",{"$f":"OFFSET('Red de transporte'!C52,0,($O$1-1)*13)","v":0.13},{"$f":"OFFSET('Red de transporte'!D52,0,($O$1-1)*13)","v":0.34},{"$f":"OFFSET('Red de transporte'!E52,0,($O$1-1)*13)","v":0.64},{"$f":"OFFSET('Red de transporte'!F52,0,($O$1-1)*13)","v":0.7},{"$f":"OFFSET('Red de transporte'!G52,0,($O$1-1)*13)","v":0.35},{"$f":"OFFSET('Red de transporte'!H52,0,($O$1-1)*13)","v":0.33},{"$f":"OFFSET('Red de transporte'!I52,0,($O$1-1)*13)","v":0.17},{"$f":"OFFSET('Red de transporte'!J52,0,($O$1-1)*13)","v":0.19},{"$f":"OFFSET('Red de transporte'!K52,0,($O$1-1)*13)","v":0.34},{"$f":"OFFSET('Red de transporte'!L52,0,($O$1-1)*13)","v":0.56000000000000005},{"$f":"OFFSET('Red de transporte'!M52,0,($O$1-1)*13)","v":"-"},{"$f":"OFFSET('Red de transporte'!N52,0,($O$1-1)*13)","v":"-"},{"$f":"OFFSET('Red de transporte'!O52,0,($O$1-1)*13)","v":0.37}]
[null,"Causas ajenas al mantenimiento",{"$f":"OFFSET('Red de transporte'!C53,0,($O$1-1)*13)","v":0.23},{"$f":"OFFSET('Red de transporte'!D53,0,($O$1-1)*13)","v":0.46},{"$f":"OFFSET('Red de transporte'!E53,0,($O$1-1)*13)","v":0.04},{"$f":"OFFSET('Red de transporte'!F53,0,($O$1-1)*13)","v":7.0000000000000007E-2},{"$f":"OFFSET('Red de transporte'!G53,0,($O$1-1)*13)","v":0.26},{"$f":"OFFSET('Red de transporte'!H53,0,($O$1-1)*13)","v":0.9},{"$f":"OFFSET('Red de transporte'!I53,0,($O$1-1)*13)","v":1.36},{"$f":"OFFSET('Red de transporte'!J53,0,($O$1-1)*13)","v":1.52},{"$f":"OFFSET('Red de transporte'!K53,0,($O$1-1)*13)","v":1.55},{"$f":"OFFSET('Red de transporte'!L53,0,($O$1-1)*13)","v":1.31},{"$f":"OFFSET('Red de transporte'!M53,0,($O$1-1)*13)","v":"-"},{"$f":"OFFSET('Red de transporte'!N53,0,($O$1-1)*13)","v":"-"},{"$f":"OFFSET('Red de transporte'!O53,0,($O$1-1)*13)","v":0.78}]
[null,"Mantenimiento correctivo",{"$f":"OFFSET('Red de transporte'!C54,0,($O$1-1)*13)","v":0.04},{"$f":"OFFSET('Red de transporte'!D54,0,($O$1-1)*13)","v":0.01},{"$f":"OFFSET('Red de transporte'!E54,0,($O$1-1)*13)","v":0.01},{"$f":"OFFSET('Red de transporte'!F54,0,($O$1-1)*13)","v":0.06},{"$f":"OFFSET('Red de transporte'!G54,0,($O$1-1)*13)","v":0.04},{"$f":"OFFSET('Red de transporte'!H54,0,($O$1-1)*13)","v":0.04},{"$f":"OFFSET('Red de transporte'!I54,0,($O$1-1)*13)","v":0.03},{"$f":"OFFSET('Red de transporte'!J54,0,($O$1-1)*13)","v":0.02},{"$f":"OFFSET('Red de transporte'!K54,0,($O$1-1)*13)","v":0.01},{"$f":"OFFSET('Red de transporte'!L54,0,($O$1-1)*13)","v":0.11},{"$f":"OFFSET('Red de transporte'!M54,0,($O$1-1)*13)","v":"-"},{"$f":"OFFSET('Red de transporte'!N54,0,($O$1-1)*13)","v":"-"},{"$f":"OFFSET('Red de transporte'!O54,0,($O$1-1)*13)","v":0.04}]
[null,"Circunstancias fortuitas previstas en las condiciones de diseño",{"$f":"OFFSET('Red de transporte'!C55,0,($O$1-1)*13)","v":0},{"$f":"OFFSET('Red de transporte'!D55,0,($O$1-1)*13)","v":0},{"$f":"OFFSET('Red de transporte'!E55,0,($O$1-1)*13)","v":0.01},{"$f":"OFFSET('Red de transporte'!F55,0,($O$1-1)*13)","v":0.01},{"$f":"OFFSET('Red de transporte'!G55,0,($O$1-1)*13)","v":0},{"$f":"OFFSET('Red de transporte'!H55,0,($O$1-1)*13)","v":0},{"$f":"OFFSET('Red de transporte'!I55,0,($O$1-1)*13)","v":0},{"$f":"OFFSET('Red de transporte'!J55,0,($O$1-1)*13)","v":0},{"$f":"OFFSET('Red de transporte'!K55,0,($O$1-1)*13)","v":0},{"$f":"OFFSET('Red de transporte'!L55,0,($O$1-1)*13)","v":0},{"$f":"OFFSET('Red de transporte'!M55,0,($O$1-1)*13)","v":"-"},{"$f":"OFFSET('Red de transporte'!N55,0,($O$1-1)*13)","v":"-"},{"$f":"OFFSET('Red de transporte'!O55,0,($O$1-1)*13)","v":0}]
[null,"Causa de fuerza mayor o acciones de terceros",{"$f":"OFFSET('Red de transporte'!C56,0,($O$1-1)*13)","v":0.05},{"$f":"OFFSET('Red de transporte'!D56,0,($O$1-1)*13)","v":0.03},{"$f":"OFFSET('Red de transporte'!E56,0,($O$1-1)*13)","v":7.0000000000000007E-2},{"$f":"OFFSET('Red de transporte'!F56,0,($O$1-1)*13)","v":0.14000000000000001},{"$f":"OFFSET('Red de transporte'!G56,0,($O$1-1)*13)","v":0},{"$f":"OFFSET('Red de transporte'!H56,0,($O$1-1)*13)","v":0.16},{"$f":"OFFSET('Red de transporte'!I56,0,($O$1-1)*13)","v":0},{"$f":"OFFSET('Red de transporte'!J56,0,($O$1-1)*13)","v":0.01},{"$f":"OFFSET('Red de transporte'!K56,0,($O$1-1)*13)","v":0},{"$f":"OFFSET('Red de transporte'!L56,0,($O$1-1)*13)","v":0.05},{"$f":"OFFSET('Red de transporte'!M56,0,($O$1-1)*13)","v":"-"},{"$f":"OFFSET('Red de transporte'!N56,0,($O$1-1)*13)","v":"-"},{"$f":"OFFSET('Red de transporte'!O56,0,($O$1-1)*13)","v":0.05}]
[null,"Sin clasificar",{"$f":"OFFSET('Red de transporte'!C57,0,($O$1-1)*13)","v":0},{"$f":"OFFSET('Red de transporte'!D57,0,($O$1-1)*13)","v":0},{"$f":"OFFSET('Red de transporte'!E57,0,($O$1-1)*13)","v":0},{"$f":"OFFSET('Red de transporte'!F57,0,($O$1-1)*13)","v":0},{"$f":"OFFSET('Red de transporte'!G57,0,($O$1-1)*13)","v":0},{"$f":"OFFSET('Red de transporte'!H57,0,($O$1-1)*13)","v":0},{"$f":"OFFSET('Red de transporte'!I57,0,($O$1-1)*13)","v":0},{"$f":"OFFSET('Red de transporte'!J57,0,($O$1-1)*13)","v":0},{"$f":"OFFSET('Red de transporte'!K57,0,($O$1-1)*13)","v":0},{"$f":"OFFSET('Red de transporte'!L57,0,($O$1-1)*13)","v":0.04},{"$f":"OFFSET('Red de transporte'!M57,0,($O$1-1)*13)","v":"-"},{"$f":"OFFSET('Red de transporte'!N57,0,($O$1-1)*13)","v":"-"},{"$f":"OFFSET('Red de transporte'!O57,0,($O$1-1)*13)","v":0}]
[null,"Total (1)",{"$f":"OFFSET('Red de transporte'!C58,0,($O$1-1)*13)","v":0.4},{"$f":"OFFSET('Red de transporte'!D58,0,($O$1-1)*13)","v":0.81},{"$f":"OFFSET('Red de transporte'!E58,0,($O$1-1)*13)","v":0.7},{"$f":"OFFSET('Red de transporte'!F58,0,($O$1-1)*13)","v":0.84},{"$f":"OFFSET('Red de transporte'!G58,0,($O$1-1)*13)","v":0.65},{"$f":"OFFSET('Red de transporte'!H58,0,($O$1-1)*13)","v":1.27},{"$f":"OFFSET('Red de transporte'!I58,0,($O$1-1)*13)","v":1.56},{"$f":"OFFSET('Red de transporte'!J58,0,($O$1-1)*13)","v":1.73},{"$f":"OFFSET('Red de transporte'!K58,0,($O$1-1)*13)","v":1.9},{"$f":"OFFSET('Red de transporte'!L58,0,($O$1-1)*13)","v":2.02},{"$f":"OFFSET('Red de transporte'!M58,0,($O$1-1)*13)","v":"-"},{"$f":"OFFSET('Red de transporte'!N58,0,($O$1-1)*13)","v":"-"},{"$f":"OFFSET('Red de transporte'!O58,0,($O$1-1)*13)","v":1.19}]
[null,"(1) Según lo establecido en el Real Decreto 1955/2000, para el cálculo de la indisponibilidad de la red de transporte no se incluyen las indisponibilidades por causas de fuerza mayor o acciones de terceros."]
[null,{"$f":"'Calidad anual Peninsular'!B15","v":"Los indicadores de calidad del servicio de cada año son auditados en septiembre del año siguiente."}]

{"sheet":"Red de transporte","index":17,"n_rows":106,"n_cols":210,"rows_kept":106,"cut":false,"hidden":true,"merged":[]}
[]
[null,"Datos RdT peninsular",1990,1991,1992,1993,1994,1995,1996,1997,1998,1999,2000,2001,2002,2003,2004,2005,2006,2007,2008,2009,2010,2011,2012,2013,2014,2015,2016,2017,2018,2019,2020]
[null,"km de circuito a 400 kV",12686,12883,13222,13611.17,13737.17,13969.73,14083.63,14243.65,14538.47,14538.47,14918,15364.268999999998,16066.739,16592.458999999999,16840.612000000001,16845.694,17051.9434,17190.606400000001,17764.621000000006,18056.470000000008,18792.418999999998,19671.349999999999,20108.846000000001,20639.478000000003,21093.728000000003,21183.826000000001,21619.966,21728.155000000002,21732.688999999998,"-","-"]
[null,"km de circuito  ≤ 220 kV",15034.5,15108.94,15356.14,15441.94,15585.94,15628.94,15733.539999999999,15776.14,15875.92,15974.92,16077.74,16121.466999999999,16296.157999999999,16347.167999999998,16467.071799999994,16532.799899999995,16755.729060000005,16819.933060000003,17177.70406,17310.092059999995,17403.404000000002,18003.668000000005,18372.541060000003,18645.841060000002,18784.958560000006,18925.261560000006,19013.238560000009,19038.601270000006,19069.701270000005,"-","-"]
[null,"Total km",27720.5,27991.940000000002,28578.14,29053.11,29323.11,29598.67,29817.17,30019.79,30414.39,30513.39,30995.739999999998,31485.735999999997,32362.896999999997,32939.626999999993,33307.683799999999,33378.493899999994,33807.672460000002,34010.53946,34942.325060000003,35366.562060000004,36195.823000000004,37675.018000000004,38481.387060000008,39285.319060000009,39878.686560000009,40109.087560000007,40633.204560000013,40766.756270000013,40802.390270000004,"-","-"]
[]
[null,"Datos RdT Islas Baleares",1998,1999,2000,2001,2002,2003,2004,2005,2006,2007,2008,2009,2010,2011,2012,2013,2014,2015,2016,2017,2018,2019,2020,2021,2022,2023,2024,2025,2026,2027]
[null,"km de circuito a 220 kV ",163,163,163,163,165,165,165,165,177,176.9,176.9,184.904,184.90400000000002,430.37200000000001,430.37200000000001,430.37200000000001,431.08800000000002,431.36,432.214,432.214,432.214,"-","-","-","-","-","-","-","-","-"]
[null,"km de circuito ≤ 132 kV",945,958,973,974,990,997,1002,971,1003,1053.72,1074.72,1083.9670000000001,1095.278,1110.1440000000002,1113.1490000000001,1113.1490000000001,1113.884,1242.3219999999999,1367.8219999999999,1376.105,1376.1900000000003,"-","-","-","-","-","-","-","-","-"]
[null,"Total km",1108,1121,1136,1137,1155,1162,1167,1136,1180,1230.6200000000001,1251.6200000000001,1268.8710000000001,1280.182,1540.5160000000003,1543.5210000000002,1543.5210000000002,1544.972,1673.6819999999998,1800.0359999999998,1808.319,1808.4040000000002,"-","-","-","-","-","-","-","-","-"]
[]
[null,"Datos RdT Islas Canarias",1998,1999,2000,2001,2002,2003,2004,2005,2006,2007,2008,2009,2010,2011,2012,2013,2014,2015,2016,2017,2018,2019,2020,2021,2022,2023,2024,2025,2026,2027]
[null,"km de circuito a 220 kV ",160,160,160,160,160,164,164,164,163,163.35,163.35,163.15299999999999,163.35300000000001,163.35300000000001,163.35300000000001,163.35300000000001,163.35300000000001,215.86700000000002,220.43700000000001,220.24300000000002,220.24300000000002,"-","-","-","-","-","-","-","-","-"]
[null,"km de circuito ≤ 132 kV",831,868,882,885,890,893,893,892,990,993,1014.952,1071.9570000000001,1125.6969999999999,1125.6969999999999,1125.6969999999999,1125.6969999999999,1125.6969999999999,1131.0919999999999,1133.9119999999998,1134.8539999999998,1232.8999999999999,"-","-","-","-","-","-","-","-","-"]
[null,"Total km",991,1028,1042,1045,1050,1057,1057,1056,1153,1156.3499999999999,1178.3019999999999,1235.1100000000001,1289.05,1289.05,1289.05,1289.05,1289.05,1346.9589999999998,1354.3489999999997,1355.0969999999998,1453.1429999999998,"-","-","-","-","-","-","-","-","-"]
[]
[null,"Continuidad del suministro mensual peninsular","2003-01-01","2003-02-01","2003-03-01","2003-04-01","2003-05-01","2003-06-01","2003-07-01","2003-08-01","2003-09-01","2003-10-01","2003-11-01","2003-12-01","2003","2004-01-01","2004-02-01","2004-03-01","2004-04-01","2004-05-01","2004-06-01","2004-07-01","2004-08-01","2004-09-01","2004-10-01","2004-11-01","2004-12-01","2004","2005-01-01","2005-02-01","2005-03-01","2005-04-01","2005-05-01","2005-06-01","2005-07-01","2005-08-01","2005-09-01","2005-10-01","2005-11-01","2005-12-01","2005","2006-01-01","2006-02-01","2006-03-01","2006-04-01","2006-05-01","2006-06-01","2006-07-01","2006-08-01","2006-09-01","2006-10-01","2006-11-01","2006-12-01","2006","2007-01-01","2007-02-01","2007-03-01","2007-04-01","2007-05-01","2007-06-01","2007-07-01","2007-08-01","2007-09-01","2007-10-01","2007-11-01","2007-12-01","2007","2008-01-01","2008-02-01","2008-03-01","2008-04-01","2008-05-01","2008-06-01","2008-07-01","2008-08-01","2008-09-01","2008-10-01","2008-11-01","2008-12-01","2008","2009-01-01","2009-02-01","2009-03-01","2009-04-01","2009-05-01","2009-06-01","2009-07-01","2009-08-01","2009-09-01","2009-10-01","2009-11-01","2009-12-01","2009","2010-01-01","2010-02-01","2010-03-01","2010-04-01","2010-05-01","2010-06-01","2010-07-01","2010-08-01","2010-09-01","2010-10-01","2010-11-01","2010-12-01","2010","2011-01-01","2011-02-01","2011-03-01","2011-04-01","2011-05-01","2011-06-01","2011-07-01","2011-08-01","2011-09-01","2011-10-01","2011-11-01","2011-12-01","2011","2012-01-01","2012-02-01","2012-03-01","2012-04-01","2012-05-01","2012-06-01","2012-07-01","2012-08-01","2012-09-01","2012-10-01","2012-11-01","2012-12-01","2012","2013-01-01","2013-02-01","2013-03-01","2013-04-01","2013-05-01","2013-06-01","2013-07-01","2013-08-01","2013-09-01","2013-10-01","2013-11-01","2013-12-01","2013","2014-01-01","2014-02-01","2014-03-01","2014-04-01","2014-05-01","2014-06-01","2014-07-01","2014-08-01","2014-09-01","2014-10-01","2014-11-01","2014-12-01","2014","2015-01-01","2015-02-01","2015-03-01","2015-04-01","2015-05-01","2015-06-01","2015-07-01","2015-08-01","2015-09-01","2015-10-01","2015-11-01","2015-12-01","2015","2016-01-01","2016-02-01","2016-03-01","2016-04-01","2016-05-01","2016-06-01","2016-07-01","2016-08-01","2016-09-01","2016-10-01","2016-11-01","2016-12-01","2016","2017-01-01","2017-02-01","2017-03-01","2017-04-01","2017-05-01","2017-06-01","2017-07-01","2017-08-01","2017-09-01","2017-10-01","2017-11-01","2017-12-01","2017","2018-01-01","2018-02-01","2018-03-01","2018-04-01","2018-05-01","2018-06-01","2018-07-01","2018-08-01","2018-09-01","2018-10-01","2018-11-01","2018-12-01","2018"]
[null,"Número de cortes",5,0,0,1,1,3,1,4,3,1,2,4,25,0,2,1,0,2,1,3,1,4,3,3,4,24,0,0,1,1,1,7,1,2,2,3,2,2,22,2,1,4,2,3,1,4,4,4,6,5,4,40,2,7,5,4,2,1,0,2,2,2,6,1,34,1,3,2,4,3,3,1,2,2,6,2,2,31,3,1,1,3,3,3,1,6,3,3,3,2,32,5,1,2,3,4,5,3,2,2,7,3,3,40,3,0,2,0,0,4,7,1,2,3,4,6,32,1,4,2,3,3,4,1,1,2,1,0,2,24,0,1,0,0,2,2,2,3,2,2,2,2,18,3,0,3,0,1,2,4,3,2,1,2,3,24,2,0,1,2,1,1,3,0,2,1,1,4,18,2,2,1,2,0,1,1,2,1,1,2,0,15,1,0,1,1,1,1,3,2,0,1,1,0,12,0,1,1,1,2,2,1,1,2,0,"-","-",11]
[null,"Energía no suministrada mensual (MWh)",105.97,0,0,5,13,72.08,14.5,203.47,2.5099999999999998,29.33,13.34,7.03,466.23,0,4.5199999999999996,6.8100000000000005,0,6.9,0.2,14.829999999999998,4.59,279.47999999999996,6.27,859.47,66.58,1249.6500000000001,0,0,0.31,1.76,7.5,392.28,2.5299999999999998,5.9600000000000009,42.09,60.310000000000009,5.1100000000000003,30.939999999999998,548.79,4.2,398.3,10.27,67.78,11.42,3.28,75.440000000000012,11.969999999999999,16.709999999999997,37.229999999999997,212.78000000000003,86.420000000000016,935.8,6.3100000000000005,40.630000000000003,246.18,1.5,4.29,1.91,0,23.080000000000002,17.91,137.5,277.48,0.33,757.16,2.4500000000000002,168.56,2.14,147.16999999999999,46.25,47.02,2.5,2.14,4.8,142.87,4.63,2.9899999999999998,573.54,41.744500000000002,0.32,1.6140000000000001,5.35,18.270000000000003,15.7606,12.28,68.63000000000001,4.6999999999999993,28.020000000000003,2.6,238.21,437.4991,42.01,6.25,1.33,32.07,713.3900000000001,326.39,128.9,1.51,104.26,196.91666000000001,8.01,9.4499999999999993,1570.54,9.43,0,1.1099999999999999,0,0,36.04,40.57,0.09,52.900000000000006,71.28,26.700000000000003,41.57,279.69,2.1,3.33,9.16,5.63,0.94000000000000006,11.33,0.5,1.1499999999999999,6.9,21.9,0,69.820000000000007,132.77000000000001,0,16,0,0,30.45,407.91,0.41000000000000003,6.13,1.32,15.43,582.27,96.26,1156.18,98.970000000000013,0,31.470000000000002,0,1.1200000000000001,2.78,0.91,0.49999999999999994,13.81,1.87,0.19,52.719999999999992,204.34000000000003,0.23,0,8.8000000000000007,1.8800000000000001,0.09,0.11,1.05,0,12.42,19.64,0.08,8.4700000000000006,52.769999999999996,1.5149999999999999,3.31,0.05,1.137,0,0.49,16.91,9.0500000000000007,22.48,3.5030000000000001,19.52,0,77.965000000000003,0.08,0,22.75,6.53,1.45,1.45,7.55,7.0200000000000005,0,12.89,0.433,0,60.152999999999999,0,6.5000000000000002E-2,17.77,0.41,5.43,0.17499999999999999,8.75,174.98,0.38,0,"-","-",207.95999999999998]
[null,"Tiempo de interrupción medio mensual (minutos)",0.23799999999999999,0,0,1.2999999999999999E-2,3.4000000000000002E-2,0.16700000000000001,3.3000000000000002E-2,0.48799999999999999,6.0000000000000001E-3,7.0999999999999994E-2,3.1E-2,1.6E-2,1.095,0,0.01,1.4999999999999999E-2,0,1.7000000000000001E-2,0,3.2000000000000001E-2,1.0999999999999999E-2,0.627,1.4999999999999999E-2,1.853,0.14199999999999999,2.798,0,0,1E-3,4.0000000000000001E-3,1.7999999999999999E-2,0.83099999999999996,5.0000000000000001E-3,1.4E-2,9.5000000000000001E-2,0.13800000000000001,1.0999999999999999E-2,6.0999999999999999E-2,1.1759999999999999,8.0000000000000002E-3,0.76,2.1000000000000001E-2,0.158,2.5000000000000001E-2,7.0000000000000001E-3,0.14699999999999999,2.5999999999999999E-2,3.5000000000000003E-2,8.2000000000000003E-2,0.45200000000000001,0.184,1.9390000000000001,1.2E-2,7.8E-2,0.48899999999999999,3.0000000000000001E-3,8.9999999999999993E-3,4.0000000000000001E-3,0,4.9000000000000002E-2,3.6999999999999998E-2,0.28999999999999998,0.53300000000000003,1E-3,1.5229999999999999,5.0000000000000001E-3,0.314,4.0000000000000001E-3,0.29899999999999999,0.10100000000000001,9.9000000000000005E-2,5.0000000000000001E-3,4.0000000000000001E-3,0.01,0.30499999999999999,8.9999999999999993E-3,6.0000000000000001E-3,1.147,7.9000000000000001E-2,1E-3,3.0000000000000001E-3,1.2E-2,4.2000000000000003E-2,3.3000000000000002E-2,2.4E-2,0.14399999999999999,0.01,6.2E-2,5.0000000000000001E-3,0.47499999999999998,0.91,0.08,1.2E-2,3.0000000000000001E-3,7.0000000000000007E-2,1.5580000000000001,0.69099999999999995,0.28199999999999997,3.0000000000000001E-3,0.218,0.43099999999999999,1.6E-2,1.7999999999999999E-2,3.1669999999999998,1.7999999999999999E-2,0,2E-3,0,0,7.3999999999999996E-2,8.3000000000000004E-2,0,0.109,0.158,5.6000000000000001E-2,8.5999999999999993E-2,0.57699999999999996,4.0000000000000001E-3,6.0000000000000001E-3,1.9E-2,1.2999999999999999E-2,2E-3,2.4E-2,1E-3,2E-3,1.4999999999999999E-2,0.05,0,0.14599999999999999,0.27800000000000002,0,3.1E-2,0,0,7.0000000000000007E-2,0.92,1E-3,1.2999999999999999E-2,3.0000000000000001E-3,3.5000000000000003E-2,1.2290000000000001,0.19800000000000001,2.4670000000000001,0.2,0,6.7000000000000004E-2,0,3.0000000000000001E-3,6.0000000000000001E-3,2E-3,1E-3,2.9000000000000001E-2,4.0000000000000001E-3,0,0.11,0.441,4.4999999999999999E-4,0,1.8630000000000001E-2,4.3400000000000001E-3,2.0000000000000001E-4,2.3000000000000001E-4,2E-3,0,2.7390000000000001E-2,4.4450000000000003E-2,1.7000000000000001E-4,1.8089999999999998E-2,0.112,3.15E-3,6.6299999999999996E-3,1E-4,2.47E-3,0,1.0499999999999999E-3,3.3950000000000001E-2,1.8839999999999999E-2,4.6640000000000001E-2,7.8899999999999994E-3,4.088E-2,0,0.16400000000000001,1.4999999999999999E-4,0,4.8070000000000002E-2,1.498E-2,3.2000000000000002E-3,2.8900000000000002E-3,1.5049999999999999E-2,1.4370000000000001E-2,0,2.8410000000000001E-2,8.8999999999999995E-4,0,0.125,0,1.2E-4,3.5979999999999998E-2,8.8999999999999995E-4,1.208E-2,3.6999999999999999E-4,1.762E-2,0.35552,7.9000000000000001E-4,0,"-","-",0.43]
[]
[null,"Continuidad del suministro mensual Islas Baleares","2005-01-01","2005-02-01","2005-03-01","2005-04-01","2005-05-01","2005-06-01","2005-07-01","2005-08-01","2005-09-01","2005-10-01","2005-11-01","2005-12-01",2005,"2006-01-01","2006-02-01","2006-03-01","2006-04-01","2006-05-01","2006-06-01","2006-07-01","2006-08-01","2006-09-01","2006-10-01","2006-11-01","2006-12-01","2006","2007-01-01","2007-02-01","2007-03-01","2007-04-01","2007-05-01","2007-06-01","2007-07-01","2007-08-01","2007-09-01","2007-10-01","2007-11-01","2007-12-01","2007","2008-01-01","2008-02-01","2008-03-01","2008-04-01","2008-05-01","2008-06-01","2008-07-01","2008-08-01","2008-09-01","2008-10-01","2008-11-01","2008-12-01","2008","2009-01-01","2009-02-01","2009-03-01","2009-04-01","2009-05-01","2009-06-01","2009-07-01","2009-08-01","2009-09-01","2009-10-01","2009-11-01","2009-12-01","2009","2010-01-01","2010-02-01","2010-03-01","2010-04-01","2010-05-01","2010-06-01","2010-07-01","2010-08-01","2010-09-01","2010-10-01","2010-11-01","2010-12-01","2010","2011-01-01","2011-02-01","2011-03-01","2011-04-01","2011-05-01","2011-06-01","2011-07-01","2011-08-01","2011-09-01","2011-10-01","2011-11-01","2011-12-01","2011","2012-01-01","2012-02-01","2012-03-01","2012-04-01","2012-05-01","2012-06-01","2012-07-01","2012-08-01","2012-09-01","2012-10-01","2012-11-01","2012-12-01","2012","2013-01-01","2013-02-01","2013-03-01","2013-04-01","2013-05-01","2013-06-01","2013-07-01","2013-08-01","2013-09-01","2013-10-01","2013-11-01","2013-12-01","2013","2014-01-01","2014-02-01","2014-03-01","2014-04-01","2014-05-01","2014-06-01","2014-07-01","2014-08-01","2014-09-01","2014-10-01","2014-11-01","2014-12-01","2014","2015-01-01","2015-02-01","2015-03-01","2015-04-01","2015-05-01","2015-06-01","2015-07-01","2015-08-01","2015-09-01","2015-10-01","2015-11-01","2015-12-01","2015","2016-01-01","2016-02-01","2016-03-01","2016-04-01","2016-05-01","2016-06-01","2016-07-01","2016-08-01","2016-09-01","2016-10-01","2016-11-01","2016-12-01","2016","2017-01-01","2017-02-01","2017-03-01","2017-04-01","2017-05-01","2017-06-01","2017-07-01","2017-08-01","2017-09-01","2017-10-01","2017-11-01","2017-12-01","2017","2018-01-01","2018-02-01","2018-03-01","2018-04-01","2018-05-01","2018-06-01","2018-07-01","2018-08-01","2018-09-01","2018-10-01","2018-11-01","2018-12-01","2018"]
[null,"Número de cortes",0,0,0,1,0,1,0,0,2,0,0,0,4,1,1,0,0,0,0,0,0,0,0,1,0,3,0,1,1,1,0,0,1,0,0,2,0,0,6,0,0,0,1,0,0,0,0,0,1,0,1,3,0,0,0,0,0,0,1,0,2,0,1,2,6,0,0,0,0,1,0,0,0,0,1,1,0,3,0,0,1,0,2,1,1,0,0,0,1,0,6,0,0,1,0,0,0,0,0,1,0,1,1,4,1,1,0,0,0,0,0,1,0,1,0,0,4,0,0,0,1,2,0,0,0,1,0,1,0,5,0,0,0,1,1,1,0,0,0,0,2,0,5,1,0,0,0,0,0,0,0,0,0,0,0,1,1,0,0,2,0,0,1,0,0,0,1,0,5,0,0,0,0,0,0,0,1,1,0,"-","-",2]
[null,"Energía no suministrada mensual (MWh)",0,0,0,54.132999999999996,0,14.47,0,0,173.72200000000001,0,0,0,242.32499999999999,21.829999923706055,22.950000762939453,0,0,0,0,0,0,0,0,1.2899999618530273,0,46.070000648498535,0,1.4700000286102295,2.4300000667572021,2.7400000095367432,0,0,317.29998779296875,0,0,2.4800000190734863,0,0,326.41998791694641,0,0,0,4.7800002098083496,0,0,0,0,0,1.059999942779541,0,1.6399999856948853,7.4800001382827759,0,0,0,0,0,0,33.220001220703125,0,3.4319486618041992,0,0.56000000238418579,1.9200000166893005,39.131949901580811,0,0,0,0,2.93,0,0,0,0,1.97,3.64,0,8.5399999999999991,0,0,22.2,0,0.46,3.79,1.01,0,0,0,11.23,0,38.69,0,0,5.34,0,0,0,0,0,0.36,0,0.83,0.96,7.49,0.57999999999999996,65.63,0,0,0,0,0,1.45,0,13.3,0,0,80.959999999999994,0,0,0,2.6,0.43000000000000005,0,0,0,8.66,0,1.1200000000000001,0,12.810000000000002,0,0,0,3.15,22.52,1.87,0,0,0,0,1.82,0,29.36,0.3,0,0,0,0,0,0,0,0,0,0,0,0.3,9.49,0,0,1.55,0,0,21.16,0,0,0,0.87,0,33.07,0,0,0,0,0,0,0,33.11,0.7,0,"-","-",33.81]
[null,"Tiempo de interrupción medio mensual (minutos)",0,0,0,6.0061041989573951,0,1.2187712558242942,0,0,15.205653443571896,0,0,0,22.305140462600828,1.9643524690828151,2.0606500091911881,0,0,0,0,0,0,0,0,0.14904782331140878,0,4.1202479563041683,0,0.14036370971068848,0.23515415977671833,0.27504095456644312,0,0,22.867803020155257,0,0,0.23357427864936689,0,0,28.725354620799834,0,0,0,0.47501577833637909,0,0,0,0,0,0.10024277165329637,0,0.14427725854251713,0.64398754530944313,0,0,0,0,0,0,2.2445199358435031,0,0.28104490758843331,0,6.2669029456404263E-2,0.18611349530640511,3.4119884308630857,0,0,0,0,0.3,0,0,0,0,0.19400000000000001,0.39100000000000001,0,0.76900000000000002,0,0,2.1789999999999998,0,4.4999999999999998E-2,0.32500000000000001,7.4999999999999997E-2,0,0,0,1.3080000000000001,0,3.5409999999999999,0,0,0.54800000000000004,0,0,0,0,0,0.03,0,9.7000000000000003E-2,0.10100000000000001,0.67800000000000005,5.8000000000000003E-2,6.2430000000000003,0,0,0,0,0,0.10199999999999999,0,1.2849999999999999,0,0,7.5,0,0,0,0.28899999999999998,4.3999999999999997E-2,0,0,0,0.65600000000000003,0,0.13600000000000001,0,1.2050000000000001,0,0,0,0.34300000000000003,2.234,0.154,0,0,0,0,0.21199999999999999,0,2.6619999999999999,3.3000000000000002E-2,0,0,0,0,0,0,0,0,0,0,0,2.7E-2,0.88700000000000001,0,0,0.161,0,0,1.3919999999999999,0,0,0,9.2999999999999999E-2,0,2.883,0,0,0,0,0,0,0,2.1,5.1999999999999998E-2,0,"-","-",2.8250000000000002]
[]
[null,"Continuidad del suministro mensual Islas Canarias","2005-01-01","2005-02-01","2005-03-01","2005-04-01","2005-05-01","2005-06-01","2005-07-01","2005-08-01","2005-09-01","2005-10-01","2005-11-01","2005-12-01",2005,"2006-01-01","2006-02-01","2006-03-01","2006-04-01","2006-05-01","2006-06-01","2006-07-01","2006-08-01","2006-09-01","2006-10-01","2006-11-01","2006-12-01","2006","2007-01-01","2007-02-01","2007-03-01","2007-04-01","2007-05-01","2007-06-01","2007-07-01","2007-08-01","2007-09-01","2007-10-01","2007-11-01","2007-12-01","2007","2008-01-01","2008-02-01","2008-03-01","2008-04-01","2008-05-01","2008-06-01","2008-07-01","2008-08-01","2008-09-01","2008-10-01","2008-11-01","2008-12-01","2008","2009-01-01","2009-02-01","2009-03-01","2009-04-01","2009-05-01","2009-06-01","2009-07-01","2009-08-01","2009-09-01","2009-10-01","2009-11-01","2009-12-01","2009","2010-01-01","2010-02-01","2010-03-01","2010-04-01","2010-05-01","2010-06-01","2010-07-01","2010-08-01","2010-09-01","2010-10-01","2010-11-01","2010-12-01","2010","2011-01-01","2011-02-01","2011-03-01","2011-04-01","2011-05-01","2011-06-01","2011-07-01","2011-08-01","2011-09-01","2011-10-01","2011-11-01","2011-12-01","2011","2012-01-01","2012-02-01","2012-03-01","2012-04-01","2012-05-01","2012-06-01","2012-07-01","2012-08-01","2012-09-01","2012-10-01","2012-11-01","2012-12-01","2012","2013-01-01","2013-02-01","2013-03-01","2013-04-01","2013-05-01","2013-06-01","2013-07-01","2013-08-01","2013-09-01","2013-10-01","2013-11-01","2013-12-01","2013","2014-01-01","2014-02-01","2014-03-01","2014-04-01","2014-05-01","2014-06-01","2014-07-01","2014-08-01","2014-09-01","2014-10-01","2014-11-01","2014-12-01","2014","2015-01-01","2015-02-01","2015-03-01","2015-04-01","2015-05-01","2015-06-01","2015-07-01","2015-08-01","2015-09-01","2015-10-01","2015-11-01","2015-12-01","2015","2016-01-01","2016-02-01","2016-03-01","2016-04-01","2016-05-01","2016-06-01","2016-07-01","2016-08-01","2016-09-01","2016-10-01","2016-11-01","2016-12-01","2016","2017-01-01","2017-02-01","2017-03-01","2017-04-01","2017-05-01","2017-06-01","2017-07-01","2017-08-01","2017-09-01","2017-10-01","2017-11-01","2017-12-01","2017","2018-01-01","2018-02-01","2018-03-01","2018-04-01","2018-05-01","2018-06-01","2018-07-01","2018-08-01","2018-09-01","2018-10-01","2018-11-01","2018-12-01","2018"]
[null,"Número de cortes",4,3,0,0,3,1,6,2,1,3,1,3,27,1,1,0,0,3,0,0,1,0,2,0,2,10,2,0,0,0,1,1,0,1,1,3,0,2,11,0,1,1,2,0,1,1,3,1,0,0,0,10,1,0,1,1,1,0,0,0,0,0,0,0,4,2,6,3,0,1,1,0,2,0,0,3,0,18,0,0,0,1,0,1,0,0,0,0,0,0,2,0,0,0,0,0,1,0,1,1,0,0,2,5,0,1,1,0,0,0,0,0,0,1,2,0,5,0,0,0,0,0,1,1,0,0,1,4,0,7,1,0,2,0,0,1,0,3,1,2,1,1,12,1,0,0,1,0,2,3,0,3,3,0,1,14,0,5,0,1,0,1,0,0,2,0,3,0,12,0,0,1,1,1,0,0,0,0,1,"-","-",4]
[null,"Energía no suministrada mensual (MWh)",19.5,18.190000000000001,0,0,333.16,2,152.11000000000001,97.99,22.13,32.28,1.5,145.78,824.64,27.293055555555554,11.864999999999998,0,0,26.23833333333333,0,0,75.6875,0,32.630833333333335,0,6.6150000000000002,180.32972222222227,28.614999999999998,0,0,0,65.959166666666675,14.700000000000001,0,20.648194444444442,0.8719027777777778,139.61222222222224,0,10.554166666666665,280.96065277777774,0,96.435000000000002,0.60000000000000009,51.613805555555551,0,43.422499999999999,5.7783333333333324,813.40016666666668,31.660000000000004,0,0,0,1042.9098055555555,0.40500000000000003,0,1666.4449999999997,5.3333333333333339,6.355833333333333,0,0,0,0,0,0,0,1678.5391666666665,10.384666666666666,2477.0212986111114,957.48145555555561,0,93.620193055555561,3.6874500000000001,0,535.38637916666664,0,0,11.977326388888891,0,4089.5587694444439,0,0,0,12.567074999999999,0,4.7014750000000003,0,0,0,0,0,0,17.268549999999998,0,0,0,0,0,4.5029444444444442,0,3.1071388888888891,2.7289166666666667,0,0,213.8,224.14,0,6.83,2.9,0,0,0,0,0,0,5.67,56.620000000000005,0,72.02000000000001,0,0,0,0,0,0.8,83.29,0,0,3.62,59.86,0,147.57,24.14,0,11.879999999999999,0,0,5.61,0,13.62,6.67,17.329999999999998,70.25,0.217,149.71700000000001,3.05,0,0,0.19,0,47.17,12.86,0,379.06,10.050000000000001,0,4.7300000000000004,457.11,0,18.049999999999997,0,2.63,0,5.05,0,0,11.16,0,10.020000000000001,0,46.910000000000004,0,0,1.55,1.04,5.32,0,0,0,0,63.5,"-","-",71.41]
[null,"Tiempo de interrupción medio mensual (minutos)",1.25,1.17,0,0,21.67,0.13,9.2200000000000006,5.79,1.28,1.92,0.09,8.7799999999999994,51.09,1.6611090129972472,0.73142423806917378,0,0,1.6397879283817287,0,0,4.3067410058737154,0,1.8364261913556978,0,0.3872530274059911,10.666299424502649,1.6490197850317443,0,0,0,3.9097968760581452,0.85666300190882183,0,1.1407926948506022,4.8501041712271091E-2,7.7052479053257965,0,0.59783472110487079,16.032155207997004,0,5.4719949127116987,3.4528768172272566E-2,2.9345632867077645,0,2.4947826202604033,0.31909960017418149,45.065678693635604,1.7286136960816161,0,0,0,58.937379093999539,2.3419623611341405E-2,0,98.98948735520527,0.32421159872623118,0.39087171913660185,0,0,0,0,0,0,0,96.886047891506621,0.61561484259424026,148.6564510948275,56.972963984990976,0,5.7931472861984599,0.22103946849902037,0,30.551192493244123,0,0,0.69967357072251224,0,241.68330353377169,0,0,0,0.77829431092914025,0,0.28001908120680363,0,0,0,0,0,0,1.0233940577103893,0,0,0,0,0,0.26775570879960359,0,0.17414261841657577,0.15459054013296791,0,0,13.116,13.25,0,0.41599999999999998,0.18099999999999999,0,0,0,0,0,0,0.33800000000000002,3.4359999999999999,0,4.38,0,0,0,0,0,0.05,5.0739999999999998,0,0,0.21199999999999999,3.6480000000000001,0,9.0399999999999991,1.474,0,0.74199999999999999,0,0,0.35299999999999998,0,0.79200000000000004,0.38500000000000001,1.018,4.2350000000000003,1.2999999999999999E-2,9.0779999999999994,0.187,0,0,1.2E-2,0,2.8730000000000002,0.751,0,21.808,0.58699999999999997,0,0.28299999999999997,27.446999999999999,0,1.0920000000000001,0,0.161,0,0.29799999999999999,0,0,0.63300000000000001,0,0.58099999999999996,0,2.7519999999999998,0,0,9.5000000000000001E-2,6.4000000000000001E-2,0.33200000000000002,0,0,0,0,3.6720000000000002,"-","-",1.6739999999999999]
[]
[null,"Indisponibilidad mensual peninsular según clasificación RD1955/2000 (%)","2004-01-01","2004-02-01","2004-03-01","2004-04-01","2004-05-01","2004-06-01","2004-07-01","2004-08-01","2004-09-01","2004-10-01","2004-11-01","2004-12-01",2004,"2005-01-01","2005-02-01","2005-03-01","2005-04-01","2005-05-01","2005-06-01","2005-07-01","2005-08-01","2005-09-01","2005-10-01","2005-11-01","2005-12-01","2005","2006-01-01","2006-02-01","2006-03-01","2006-04-01","2006-05-01","2006-06-01","2006-07-01","2006-08-01","2006-09-01","2006-10-01","2006-11-01","2006-12-01","2006","2007-01-01","2007-02-01","2007-03-01","2007-04-01","2007-05-01","2007-06-01","2007-07-01","2007-08-01","2007-09-01","2007-10-01","2007-11-01","2007-12-01","2007","2008-01-01","2008-02-01","2008-03-01","2008-04-01","2008-05-01","2008-06-01","2008-07-01","2008-08-01","2008-09-01","2008-10-01","2008-11-01","2008-12-01","2008","2009-01-01","2009-02-01","2009-03-01","2009-04-01","2009-05-01","2009-06-01","2009-07-01","2009-08-01","2009-09-01","2009-10-01","2009-11-01","2009-12-01","2009","2010-01-01","2010-02-01","2010-03-01","2010-04-01","2010-05-01","2010-06-01","2010-07-01","2010-08-01","2010-09-01","2010-10-01","2010-11-01","2010-12-01","2010","2011-01-01","2011-02-01","2011-03-01","2011-04-01","2011-05-01","2011-06-01","2011-07-01","2011-08-01","2011-09-01","2011-10-01","2011-11-01","2011-12-01","2011","2012-01-01","2012-02-01","2012-03-01","2012-04-01","2012-05-01","2012-06-01","2012-07-01","2012-08-01","2012-09-01","2012-10-01","2012-11-01","2012-12-01","2012","2013-01-01","2013-02-01","2013-03-01","2013-04-01","2013-05-01","2013-06-01","2013-07-01","2013-08-01","2013-09-01","2013-10-01","2013-11-01","2013-12-01","2013","2014-01-01","2014-02-01","2014-03-01","2014-04-01","2014-05-01","2014-06-01","2014-07-01","2014-08-01","2014-09-01","2014-10-01","2014-11-01","2014-12-01","2014","2015-01-01","2015-02-01","2015-03-01","2015-04-01","2015-05-01","2015-06-01","2015-07-01","2015-08-01","2015-09-01","2015-10-01","2015-11-01","2015-12-01","2015","2016-01-01","2016-02-01","2016-03-01","2016-04-01","2016-05-01","2016-06-01","2016-07-01","2016-08-01","2016-09-01","2016-10-01","2016-11-01","2016-12-01","2016","2017-01-01","2017-02-01","2017-03-01","2017-04-01","2017-05-01","2017-06-01","2017-07-01","2017-08-01","2017-09-01","2017-10-01","2017-11-01","2017-12-01","2017","2018-01-01","2018-02-01","2018-03-01","2018-04-01","2018-05-01","2018-06-01","2018-07-01","2018-08-01","2018-09-01","2018-10-01","2018-11-01","2018-12-01","2018"]
[]
[null,"Mantenimiento preventivo y predictivo",0.26836729358009337,0.63307007459008247,1.22298462078407,0.95302860678384216,0.82299396947611869,0.68237475686285287,0.31126030987182984,0.65368959904371671,0.77683077696782543,0.50807701166810648,0.40342654165107683,0.14136665351178204,0.61162570019636198,6.4818316149563127E-2,0.27138570407548257,0.62764959909739637,0.94495604657522869,0.91638266861457429,0.51678230015533544,0.27848646102664576,0.23817032123921361,0.48322540834770977,0.38255595187657487,0.49785011952553992,0.1019721789309465,0.44246016624608564,2.1156938423723484E-2,0.26249584043025109,0.33971852158736476,0.32224986130562694,0.94945378494345845,0.63294374950795007,0.17507968116807821,0.45216027777188844,0.42793469398545875,0.71061970348135006,0.58954456274474676,8.58987129996059E-2,0.41455774574882837,7.0000000000000007E-2,0.11,0.28000000000000003,0.44,0.39,0.32,0.18,0.28999999999999998,0.37,0.22,0.18,0.05,0.24,0.01,0.18,0.14000000000000001,0.43,0.47,0.39,0.59,0.42,0.66,0.47,0.39,0.2,0.36,0.13,0.24,0.35,0.48,0.63,0.6,0.55000000000000004,0.36,0.51,0.45,0.45,0.05,0.4,7.0000000000000007E-2,0.35,0.36,0.47,0.75,0.51,0.36,0.42,0.77,0.57000000000000006,0.83,0.09,0.46,0.16,0.23,0.39,0.31,0.67,0.45,0.44,0.35,0.81,0.79,0.55000000000000004,0.25,0.45,0.06,0.26,0.5,0.41,0.59,0.43,0.26,0.32,0.6,0.73,0.7,0.18,0.42,0.09,0.24,0.3,0.88,1.01,0.68,0.51,0.72,0.88,0.72,0.53,0.18,0.56000000000000005,7.0000000000000007E-2,0.19,0.7,0.76,0.69,0.85,0.63,0.65,0.97,1.02,0.68,0.16,0.62,0.03,0.3,0.68,0.61,0.69,0.66,0.61,0.5,1.07,1.0900000000000001,1.1499999999999999,0.31,0.64,0.09,0.5,0.64,0.79,1.01,0.81,0.74,0.75,1.1200000000000001,1.1000000000000001,1.1000000000000001,0.15,0.73,0.19,0.42,0.74,0.78,1.04,0.94,0.56000000000000005,0.71,0.84,1.24,1.29,0.37,0.76,0.1,0.48,0.32,0.94,1.2,0.75,0.53,0.64,1.4,1.27,"-","-",0.76]
[null,"Causas ajenas al mantenimiento",0.62737018990447613,0.70567922088229829,0.42931452296678418,1.0354542223986205,0.76085361024829568,1.1321966727217514,0.49202209902361782,0.54574602591595145,1.1173483344491768,1.9334263928694564,1.29441364830216,0.43393906402152099,0.88710637706342998,0.17488606083213687,0.14301741720759303,0.70496421166589407,0.90734994844646544,1.3748733853355142,0.79917578131476419,0.36716876015134325,0.95305643447615629,1.7024179002982764,1.4775129279370069,1.4302419995884492,0.49980916298158423,0.88005221074744788,8.3000186914728158E-2,0.17482458483348329,0.6726164008961304,1.0345519378416472,1.1853082170156821,0.6480145955489045,0.89232924478656883,1.735972202790885,1.0938382825022248,1.7365740761456256,1.5855683779475525,0.52775994726071862,0.95432820798679874,0.54,0.56999999999999995,1.1100000000000001,1.33,1.7,1.53,1.07,1.92,1.69,2.31,1.65,0.35,1.32,0.16,0.42,1.1200000000000001,1.28,1.68,1.06,0.76,1.96,2.2200000000000002,2.5500000000000003,2.0300000000000002,0.31,1.3,0.01,0.19,1.23,1.53,1.94,1.5,1.1000000000000001,1.45,1.75,2.42,1.93,0.55000000000000004,1.31,0.43,0.76,1.07,1.94,1.87,1.68,0.75,1.48,1.52,1.98,1.58,0.73,1.32,0.16,0.54,1.3,1.38,2.04,1.55,1.67,2.52,2.19,2.93,2.0499999999999998,1.02,1.63,0.57000000000000006,1.01,2.39,2.25,2.2000000000000002,1.42,1.35,1.65,1.8,2.57,1.53,0.34,1.59,0.13,0.45,0.33,1.06,1.28,1.31,1.2,1.5,1.61,2.0499999999999998,1.86,0.41,1.1000000000000001,0.23,0.57000000000000006,0.86,0.65,1.62,0.82,1.32,1.1100000000000001,1.64,1.69,1.23,0.49,1.02,0.54,1.46,1.53,1.61,1.79,1.55,1.07,1.24,1.82,1.25,0.72,0.25,1.23,0.08,0.35,1.06,0.9,1.05,0.73,0.8,1.0900000000000001,1.39,0.99,1.1499999999999999,0.51,0.84,0.13,0.36,0.45,0.79,1.1599999999999999,0.99,0.56999999999999995,1.1499999999999999,1.23,1.61,1.1499999999999999,0.28999999999999998,0.82,0.08,0.38,0.73,1.1200000000000001,1.25,1.28,0.97,1.1299999999999999,1.38,1.64,"-","-",1]
[null,"Mantenimiento correctivo",0.3725128073420938,3.8149153465479854E-2,0.13862163689832696,0.41831078481021444,0.46187274680368656,0.17620859228680652,9.1421383965065925E-2,0.12076325536850509,9.3503775426139191E-2,4.5288055750120848E-2,0.15424231141581848,0.21785251300530906,0.19397654634618003,0.30135628406451725,0.47046736573735776,0.30815697003424214,0.2892047754443679,0.23802222109718271,0.23873084642251782,0.29316970698890865,0.24892510594944997,0.41549784841619769,0.29653753041719944,0.26178256012747791,0.41527433127576208,0.31489480207844228,0.31962644614869634,0.24693117508235124,0.27578532278466272,0.16787755014194425,0.16489853704577501,0.16336136476075486,0.3237591099744187,0.25276596690602127,0.22302374312888587,0.35641298458835219,0.3124117045215985,0.32968834573954842,0.26219844673826098,0.3,0.38,0.35,0.32,0.45,0.48,0.2,0.25,0.26,0.28000000000000003,0.31,0.14000000000000001,0.31,0.18,0.17,0.25,0.15,0.16,0.25,0.14000000000000001,0.2,0.18,0.27,0.33,0.18,0.2,0.22,0.33,0.27,0.19,0.14000000000000001,0.21,0.27,0.2,0.19,0.14000000000000001,0.15,0.16,0.2,0.24,0.19,0.09,0.17,0.27,0.52,0.31,0.18,0.23,0.35,0.31,0.28999999999999998,0.26,0.11,0.15,0.2,0.12,0.17,0.21,0.16,0.19,0.13,0.19,0.3,0.22,0.18,0.34,0.4,0.16,0.17,0.23,0.25,0.23,0.16,0.1,0.14000000000000001,0.13,7.0000000000000007E-2,0.2,0.14000000000000001,0.15,0.05,0.04,0.14000000000000001,0.36,7.0000000000000007E-2,0.06,0.05,0.13,0.16,0.12,0.12,0.09,0.13,0.08,0.05,0.16,0.1,0.21,0.06,0.16,0.25,0.38,0.3,0.17,0.22,0.5,0.5,0.08,0.21,0.21,0.04,0.04,0.05,0.15,0.15,0.06,0.18,0.1,0.17,0.19,0.2,0.09,0.18,0.05,0.08,0.06,0.09,0.09,0.06,0.11,0.1,0.22,0.21,0.33,0.22,0.05,0.05,0.03,0.01,0.03,0.04,0.13,0.12,0.1,0.28000000000000003,0.25,0.1,0.06,0.06,0.05,0.08,0.05,0.16,"-","-",0.12]
[null,"Circunstancias fortuitas previstas en las condiciones de diseño",2.4584063129351637E-2,2.3076943761704567E-2,2.0137866632245088E-3,2.4610800013645337E-2,1.4169051490547799E-2,0.11599402206459719,0.15000213828541092,0.15349737335765415,0.13742803599672515,0.14638659840960438,0.13085799415153226,9.5288461849836692E-2,8.5646589836188489E-2,1.6097990142284805E-2,8.8942993380874413E-3,3.3442131569689148E-3,1.2617737601687844E-2,2.297611439734689E-3,1.2053928839864598E-2,1.6338098171895611E-2,2.268994210883659E-2,9.1907100000922105E-3,2.4128386201695388E-2,1.3283303958557114E-2,3.0352187218646614E-2,1.4742165723970942E-2,2.530560641880425E-2,5.7334151999729318E-3,3.7046348282442576E-2,7.8318778446796813E-3,7.2781716169815379E-3,5.7038673438445011E-3,3.5094997382968979E-2,1.8837077745280584E-2,1.8019286922192866E-2,1.1486032754396407E-2,1.1742719945330422E-2,1.1620409063457486E-2,1.6447936159585438E-2,0.04,0.02,0.04,0.01,0.01,0.02,0.02,0.05,0.02,0.01,0.02,0.01,0.02,0.01,0.01,0.01,0,0.01,0.02,0.03,0.01,0.01,0.01,0.02,0.01,0.01,7.0000000000000007E-2,0.01,0.02,0.01,0.01,0.01,0.02,0.02,0.01,0,0.01,0.01,0.02,0.01,0.03,0.01,0.01,0,0,0.01,0.01,0,0.01,0.01,0.01,0.01,0,0.01,0.01,0.01,0.01,0.01,0.01,0.01,0.01,0.02,0,0.01,0.01,0.02,0.02,0.01,0,0,0.01,0,0.01,0.01,0,0.01,0,0.01,0.01,0.03,0.01,0,0.01,0.01,0,0,0,0,0.01,0.01,0.01,0,0.01,0.01,0,0,0,0.01,0,0,0,0.01,0,0,0.01,0.02,0.01,0.01,0,0.02,0,0.01,0.01,0.03,0,0.01,0.01,0.01,0.01,0.01,0,0,0.01,0,0.01,0.01,0.01,0.01,0,0.01,0.05,0.03,0.02,0.01,0,0.01,0.01,0.01,0,0,0,0,0.01,0,0.03,0.01,0,0,0,0,0,0.01,0,"-","-",0.01]
[null,"Causa de fuerza mayor o acciones de terceros",9.2038364382685076E-2,9.3563824258651368E-2,9.098599948124575E-2,0.27512589429451106,0.19102199977613357,0.31995178379182354,0.19065858858979348,0.26921288185960057,0.37734826172562252,0.17789589842201484,0.46076154330647573,0.19246520689839056,0.22783198200989285,8.2237316758260431E-2,0.12698158805677193,0.29783052880223676,0.22124554630268697,0.16616612478262444,0.18800949252729926,0.38267325557921533,0.31880438541679285,7.393174938389542E-2,0.17039327247757352,0.28554739702715121,7.2596700676595044E-2,0.18960865045829345,8.6236880832941926E-2,0.11834180712437926,0.39258418309187509,0.36845874636210779,0.38363251760009776,0.145467230461654,0.14515266327018536,9.9821074248181887E-2,0.27078376597892295,0.3834225881699046,0.27043126307230825,0.18392638263802166,0.23805293770722988,0.08,0.18,0.24,0.23,0.54,0.53,0.7,0.81,1.1499999999999999,1.1299999999999999,0.86,0.55000000000000004,0.62,0.31,0.48,0.36,0.28999999999999998,0.48,0.79,0.49,0.39,0.54,0.6,0.61,0.27,0.47,0.77,1.62,0.16,0.13,0.43,0.62,0.16,0.31,0.34,0.43,0.26,0.14000000000000001,0.44,0.17,0.18,0.39,0.46,0.28000000000000003,0.23,0.27,0.25,0.35,0.38,0.31,0.34,0.3,0.06,0.18,0.04,0.16,0.13,0.31,0.17,0.2,0.32,0.18,0.25,0.06,0.17,0.15,0.06,0.03,0.16,0.11,0.18,0.09,0.13,0.22,0.21,0.39,0.2,0.16,0.1,0.11,0.48,0.49,0.38,0.25,0.26,0.22,0.17,0.66,0.4,0.19,0.31,0.18,0.21,0.23,0.31,0.28000000000000003,0.16,0.16,0.23,0.1,0.4,0.39,0.15,0.23,0.15,7.0000000000000007E-2,0.12,0.09,0.2,0.14000000000000001,0.28000000000000003,0.19,0.11,0.24,0.16,0.11,0.16,7.0000000000000007E-2,0.1,0.16,0.19,0.27,0.32,0.18,0.18,0.26,0.17,0.21,0.16,0.19,0.09,0.89,1.02,0.98,0.21,0.28999999999999998,0.25,0.36,0.52,0.45,0.34,0.09,0.45,0.05,0.01,0.59,0.51,0.16,0.2,0.3,0.17,0.16,0.33,"-","-",0.25]
[null,"Sin clasificar (*)",1.837329810657752E-3,4.77015925692231E-4,5.8321698552014616E-3,3.6802760839846067E-4,6.3615409312857705E-3,3.8257537051985451E-4,4.8644264092026317E-3,2.9273932744912523E-2,3.2700769026956329E-3,3.1319698563561172E-3,9.3384786758985382E-4,7.5440412783364186E-4,4.8640162341999776E-3,0,0,0,0,0,0,0,0,0,0,0,0,0,0,0,0,0,0,0,0,0,0,0,0,0,0,0,0,0,0,0,0,0,0,0,0,0,0,0,0,0,0,0,0,0,0,0,0,0,0,0,0,0,0,0,0,0,0,0,0,0,0,0,0,0,0,0,0,0,0,0,0,0,0,0,0,0,0,0,0,0,0,0,0,0,0,0,0,0,0,0,0,0,0,0,0,0,0,0,0,0,0,0,0,0,0,0,0,0,0,0,0,0,0,0,0,0,0,0,0,0,0,0,0,0,0,0,0,0,0,0,0,0,0,0,0,0,0,0,0,0,0,0,0,0,0,0,0,0,0,0,0,0,0,0,0,0,0,0,0,0,0,0,0,0,0,0,0,0,0,0,0,0,0,0,0,0,0,0,"-","-",0]
[null,"Total",1.2946716837666734,1.4004524086252574,1.7987667371676068,2.4317724416147195,2.0662509189499345,2.1071566193065272,1.049570357555127,1.5029701864307392,2.128380999742562,2.6363100285536434,1.9838743433881769,0.88920109651628232,1.7832192296763607,0.55715865118850205,0.89376478635852052,1.6441149939545017,2.1541285080677488,2.5315758864870057,1.5667428567324824,0.95516302633879335,1.4628418037736568,2.6103318670622779,2.1807347964324753,2.2031579832000254,1.0474078604069395,1.6521493447959439,0.44908917790595237,0.68998501554605884,1.3251665935505998,1.5325112271338979,2.3069387106218961,1.4500235771614534,1.4262630333120352,2.4597355252140751,1.7628160065387619,2.8150927969697257,2.4992673651592292,0.95496741506333038,1.647532336633472,0.94,1.08,1.78,2.1,2.5499999999999998,2.36,1.48,2.5099999999999998,2.34,2.82,2.15,0.55000000000000004,1.89,0.36,0.77,1.52,1.86,2.33,1.72,1.53,2.59,3.07,3.3,2.78,0.7,1.88,0.42,0.76,1.87,2.21,2.72,2.3199999999999998,1.94,2.04,2.46,3.01,2.5499999999999998,0.77,1.93,0.74,1.33,1.53,2.59,2.9,2.72,1.43,2.09,2.5100000000000002,2.9,2.73,1.1200000000000001,2.0499999999999998,0.43,0.93,1.9,1.83,2.9,2.2200000000000002,2.2800000000000002,3.07,3.13,3.93,2.91,1.49,2.27,0.99,1.68,3.06,2.83,3.02,2.1,1.84,2.13,2.5100000000000002,3.45,2.37,0.6,2.21,0.38,0.87,0.69,1.98,2.4300000000000002,2.36,1.78,2.29,2.54,2.9,2.56,0.72,1.8,0.39,0.9,1.64,1.47,2.4700000000000002,1.77,2.17,1.82,2.78,2.96,2.29,0.95,1.81,0.8,2.29,2.72,2.29,2.69,2.44,1.72,1.79,2.95,2.5099999999999998,2.0099999999999998,0.63,2.06,0.28000000000000003,1.03,1.9,1.89,2.15,1.73,1.59,1.93,2.58,2.19,2.35,0.72,1.67,0.47,1.03,1.42,1.91,2.42,1.99,1.19,1.9,2.08,2.88,2.48,0.79,1.71,0.28000000000000003,1.17,1.31,2.16,2.5099999999999998,2.09,1.55,1.85,2.84,3.07,"-","-",1.89]
[]
[null,"Indisponibilidad mensual Islas Baleares según clasificación RD1955/2000 (%)","2005-01-01","2005-02-01","2005-03-01","2005-04-01","2005-05-01","2005-06-01","2005-07-01","2005-08-01","2005-09-01","2005-10-01","2005-11-01","2005-12-01",2005,"2006-01-01","2006-02-01","2006-03-01","2006-04-01","2006-05-01","2006-06-01","2006-07-01","2006-08-01","2006-09-01","2006-10-01","2006-11-01","2006-12-01","2006","2007-01-01","2007-02-01","2007-03-01","2007-04-01","2007-05-01","2007-06-01","2007-07-01","2007-08-01","2007-09-01","2007-10-01","2007-11-01","2007-12-01","2007","2008-01-01","2008-02-01","2008-03-01","2008-04-01","2008-05-01","2008-06-01","2008-07-01","2008-08-01","2008-09-01","2008-10-01","2008-11-01","2008-12-01","2008","2009-01-01","2009-02-01","2009-03-01","2009-04-01","2009-05-01","2009-06-01","2009-07-01","2009-08-01","2009-09-01","2009-10-01","2009-11-01","2009-12-01","2009","2010-01-01","2010-02-01","2010-03-01","2010-04-01","2010-05-01","2010-06-01","2010-07-01","2010-08-01","2010-09-01","2010-10-01","2010-11-01","2010-12-01","2010","2011-01-01","2011-02-01","2011-03-01","2011-04-01","2011-05-01","2011-06-01","2011-07-01","2011-08-01","2011-09-01","2011-10-01","2011-11-01","2011-12-01","2011","2012-01-01","2012-02-01","2012-03-01","2012-04-01","2012-05-01","2012-06-01","2012-07-01","2012-08-01","2012-09-01","2012-10-01","2012-11-01","2012-12-01","2012","2013-01-01","2013-02-01","2013-03-01","2013-04-01","2013-05-01","2013-06-01","2013-07-01","2013-08-01","2013-09-01","2013-10-01","2013-11-01","2013-12-01","2013","2014-01-01","2014-02-01","2014-03-01","2014-04-01","2014-05-01","2014-06-01","2014-07-01","2014-08-01","2014-09-01","2014-10-01","2014-11-01","2014-12-01","2014","2015-01-01","2015-02-01","2015-03-01","2015-04-01","2015-05-01","2015-06-01","2015-07-01","2015-08-01","2015-09-01","2015-10-01","2015-11-01","2015-12-01","2015","2016-01-01","2016-02-01","2016-03-01","2016-04-01","2016-05-01","2016-06-01","2016-07-01","2016-08-01","2016-09-01","2016-10-01","2016-11-01","2016-12-01","2016","2017-01-01","2017-02-01","2017-03-01","2017-04-01","2017-05-01","2017-06-01","2017-07-01","2017-08-01","2017-09-01","2017-10-01","2017-11-01","2017-12-01","2017","2018-01-01","2018-02-01","2018-03-01","2018-04-01","2018-05-01","2018-06-01","2018-07-01","2018-08-01","2018-09-01","2018-10-01","2018-11-01","2018-12-01","2018"]
[null,"Mantenimiento preventivo y predictivo",0.651432439242838,3.4681506839461718,1.4645870862344454,0.53188682573613966,0.22180875363994379,2.2666360836922275,0.96159515492331216,5.0328377988951858E-2,1.1493079475989674,1.2518393382667363,0.88255794668787491,1.4203227675926629E-2,8.6999999999999994E-2,0.46,0.37,1.57,0.87,0.57999999999999996,0.21,0.12,0,0.31,3.82,1.25,0.19,0.82,0.19005747738342463,0.21095475592386739,0.80136496418911374,0.48234036654409623,0.33167791262317664,0.23780913900495199,0,1.7459750368895085E-3,0.17394956118197707,0.45790074626268762,0.46537018078663939,0.1960889446863788,0.29402450293336607,0.13543399868443165,0.12384776484481198,0.20053295113267264,0.45779979295338669,1.0081194923863299,0.63417887995623878,0,0,0.27965660092233136,0.19263482185772529,0.77512112937694588,0.47796671056944051,0.35713430223330844,0.97,0.37,1.0900000000000001,0.16,0.53,0.01,0,0,0.18,0.43,0.87,0.2,0.4,0.55000000000000004,0.96,0.5,0.36,0.15,0.28000000000000003,0.05,0.02,0.41,1.87,0.28000000000000003,0.01,0.45,0,0.14000000000000001,0.18,0.43,0.64,0.37,0,0.02,0.46,2.5300000000000002,3.41,0.94,0.79,0.1,0.26,0.65,0.55000000000000004,0.32,0.17,0.04,0.11,0.21,0.24,0.65,0.43,0.31,0.11,0.06,0.01,0.15,0.18,7.0000000000000007E-2,0.02,0,0.03,0.28000000000000003,0.42,0.79,0.18,0.02,0.23,0.08,0.2,0.19,0.26,0.48,0.12,7.0000000000000007E-2,0.49,0.84,0.08,0.25,0.33,0.4,0.8,0.84,3.38,0.36,7.0000000000000007E-2,0.01,0.42,1.19,1.52,0.16,0.8,0,0.53,0.24,1.35,1.74,0.56999999999999995,0.34,0.02,0.36,1.28,1.06,0.51,0.67,0.49,0.53,0.74,2.95,1.1499999999999999,0.09,0.04,0.03,0.16,1.39,1.39,0.6,0.8,0.78,1.1299999999999999,1.2,2.19,1.53,0.88,0.48,1.07,1.64,1.72,"-","-",1.26]
[null,"Causas ajenas al mantenimiento",0.75420139376013307,0.90022751309044424,2.8783439323794133,3.4951107985715359,3.0571601643567887,3.5520284469597332,1.8597932163140805,0,0.17706522214525927,2.5569881802612238,4.2753520176998654,2.9653106931810722,0.187,0.89,1.62,4.1900000000000004,5.43,3.99,0.82,0.99,0.85,1.18,1.83,2.95,1.83,2.1930000000000001,1.0491259593435573,2.2313248307267766,2.6079775800358553,2.6176051036444723,2.1381811611430601,1.6922336028577325,2.1083561263725369E-2,0,0.30714889201127737,1.7643548031606633,1.7829116721773015,1.0450226895262007,1.41443573479541,1.085612763790299,0.87465656750181087,0.45945522944084377,0.37622888168472102,3.1560861598321965,1.6544145149745553,0.7096764455579988,0.60152486729847543,0.17279017842064986,1.039233818039595,0.88185084338575204,0.32498381327425002,0.94628702335847314,0,0.6,1.37,1.27,1.83,1.94,0.37,0,0,0.04,0.34,0,0.63,0,0.01,0.24,0.27,1.36,0.43,0.01,0.24,0.04,0.4,0.52,0.21,0.31,0.01,0.01,0,0.17,0.48,0.64,0.12,0.18,0.82,2.37,3.99,2.1800000000000002,0.96,0.97,1.21,2.33,1.36,1.77,1.65,0.33,0.08,0.86,2.87,4.03,1.57,1.59,3.17,1.89,2.79,1.76,2.0100000000000002,1.36,1,0.52,1.35,3.09,1.53,1.32,1.82,0.42,1.1500000000000001,3.01,2.6,3.92,1.1200000000000001,0.3,0.22,0.86,3.18,2.23,0.72,1.65,0.47,2.2600000000000002,2.16,4.76,1.75,0.93,0.28999999999999998,0.15,0.7,4.42,4.76,4.58,2.2800000000000002,4.7300000000000004,5.91,7.2,2.84,1.07,0.17,0.1,0.63,1.61,1.8,1.38,0.23,2.27,0.36,1.06,2.2999999999999998,1.43,3.32,0.55000000000000004,0,0.01,0.74,2.34,1.5,1.85,1.29,0.26,0.59,0.71,3.49,2.48,1.4,0.18,0.31,0.1,2.23,"-","-",1.17]
[null,"Mantenimiento correctivo",1.9019647576494714E-4,0.15762849369051773,1.3740535637749287E-2,1.7324440302894966E-2,0,1.3819142449217814E-2,2.9906277745431351E-2,3.5342720550056417E-3,2.5021687862448169E-2,4.1332971065377332E-2,2.5922007530688025E-2,6.2675952999739258E-3,2E-3,0.04,0.1,0.03,0.01,0.11,0.03,0.01,0.17,0.02,0.01,0,0.02,4.5999999999999999E-2,5.4492095976441824E-3,0,1.5703774056611476E-4,1.4668532785981571E-2,6.0382861717634607E-2,6.8848008872382117E-3,9.2205900197201748E-2,0.70244075090183411,0.66354580880574765,1.5478116841316014,0.65999535240311868,0.65786384976525814,0.38198623240284196,0.63826107484937711,0.64127091458092678,0.63254691140432251,0.63583992983257642,0.62897033775665112,0.64045440614364602,0.17075140416811327,1.2418021558313348E-2,4.1321202524011202E-4,2.0567438733474285E-2,2.4235428650038258E-3,0.21422550219679959,0.35014994297478608,0.42,0,0.01,0.05,0.43,0.13,0.24,4.0000000000000001E-3,7.0000000000000007E-2,0.01,0,0.11,0.12,0.04,0.48,0.01,0.02,0.02,0.01,0.01,0.12,0,0.02,0.01,0.02,0.06,0,0.23,0.01,0.01,0,0.01,0.04,0.01,0.01,0.13,0.02,0.04,0.04,0,0.01,0.06,0,0,0.11,7.0000000000000007E-2,0.02,0.01,0,0,0.01,0.02,0.04,0,0,0.05,0.01,0,0.01,0.02,0.05,0.08,0.01,0.09,0.03,0,0.04,0.02,0.02,0.13,0.17,0.24,0.21,0.03,0.03,0.05,0.05,0.08,0,0.01,0,0.02,0.09,0.06,0.05,0,0,0,0,0.18,0.04,0.28999999999999998,0.15,0,0,0.06,7.0000000000000007E-2,0.05,0.09,0.02,0.23,0.36,0,0.11,0.06,0.01,0.01,0.14000000000000001,0.01,0.14000000000000001,7.0000000000000007E-2,0.02,0.01,0.01,0.05,0.21,0.06,0.03,0.01,0.01,0.02,0.02,0.04,0,0.01,0.09,0.24,"-","-",0.05]
[null,"Circunstancias fortuitas previstas en las condiciones de diseño",2.6627506601114323E-4,1.4148820206563615E-2,2.3438816298812021E-2,6.5940344983582196E-3,3.807640665676835E-3,7.458804960677942E-3,2.3634015938975759E-3,6.1852639293924898E-8,9.8654248622958698E-2,0.62152968510494777,1.1976038659173945E-7,3.4421177466303745E-3,6.0000000000000001E-3,7.0000000000000007E-2,0.02,0,0,0,0,0.01,0,0,0,0,0,8.0000000000000002E-3,0,4.4335119256254905E-3,5.3510610097903604E-4,2.8863239881450355E-3,2.259240227400552E-3,2.321262766945218E-3,5.1631567050570114E-2,7.7578318182047097E-5,1.2512512512512512E-4,1.2455115666124839E-3,7.8146108979437745E-5,0,5.5214712756964171E-3,2.9049064010817022E-5,0,2.9049064010817022E-5,5.333573472262489E-3,1.6687071364056134E-4,3.6989027679576822E-4,0,0,1.7315425166966294E-4,1.2879567618180693E-4,4.0717132244834794E-2,5.235253539903359E-4,3.9335636567076641E-3,0,0,0,0,0,0,0.02,0,0.01,0,0,0,0,0.01,0,0,0,0,0,0.01,0.03,0,0,0,0,0,0,0,0,0,0,0,0,0,0,0,0.02,0,0,0,0,0.03,0,0,0,0,0,0,0,0,0.01,0,0,0.01,0,0,0,0,0,0,0,0,0,0,0,0,0,0,0,0.01,0,0,0,0,0,0,0.02,0,0,0,0,0.09,7.0000000000000007E-2,0,0.01,0,0,0,0,0,0.01,0,0,0,0,0,0.02,0,0,0,0.05,0,0,0.01,0.01,0,0,0,0,0,0.02,0,0,0.02,0,0,0,0,0,0,0,0,0,0,0,0,0,"-","-",0]
[null,"Causa de fuerza mayor o acciones de terceros",0,5.6547002731512986E-6,2.5918120138856419E-2,3.8858257978417431E-2,1.2514696156954955E-3,1.8748130507811601E-4,0,0,8.7113582433924919E-2,8.7520225445594749E-2,0,0,2E-3,0,0,0,0,0,0,0,0,0,0,0,0,0,0,0,0,0,0,0,0,0,0,4.3092441361159917E-2,0,0,3.7609485743745519E-3,0,0,0,0,0,0,0,0,0,0,0,0,0,0,0,0,0,0,0,0,0,0,0,0,0,0,0,0,0,0,0,0,0,0,0,0,0,0,0,0,0,1.83,0.57999999999999996,0,0.21,0.02,0.01,0,0,0,0,0.22,0,0,0,0,0,0,0,0,0,0,0,0,0,0,0.08,0,0,0.01,0,0,0,0,0,7.0000000000000007E-2,0,0.01,0,0,0,0,0.05,0,0.06,0,0.12,0,0.01,0,0.02,0,0,0,0.02,0,0.88,0.67,0.04,0.01,0,0,0,0.14000000000000001,0,0,0,0.01,0,0,7.0000000000000007E-2,0.32,0.02,0,0,0.03,0.04,0,0,0,0,0,0,0,0,0,0,0.03,0,0,0.01,0,0,0.03,0,0,0.01,0.02,0,0.16,"-","-",0.02]
[null,"Sin clasificar (*)",0,0,0,0,0,0,0,0,0,0,0,0,0,0,0,0,null,0,0,0,0,0,0,0,0,0,0,0,0,0,0,0,0,0,0,0,0,0,0,0,0,0,0,0,0,0,0,0,0,0,0,0,0,0,0,0,0,0,0,0,0,0,0,0,0,0,0,0,0,0,0,0,0,0,0,0,0,0,0,0,0,0,0,0,0,0,0,0,0,0,0,0,0,0,0,0,0,0,0,0,0,0,0,0,0,0,0,0,0,0,0,0,0,0,0,0,0,0,0,0,0,0,0,0,0,0,0,0,0,0,0,0,0,0,0,0,0,0,0,0,0,0,0,0,0,0,0,0,0,0,0,0,0,0,0,0,0,0,0,0,0,0,0,0,0,0,0,0,0,0,0,0,0,0,0,0,0,0,0,"-","-",0]
[null,"Total",1.406090304544747,4.5401555109336975,4.3801103705504207,4.050916099108929,3.2827765586624094,5.8399424780618565,2.8536580505767217,5.3862711896596797E-2,1.4500491062296335,4.4716901746982849,5.1838320916788145,2.9892236339036033,0.27900000000000003,1.46,2.11,5.79,6.31,4.68,1.06,1.1299999999999999,1.02,1.51,5.66,4.2,2.04,3.0669999999999997,1.2446326463246262,2.4467130985762697,3.410034688066514,3.1175003269626949,2.5325011757112721,1.9392488055168677,0.16492102851149723,0.70426430425690567,1.1447693871241271,3.7713127451215649,2.9083553514760387,1.8989754839778374,2.0959679414073147,1.8593368863881188,1.6397752469275497,1.2925641410418498,1.4752021779429467,4.793342860688818,2.9294176913512358,0.8804278497261121,0.61394288885678883,0.453033145619891,1.2525648743069764,1.7001126478725366,1.0176995513944804,1.6575048322232755,1.39,0.97,2.4700000000000002,1.48,2.79,2.08,0.63,4.0000000000000001E-3,0.26,0.48,1.21,0.31,1.1599999999999999,0.59,1.45,0.76,0.65,1.53,0.72,0.08,0.41,0.45,2.3000000000000003,0.81,0.24,0.83,0.01,0.38,0.2,0.62,1.1200000000000001,1.02,0.16,0.21,1.3,5.03,7.43,3.16,1.79,1.07,1.48,3.07,1.91,2.1,1.93,0.44,0.21,1.08,3.12,4.68,2.0100000000000002,1.93,3.32,1.97,2.81,1.95,2.19,1.43,1.04,0.54,1.42,3.45,1.96,2.2000000000000002,2.0300000000000002,0.45,1.42,3.11,2.82,4.25,1.55,1.02,0.55000000000000004,0.96,3.7,3.12,0.87,1.99,0.8,2.67,2.96,5.7,5.29,1.35,0.42,0.15,1.1300000000000001,5.62,6.29,4.93,3.12,5.0199999999999996,6.59,7.44,4.1900000000000004,2.87,0.83,0.49,0.74,1.99,3.36,2.8,0.74,3.06,0.92,1.6,3.05,4.5199999999999996,4.4800000000000004,0.78,0.13,0.06,0.91,3.76,2.94,2.66,2.15,1.07,1.73,1.92,5.7,4.03,2.3199999999999998,0.66,1.39,1.83,4.1900000000000004,"-","-",2.48]
[]
[null,"Indisponibilidad mensual Islas Canarias según clasificación RD1955/2000 (%)","2005-01-01","2005-02-01","2005-03-01","2005-04-01","2005-05-01","2005-06-01","2005-07-01","2005-08-01","2005-09-01","2005-10-01","2005-11-01","2005-12-01",2005,"2006-01-01","2006-02-01","2006-03-01","2006-04-01","2006-05-01","2006-06-01","2006-07-01","2006-08-01","2006-09-01","2006-10-01","2006-11-01","2006-12-01","2006","2007-01-01","2007-02-01","2007-03-01","2007-04-01","2007-05-01","2007-06-01","2007-07-01","2007-08-01","2007-09-01","2007-10-01","2007-11-01","2007-12-01","2007","2008-01-01","2008-02-01","2008-03-01","2008-04-01","2008-05-01","2008-06-01","2008-07-01","2008-08-01","2008-09-01","2008-10-01","2008-11-01","2008-12-01","2008","2009-01-01","2009-02-01","2009-03-01","2009-04-01","2009-05-01","2009-06-01","2009-07-01","2009-08-01","2009-09-01","2009-10-01","2009-11-01","2009-12-01","2009","2010-01-01","2010-02-01","2010-03-01","2010-04-01","2010-05-01","2010-06-01","2010-07-01","2010-08-01","2010-09-01","2010-10-01","2010-11-01","2010-12-01","2010","2011-01-01","2011-02-01","2011-03-01","2011-04-01","2011-05-01","2011-06-01","2011-07-01","2011-08-01","2011-09-01","2011-10-01","2011-11-01","2011-12-01","2011","2012-01-01","2012-02-01","2012-03-01","2012-04-01","2012-05-01","2012-06-01","2012-07-01","2012-08-01","2012-09-01","2012-10-01","2012-11-01","2012-12-01","2012","2013-01-01","2013-02-01","2013-03-01","2013-04-01","2013-05-01","2013-06-01","2013-07-01","2013-08-01","2013-09-01","2013-10-01","2013-11-01","2013-12-01","2013","2014-01-01","2014-02-01","2014-03-01","2014-04-01","2014-05-01","2014-06-01","2014-07-01","2014-08-01","2014-09-01","2014-10-01","2014-11-01","2014-12-01","2014","2015-01-01","2015-02-01","2015-03-01","2015-04-01","2015-05-01","2015-06-01","2015-07-01","2015-08-01","2015-09-01","2015-10-01","2015-11-01","2015-12-01","2015","2016-01-01","2016-02-01","2016-03-01","2016-04-01","2016-05-01","2016-06-01","2016-07-01","2016-08-01","2016-09-01","2016-10-01","2016-11-01","2016-12-01","2016","2017-01-01","2017-02-01","2017-03-01","2017-04-01","2017-05-01","2017-06-01","2017-07-01","2017-08-01","2017-09-01","2017-10-01","2017-11-01","2017-12-01","2017","2018-01-01","2018-02-01","2018-03-01","2018-04-01","2018-05-01","2018-06-01","2018-07-01","2018-08-01","2018-09-01","2018-10-01","2018-11-01","2018-12-01","2018"]
[null,"Mantenimiento preventivo y predictivo",0.04,0.03,0.09,0.06,0.32,0.23,0.37,0.19,0.15,0.28999999999999998,0.44,0.05,0.19,4.1432723155159355E-2,0.48663219496552823,9.0172778445126389E-2,6.9441617669229613E-2,0.39095133718288105,9.2818734609779366E-2,0.3721190871427591,5.3746216781845095E-2,3.5009064293199173E-2,0.17415767624233633,0.12724566523656561,4.7568151989731529E-2,0.16326578175134571,1.1653156278192283,0.36195045354451311,0.39762478692193726,0.18815432422969186,0.16531397501520445,0.21212058215295684,0.38583404420291245,2.0405229244459741E-2,6.396223418170946E-2,2.213325372971869E-2,2.7755494729746453E-2,3.7986302920362321E-2,0.25042989213157962,4.2993709451811045E-2,0.11593865537583334,0.13665058471788172,0.12410327849743562,0.11111117241771672,0.10910259431571694,0.11498145843019776,0.10594884969189752,5.9485165926736798E-2,0.12517552081187605,0.17628923908856864,1.4496559963745725E-2,0.10279705699669898,2.2851801111934449E-2,3.6259189845688947E-2,0.20393343673348266,0.23710642158976569,0.24281626883111462,0.24299873828118762,0.19243457023250354,0.43922944091276517,0.256898637263827,0.18674977898024886,9.9062320324852668E-2,5.4607247515846197E-2,0.19,1.9635811803341784E-3,2.4680035530947154E-2,0.32052034284076258,0.2220861971710264,0.28089870139312967,0.20426176113566655,5.742046841223155E-2,0.4341539975493916,0.10059167883966795,0.21881299462305376,0.1853251017787361,0.11005417048303996,0.18125405817627854,3.9591203191842991E-2,3.9930680563556066E-2,0.16583186323924731,0.16722174385827357,0.91026684578780803,0.77952526461693528,1.2049210665611629,0.77356785511692117,1.1334183304398147,1.275726364229246,2.6836342942615001,1.1016494975033242,0.85931573593312705,0.75,0.71,0.79,0.9,0.97,0.68,0.3,0.37,0.35,0.83,0.65,0.42,0.64,0.19,0.14000000000000001,0.2,0.23,1.03,1.1500000000000001,0.8,0.44,1.1300000000000001,1.49,0.52,0.08,0.62,0.08,0.1,0.57999999999999996,0.6,0.73,0.64,0.78,0.8,0.67,1.38,0.54,0.48,0.62,0.15,0.47,1.26,0.6,0.67,0.83,0.74,0.65,0.32,0.94,0.54,0.6,0.65,0.72,1.04,1.2,0.66,0.74,0.81,0.37,0.49,0.61,0.28000000000000003,0.71,0.56999999999999995,0.68,0.4,0.59,0.68,0.48,0.85,0.71,1.19,0.42,0.93,1.17,0.8,1.0900000000000001,0.78,0.13,0.34,0.64,0.7,0.35,0.33,0.17,0.19,0.34,0.56000000000000005,"-","-",0.37]
[null,"Causas ajenas al mantenimiento",0,0.03,0.19,0,0.02,0,0,0,0,0,0,0,0.02,1.1650863405898713,1.0813828584350973,1.065808948091086,0.99502487562189057,1.0395825531839014,1.2551112981668537,2.7216070186700903E-2,2.2735783448349648E-2,3.6516352022156334E-2,5.9459916077758246E-2,4.0447993896269761E-2,1.8861345057118138E-2,0.32322901420232242,7.4331838470155093E-2,0.35078182438650063,0.51168140307198151,1.2373865923684284,0.60387959723679463,0.64582168751568347,0.33788865211894248,0.13486868675908747,0.32047436518614619,0.47056379923148584,0.58460190912290588,0.42293809591694864,0.47209933273153587,9.701157272532876E-2,0.73011102093543623,0.21253712728036053,0.21664930872306348,0.62931414583713441,0.43200342344259973,0.2074836237795081,0.36073235890162103,0.40104166666666663,6.0960836359427381E-2,1.2868001074418701E-2,0.11340710479800209,0.28736322804495351,0.27387683446936262,3.4938995905025201E-2,7.8160138083248711E-4,0,3.8926475770516586E-3,2.6748962875121778E-2,1.1327967421997803E-2,0.27094898230450959,0.19670068516122849,0.25560067720142626,0.47534073894398932,0.48207825412943722,0.17,0.12151820773414436,5.5946241054799041E-2,0.39321116901744402,0.11174454336122461,0.12441570107538839,0.30232754137362283,0.39742879035232109,0,0.12638113005899043,0.18879359152641687,2.2169300779694347E-2,0,0.15480061262220823,0,1.0664745043682795E-2,3.9998527647704934E-3,0,5.7194789498785986E-3,0.54433092051224619,0.32597670928358774,3.1571173780928434E-2,0.47535900630973721,3.2591601991559721E-2,3.039011163381123E-2,0.25831201583998148,0.14302550637213385,0,0.01,0,0.87,0.71,0.12,0.15,0.02,0.94,0.84,0.22,0.25,0.34,0.24,0.42,2.0499999999999998,1.25,2.77,0.64,0.95,1.77,0.28000000000000003,0.79,0.6,0.19,1,0.14000000000000001,0.4,0.52,1.51,2.4900000000000002,1.99,0.55000000000000004,0.5,0.8,1.06,0.45,1.01,0.95,0.45,0.68,0.66,2.09,2.39,1.6,1.03,1.21,1.0900000000000001,1.26,1.82,0.15,1.2,0.66,0.31,0.86,1.77,0.98,0.91,0.59,0.78,0.25,1.32,0.88,0.41,0.81,0.91,0,0.05,0.21,1.8,2.23,1.3,2.38,0.71,0.45,1.53,0.63,1.03,0.23,0.46,0.04,7.0000000000000007E-2,0.26,0.9,1.36,1.52,1.55,1.31,"-","-",0.78]
[null,"Mantenimiento correctivo",0.06,0.09,0.21,0.05,0.14000000000000001,0.06,0.02,0.02,0.01,0,0,0.02,0.06,0,0,0,0,0,0,0,4.4108309237635722E-2,0,0,0,6.6354591521443568E-3,4.305258839824206E-3,1.3217955192829822E-2,0.10524398871651834,0.17379522933725461,2.2943957675662856E-2,5.2356521687222504E-2,3.5101740176580404E-3,6.4599729404545336E-2,3.1478820564462308E-2,7.0089102184208135E-2,0.26236111132639572,3.3336443744026036E-2,4.7036207340694072E-3,6.9680416095728712E-2,1.7778915628377992E-4,1.7236922954322876E-2,0,9.9227254758863959E-2,7.1471240826079547E-3,2.2196312007135763E-2,2.7514404600055319E-3,0.26199408562914306,0.11584463500172312,8.0115778750836211E-2,1.2125220458553791E-2,3.6138711344959037E-2,5.4698760231154553E-2,1.4730964358102585E-2,1.2384844803180591E-2,0.12100686957979973,4.3370785619599762E-3,4.5705831598405577E-2,0.29348250862440711,5.3129892766780882E-3,9.4603408650063905E-3,0,2.4564017288999554E-2,0,3.0009125758692801E-2,0.05,0.14142593724613317,0.13593867689126635,0.34662780706348156,0.14245312649610664,0.1373205643479922,4.3853028660384173E-2,1.2071666501764456E-2,3.0554330477150535E-2,8.815845047416368E-2,7.1135866539544554E-2,0.16679128436442156,0.11855346242159501,0.1196508646841396,0,0,4.2400697515608743E-3,0.19745609552344687,2.7093145251618687E-2,1.3927683038381124E-2,1.2842717095184414E-2,4.3676021071800207E-2,2.3951449559438471E-2,2.2595075117065558E-2,4.5906313004032258E-2,0.16999233112209503,4.6933880480679528E-2,0.16,0,0.02,0.02,0.13,0.08,0.09,0.02,0.1,0.2,0.1,0.19,0.09,0,0.11,0.04,0.4,0.09,0,0.04,0.01,0.02,0.03,0.1,7.0000000000000007E-2,7.0000000000000007E-2,0.01,0,0.05,0,0.09,0.18,0.14000000000000001,0.11,0.05,0.02,0.05,0.08,0.06,0.05,7.0000000000000007E-2,1.29,1.68,2.71,3.32,3.29,1.96,1.66,0.49,0.33,0,1.41,0.02,0.75,1.64,1.64,1.2,0.01,0.03,0.01,0.02,7.0000000000000007E-2,0,0.04,0.45,0,0.11,0.11,0.08,0.03,0.15,0.35,0.01,0.05,0,0.01,0,7.0000000000000007E-2,0.04,0.01,0.01,0.06,0.04,0.04,0.03,0.02,0.01,0.11,"-","-",0.04]
[null,"Circunstancias fortuitas previstas en las condiciones de diseño",0.01,0.02,0.02,7.0000000000000007E-2,0.02,0,0.12,0.02,0,0.01,0.01,0.04,0.03,4.0864981507869221E-2,1.234316133777162E-2,0,0,1.5272353881726375E-3,0,6.8061452269444558E-3,8.4321511356363968E-2,0,3.1172036530458757E-2,9.9517340896651242E-5,4.4140756042869498E-4,1.4966684029678396E-2,0.10431523639921918,2.5877538515406164E-2,3.5521096879612061E-3,0,3.3664846347352317E-3,8.3453684572083499E-3,1.921444734992471E-2,4.0314109198178724E-2,0.1118078357777315,1.1945838196611283E-2,2.1683199569216348E-2,6.7895183819520213E-2,3.5034240458638927E-2,1.8759821318219537E-3,1.630971691828476E-3,1.1035189010717375E-4,1.7982470588632782E-2,1.8781891696240973E-2,3.80813644103874E-3,1.9368749178491487E-2,2.3768816223395387E-2,0.21657884222938506,1.6415763252526323E-2,4.6654224695412442E-3,0,2.6853312886532907E-2,1.0792978261369676E-2,1.124851165381451E-2,7.6488000018547095E-2,0,3.9731874448416612E-4,0,0,0,6.1532748790187335E-4,1.945128369198811E-3,0,2.2395637719261637E-4,0.01,1.426377300571462E-2,0.23689806665515017,7.3123587089959044E-2,0,9.9655741656899777E-2,0,1.21327271677895E-3,2.3033939225873896E-2,0,0,5.482921531978046E-2,0,4.0704215085319365E-2,0,0,0,2.4936033406137998E-3,0,6.3311371372212271E-3,0,0,0,0,0,1.080477752726712E-2,1.6429871717269357E-3,0,0,0.02,0.01,0.02,0.01,0,0.01,0.08,0,0,0.01,0.01,0,0,0.01,0,0,0,0,0,0,0,0,0,0,0,0,0,0,0,0,0,0,0,0,0.01,0,0,0,0,0,0,0.01,0,0,0,0,0,0.02,0,0,0,0,0,0,0,0,0,0,0.02,0,0,0,0,0,0.01,0.01,0,0,0,0,0,0.01,0,0,0,0,0,0,0.01,0.01,0,0,0,0,0,0,"-","-",0]
[null,"Causa de fuerza mayor o acciones de terceros",0,0.08,0,0.05,0,0,0,0.06,0,0.01,1.47,5.0999999999999996,0.56999999999999995,0.99502487562189057,0.1589646015951986,0,0,3.0013463150198828E-3,2.4568515447454084E-3,0,0,0,0,2.5332208234507082E-2,0,2.5536716462712904E-3,0,0,0,0,0,0,0,0,0,1.3782516793486488E-4,0,0,1.1844279801184826E-5,0,0,0,0,0,0,0,0,0,0,0,0,0,0,0,0,0,0,0,0,0,0,0,0,0,0,0,0,0,0,0,0,0,0,0,0,0,0,0,0,0,0,0,7.3817089885150496E-4,0,2.7550150306393798E-2,0,0,5.7819184298762864E-2,5.3903449820788532E-3,0,7.7562822468126534E-3,0,0,0,7.0000000000000007E-2,0.04,0.02,0,0,0.01,0.03,0,0.03,0.02,0.15,0.01,7.0000000000000007E-2,0.08,0,0.12,0.03,0.01,0.14000000000000001,0.16,0.53,0.41,0.14000000000000001,0.08,0.05,0,0.23,0.52,0.3,0.06,0.2,0.38,0.02,0.3,0.64,0.23,0.12,0.15,0.03,0.08,0.04,0.03,0.03,0.39,0.11,0.03,0,0,0.08,0,0,0,0,0,0,0.01,0.01,0.02,0.03,0.02,0,0.01,0,0,0.04,0.01,0.01,0,0.03,0,0,0,0.01,0,0.01,0.05,0.03,7.0000000000000007E-2,0.14000000000000001,0,0.16,0,0.01,0,0.05,"-","-",0.05]
[null,"Sin clasificar (*)",0,0,0,0,0,0,0,0,0,0,0,0,0,0,0,0,0,0,0,0,0,0,0,0,0,0,0,0,0,0,0,0,0,0,0,0,0,0,0,0,0,0,0,0,0,0,0,0,0,0,6.0865198054667834E-4,5.1552490155592977E-5,0,0,0,0,2.1079951962979966E-3,0,6.8218596261829587E-5,0,0,0,0,0,1.4127881447876487E-4,0,0,0,0,0,0,0,0,0,0,0,0,0,0,0,0,0,0,0,0,0,0,0,0,0,0,0,0,0,0,0,0,0,0,0,0,0,0,0,0,0,0,0,0,0,0,0,0,0,0,0,0,0,0,0,0,0,0,0,0,0,0,0,0,0,0,0,0,0,0,0,0,0,0,0,0,0,0,0,0,0,0,0,0,0,0,0,0,0,0,0,1.31,0,0,0,0,0,0,0,0,0,0,0,0,0,0,0,0,0,0,0,0,0,0.04,"-","-",0]
[null,"Total",0.11,0.17,0.51,0.18,0.5,0.28999999999999998,0.51,0.23,0.16,0.3,0.45,0.11,0.29000000000000625,1.2473840452528999,1.5803582147383972,1.1559817265362122,1.0644664932911201,1.4320611257549549,1.347930032776633,0.40614130255640446,0.20491182082419446,7.15254163153555E-2,0.26478962885055329,0.16779317647373201,7.3506363759422724E-2,0.50576673882317069,1.3571806578814323,0.84385380516293818,1.0866535290191346,1.448484874273783,0.82491657857395684,0.86979781214350671,0.80753687307632493,0.22706684576618824,0.5663335373297953,0.76700400248421163,0.66737704716589474,0.53352320339090054,0.82724388141748317,0.14205905346524553,0.86491757095742083,0.34929806388834944,0.45796231256799586,0.76635433403370001,0.56711046620649108,0.34458527184820287,0.75244411044605697,0.79295030982451165,0.28266789917466595,0.20594788309108242,0.16404237610670686,0.47171235815933993,0.3222525782007693,9.4831542207709257E-2,0.40220990771266196,0.24144350015172567,0.29281206675105598,0.56323020978071647,0.20907552693117942,0.71963876408228122,0.4542146499129574,0.46885960183987352,0.57440305926884194,0.56691858378116877,0.41,0.27917149916632633,0.45346302013216266,1.1334829060116471,0.47628386702835768,0.64229070847340997,0.55044233116967345,0.46813419798309613,0.4877422672524161,0.31513125937282205,0.47874245268901505,0.42911490224263249,0.22860763290463493,0.49640975056794573,3.9591203191842991E-2,5.0595425607238863E-2,0.17407178575557866,0.36717144272233421,0.94307946998930525,1.3441150053047839,1.5437404929399352,0.84881504996964996,1.6327287863089905,1.3309130413378714,2.7599307188993434,1.5407586219926679,1.0509181099576672,0.91,0.72,0.82,1.8,1.83,0.88,0.55000000000000004,0.43,1.47,1.87,0.96,0.87,1.0900000000000001,0.43,0.67,2.3000000000000003,1.89,3.89,1.79,1.79,2.2200000000000002,1.42,2.3199999999999998,1.22,0.34,1.7,0.22,0.5,1.1500000000000001,2.11,3.32,2.81,1.47,1.41,1.52,2.4700000000000002,1.05,1.56,1.63,0.65,1.23,3.22,4.37,5.77,5.74,5.07,3.82,3.07,2.68,2.7,0.75,3.26,1.4,2.1,3.7,4.07,2.92,1.73,0.99,1.28,0.9,1.67,1.59,1.02,1.94,1.31,0.71,0.85,0.77,2.68,3.09,2.84,2.81,1.7,1.62,2.34,1.72,1.88,0.4,0.81,0.7,0.84,0.65,1.27,1.56,1.73,1.9,2.02,"-","-",1.19]
[]
[null,"Continuidad del suministro anual peninsular","2003","2004","2005","2006","2007","2008","2009","2010","2011","2012","2013","2014","2015","2016","2017","2018","2019","2020","2021","2022"]
[null,"Número de cortes",25,24,22,40,34,31,32,40,32,24,18,24,18,15,12,11,"-","-","-","-"]
[null,"Energía no suministrada  mensual (MWh)",466.23,1249.6500000000001,548.79,935.8,757.16,573.54,437.4991,1570.54,279.69,132.77000000000001,1156.18,204.34000000000003,52.769999999999996,77.965000000000003,60.152999999999999,207.95999999999998,"-","-","-","-"]
[null,"Tiempo de interrupción medio  mensual (minutos)",1.095,2.798,1.1759999999999999,1.9390000000000001,1.5229999999999999,1.147,0.91,3.1669999999999998,0.57699999999999996,0.27800000000000002,2.4670000000000001,0.441,0.112,0.16400000000000001,0.125,0.42699999999999999,"-","-","-","-"]
[]
[null,"Continuidad del suministro anual Islas Baleares",2005,"2006","2007","2008","2009","2010","2011","2012","2013","2014","2015","2016","2017","2018","2019","2020","2021","2022","2023","2024"]
[null,"Número de cortes",4,3,6,3,6,3,6,4,4,5,5,1,5,2,"-","-","-","-","-","-"]
[null,"Energía no suministrada  mensual (MWh)",242.32499999999999,46.070000648498535,326.41998791694641,7.4800001382827759,39.131949901580811,8.5399999999999991,38.69,7.49,80.959999999999994,12.810000000000002,29.36,0.3,33.07,33.81,"-","-","-","-","-","-"]
[null,"Tiempo de interrupción medio  mensual (minutos)",22.305140462600828,4.1202479563041683,28.725354620799834,0.64398754530944313,3.4119884308630857,0.76900000000000002,3.5409999999999999,0.67800000000000005,7.5,1.2050000000000001,2.6619999999999999,2.7E-2,2.883,2.7879999999999998,"-","-","-","-","-","-"]
[]
[null,"Continuidad del suministro anual Islas Canarias",2005,"2006","2007","2008","2009","2010","2011","2012","2013","2014","2015","2016","2017","2018","2019","2020","2021","2022","2023","2024"]
[null,"Número de cortes",27,10,11,10,4,18,2,5,5,7,12,14,12,3,"-","-","-","-","-","-"]
[null,"Energía no suministrada  mensual (MWh)",824.64,180.32972222222227,280.96065277777774,1042.9098055555555,1678.5391666666665,4089.5587694444439,17.268549999999998,224.14,72.02000000000001,147.57,149.71700000000001,457.11,46.910000000000004,7.91,"-","-","-","-","-","-"]
[null,"Tiempo de interrupción medio  mensual (minutos)",51.09,10.666299424502649,16.032155207997004,58.937379093999539,96.886047891506621,241.68330353377169,1.0233940577103893,13.25,4.38,9.0399999999999991,9.0779999999999994,27.446999999999999,2.7519999999999998,0.20699999999999999,"-","-","-","-","-","-"]
[]
[null,"Indisponibilidad anual peninsular según clasificación RD1955/2000 (%)",2004,"2005","2006","2007","2008","2009","2010","2011","2012","2013","2014","2015","2016","2017","2018","2019","2020","2021","2022","2023"]
[]
[null,"Mantenimiento preventivo y predictivo",0.61162570019636198,0.44246016624608564,0.41455774574882837,0.24,0.36,0.4,0.46,0.45,0.42,0.56000000000000005,0.62,0.64,0.73,0.76,0.73,"-","-","-","-","-"]
[null,"Causas ajenas al mantenimiento",0.88710637706342998,0.88005221074744788,0.95432820798679874,1.32,1.3,1.31,1.32,1.63,1.59,1.1000000000000001,1.02,1.23,0.84,0.82,0.91,"-","-","-","-","-"]
[null,"Mantenimiento correctivo",0.19397654634618003,0.31489480207844228,0.26219844673826098,0.31,0.2,0.2,0.26,0.18,0.2,0.12,0.17,0.18,0.11,0.12,0.12,"-","-","-","-","-"]
[null,"Circunstancias fortuitas previstas en las condiciones de diseño",8.5646589836188489E-2,1.4742165723970942E-2,1.6447936159585438E-2,0.02,0.01,0.02,0.01,0.01,0.01,0.01,0,0.01,0.01,0.01,0.01,"-","-","-","-","-"]
[null,"Causa de fuerza mayor o acciones de terceros",0.22783198200989285,0.18960865045829345,0.23805293770722988,0.62,0.47,0.44,0.3,0.17,0.16,0.31,0.23,0.16,0.19,0.45,0.24,"-","-","-","-","-"]
[null,"Sin clasificar (*)",4.8640162341999776E-3,0,0,0,0,0,0,0,0,0,0,0,0,0,0,"-","-","-","-","-"]
[null,"Total",1.7832192296763607,1.6521493447959439,1.647532336633472,1.89,1.88,1.93,2.0499999999999998,2.27,2.21,1.8,1.81,2.06,1.67,1.71,1.77,"-","-","-","-","-"]
[]
[null,"Indisponibilidad anual Islas Baleares según clasificación RD1955/2000 (%)",2005,"2006","2007","2008","2009","2010","2011","2012","2013","2014","2015","2016","2017","2018","2019","2020","2021","2022","2023","2024"]
[null,"Mantenimiento preventivo y predictivo",8.6999999999999994E-2,0.82,0.29402450293336607,0.35713430223330844,0.4,0.45,0.79,0.31,0.18,0.25,0.8,0.67,0.8,1.21,"-","-","-","-","-","-"]
[null,"Causas ajenas al mantenimiento",0.187,2.1930000000000001,1.41443573479541,0.94628702335847314,0.63,0.31,0.96,1.59,1.82,1.65,2.2800000000000002,2.27,1.29,1.05,"-","-","-","-","-","-"]
[null,"Mantenimiento correctivo",2E-3,4.5999999999999999E-2,0.38198623240284196,0.35014994297478608,0.12,0.06,0.04,0.02,0.03,0.08,0.04,0.11,0.06,0.03,"-","-","-","-","-","-"]
[null,"Circunstancias fortuitas previstas en las condiciones de diseño",6.0000000000000001E-3,8.0000000000000002E-3,5.5214712756964171E-3,3.9335636567076641E-3,0,0,0,0,0,0,0.01,0.01,0,0,"-","-","-","-","-","-"]
[null,"Causa de fuerza mayor o acciones de terceros",2E-3,0,3.7609485743745519E-3,0,0,0,0.22,0,0.01,0.02,0.14000000000000001,0.04,0,0.01,"-","-","-","-","-","-"]
[null,"Sin clasificar (*)",0,0,0,0,0,0,0,0,0,0,0,0,0,0,"-","-","-","-","-","-"]
[null,"Total",0.27900000000000003,3.0669999999999997,2.0959679414073147,1.6575048322232755,1.1599999999999999,0.83,1.79,1.93,2.0300000000000002,1.99,3.12,3.06,2.15,2.29,"-","-","-","-","-","-"]
[]
[null,"Indisponibilidad anual Islas Canarias según clasificación RD1955/2000 (%)",2005,"2006","2007","2008","2009","2010","2011","2012","2013","2014","2015","2016","2017","2018","2019","2020","2021","2022","2023","2024"]
[null,"Mantenimiento preventivo y predictivo",0.19,0.16326578175134571,0.25042989213157962,0.10279705699669898,0.19,0.18125405817627854,0.85931573593312705,0.64,0.62,0.62,0.65,0.68,0.78,1.01,"-","-","-","-","-","-"]
[null,"Causas ajenas al mantenimiento",0.02,0.32322901420232242,0.47209933273153587,0.28736322804495351,0.17,0.15480061262220823,0.14302550637213385,0.34,1,0.95,1.2,0.81,1.03,0.67,"-","-","-","-","-","-"]
[null,"Mantenimiento correctivo",0.06,4.305258839824206E-3,6.9680416095728712E-2,5.4698760231154553E-2,0.05,0.1196508646841396,4.6933880480679528E-2,0.09,7.0000000000000007E-2,0.06,1.41,0.45,7.0000000000000007E-2,0.03,"-","-","-","-","-","-"]
[null,"Circunstancias fortuitas previstas en las condiciones de diseño",0.03,1.4966684029678396E-2,3.5034240458638927E-2,2.6853312886532907E-2,0.01,4.0704215085319365E-2,1.6429871717269357E-3,0.01,0,0,0,0,0,0,"-","-","-","-","-","-"]
[null,"Causa de fuerza mayor o acciones de terceros",0.56999999999999995,2.5536716462712904E-3,1.1844279801184826E-5,0,0,0,7.7562822468126534E-3,0.02,0.14000000000000001,0.23,0.08,0.01,0.01,0.05,"-","-","-","-","-","-"]
[null,"Sin clasificar (*)",0,0,0,5.1552490155592977E-5,1.4127881447876487E-4,0,0,0,0,0,0,0,0,0,"-","-","-","-","-","-"]
[null,"Total",0.29000000000000625,0.50576673882317069,0.82724388141748317,0.47171235815933993,0.41,0.49640975056794573,1.0509181099576672,1.0900000000000001,1.7,1.63,3.26,1.94,1.88,1.71,"-","-","-","-","-","-"]
[]
[null,"Datos RdT nacional",1998,1999,2000,2001,2002,2003,2004,2005,2006,2007,2008,2009,2010,2011,2012,2013,2014,2015,2016,2017,2018,2019,2020,2021,2022,2023,2024,2025,2026,2027]
[null,"km de circuito a 400 kV",{"$f":"+K3","v":14538.47},{"$f":"+L3","v":14538.47},14918,15364.268999999998,16066.739,16592.458999999999,16840.612000000001,16845.694,17051.9434,17190.606400000001,17764.621000000006,18056.470000000008,18792.418999999998,19671.349999999999,20108.846000000001,20639.478000000003,21093.728000000003,21183.826000000001,{"$f":"+AC3","v":21619.966},{"$f":"+AD3","v":21728.155000000002},{"$f":"+AE3","v":21732.688999999998},"-","-","-","-","-","-","-","-","-"]
[null,"km de circuito ≤ 220 kV",{"$f":"+K4+C8+C9+C13+C14","v":17974.919999999998},{"$f":"+L4+D8+D9+D13+D14","v":18123.919999999998},18255.739999999998,18303.466999999997,18501.157999999999,18566.167999999998,18691.071799999994,18724.799899999995,19088.729060000005,19206.903060000004,19607.626060000002,19814.073059999992,19972.635999999999,20833.234000000004,21205.112060000003,21478.412060000002,21618.980560000007,21945.902560000006,{"$f":"+AC4+U8+U9+U13+U14","v":22167.623560000011},{"$f":"+AD4+V8+V9+V13+V14","v":22202.017270000004},{"$f":"+AE4+W8+W9+W13+W14","v":22331.248270000004},"-","-","-","-","-","-","-","-","-"]
[null,"Total km",{"$f":"SUM(C104:C105)","v":32513.39},32662.39,33173.74,33667.735999999997,34567.896999999997,35158.626999999993,35531.683799999999,35570.493899999994,36140.672460000002,36397.509460000001,37372.247060000009,37870.543059999996,38765.054999999993,40504.584000000003,41313.958060000004,42117.890060000005,42712.708560000014,43129.728560000003,43787.589560000008,{"$f":"SUM(V104:V105)","v":43930.17227000001},44063.937270000002,"-","-","-","-","-","-","-","-","-"]

{"sheet":"Año","index":18,"n_rows":17,"n_cols":26,"rows_kept":17,"cut":false,"hidden":true,"merged":[]}
[null,null,null,null,null,null,null,null,null,null,null,null,null,null,null,null,null,null,null,null,null,null,null,1,4,1]
[null,"1990-1999","1998-2007",2003,"2003-2012","2005-2014","2004-2013",null,null,null,null,null,null,"Red de transporte","Peninsular","Anual"]
[null,"2000-2009","2008-2017",2004,"2013-2022","2015-2024","2014-2023",null,null,null,null,null,null,"Continuidad del suministro","Canarias","Mensual"]
[null,"2010-2019","2018-2027",2005,null,null,null,null,null,null,null,null,null,"Indisponibilidad","Baleares"]
[null,null,null,2006,null,null,null,null,null,null,null,null,null,null,"Nacional"]
[null,null,null,2007]
[null,null,null,2008]
[null,null,null,2009]
[null,null,null,2010]
[null,null,null,2011]
[null,null,null,2012]
[null,null,null,2013]
[null,null,null,2014]
[null,null,null,2015]
[null,null,null,2016]
[null,null,null,2017]
[null,null,null,2018]