{"text_format":"1","workbook":"xlsx","n_sheets":14,"sheets":["AVISO LEGAL","Indisp.Peninsular P mes","Indisp.Peninsular P año","Indisp.Peninsular Pr mes","Indisp.Peninsular Pr año","Indisp.Peninsular NP mes","Indisp.Peninsular NP año","Disponibilidad Peninsular mes","Disponibilidad Peninsular año","Horas funcionamiento mes","Horas funcionamiento año","Datos","Mozart Reports","Año"],"not_rendered":{"charts":0,"images":1,"macros":1,"external_links":0,"defined_names":12,"comments":0,"pivot_tables":0},"unopened":[],"bounds":{"document_bytes":16777216,"sheet_cells":100000,"rows_first":2000,"rows_last":500,"rows_between":2000,"halvings":0,"cell_chars":16384,"cell_head_chars":4096},"cells_cut":0,"cells_raw":0,"read":"whole","date_system":"1900"}

{"sheet":"AVISO LEGAL","index":0,"n_rows":23,"n_cols":10,"rows_kept":23,"cut":false,"hidden":false,"merged":[]}
[]
[null,null,null,null,null,null,null,"Fecha de actualización:",null,"2020-07-10"]
[]
[]
[]
[]
[]
[]
[]
[]
[]
[]
[]
[]
[]
[]
[]
[]
[]
[]
[]
[]
[null,null,null,null,null,null,null,null,null,"www.ree.es"]

{"sheet":"Indisp.Peninsular P mes","index":1,"n_rows":16,"n_cols":15,"rows_kept":16,"cut":false,"hidden":false,"merged":[[15,1,15,13]]}
[null,null,null,null,null,null,null,null,null,null,null,null,null,null,1]
[null,null,null,null,null,null,null,null,null,null,null,null,null,null,20]
[]
[null,null,null,null,null,null,null,null,null,null,null,"Concepto"]
[null,null,null,null,null,null,null,null,null,null,null,"Horizonte temporal"]
[null,null,null,null,null,null,null,null,null,null,null,"Periodo"]
[]
[null,null,"Ene.","Feb.","Mar.","Abr.","May.","Jun.","Jul.","Ago.","Sep.","Oct.","Nov.","Dic.",{"$f":"OFFSET(Año!B13,($O$2-1),0)","v":2020}]
[]
[null,"Nuclear",{"$f":"OFFSET(Datos!C3,0,($O$2-1)*13)","v":0},{"$f":"OFFSET(Datos!D3,0,($O$2-1)*13)","v":0},{"$f":"OFFSET(Datos!E3,0,($O$2-1)*13)","v":0},{"$f":"OFFSET(Datos!F3,0,($O$2-1)*13)","v":0},{"$f":"OFFSET(Datos!G3,0,($O$2-1)*13)","v":0},{"$f":"OFFSET(Datos!H3,0,($O$2-1)*13)","v":0},{"$f":"OFFSET(Datos!I3,0,($O$2-1)*13)","v":"-"},{"$f":"OFFSET(Datos!J3,0,($O$2-1)*13)","v":"-"},{"$f":"OFFSET(Datos!K3,0,($O$2-1)*13)","v":"-"},{"$f":"OFFSET(Datos!L3,0,($O$2-1)*13)","v":"-"},{"$f":"OFFSET(Datos!M3,0,($O$2-1)*13)","v":"-"},{"$f":"OFFSET(Datos!N3,0,($O$2-1)*13)","v":"-"},{"$f":"OFFSET(Datos!O3,0,($O$2-1)*13)","v":0}]
[null,"Carbón",{"$f":"OFFSET(Datos!C4,0,($O$2-1)*13)","v":0},{"$f":"OFFSET(Datos!D4,0,($O$2-1)*13)","v":0},{"$f":"OFFSET(Datos!E4,0,($O$2-1)*13)","v":0},{"$f":"OFFSET(Datos!F4,0,($O$2-1)*13)","v":0},{"$f":"OFFSET(Datos!G4,0,($O$2-1)*13)","v":0},{"$f":"OFFSET(Datos!H4,0,($O$2-1)*13)","v":0},{"$f":"OFFSET(Datos!I4,0,($O$2-1)*13)","v":"-"},{"$f":"OFFSET(Datos!J4,0,($O$2-1)*13)","v":"-"},{"$f":"OFFSET(Datos!K4,0,($O$2-1)*13)","v":"-"},{"$f":"OFFSET(Datos!L4,0,($O$2-1)*13)","v":"-"},{"$f":"OFFSET(Datos!M4,0,($O$2-1)*13)","v":"-"},{"$f":"OFFSET(Datos!N4,0,($O$2-1)*13)","v":"-"},{"$f":"OFFSET(Datos!O4,0,($O$2-1)*13)","v":0}]
[null,"Fuel + Gas",{"$f":"OFFSET(Datos!C5,0,($O$2-1)*13)","v":"-"},{"$f":"OFFSET(Datos!D5,0,($O$2-1)*13)","v":"-"},{"$f":"OFFSET(Datos!E5,0,($O$2-1)*13)","v":"-"},{"$f":"OFFSET(Datos!F5,0,($O$2-1)*13)","v":"-"},{"$f":"OFFSET(Datos!G5,0,($O$2-1)*13)","v":"-"},{"$f":"OFFSET(Datos!H5,0,($O$2-1)*13)","v":"-"},{"$f":"OFFSET(Datos!I5,0,($O$2-1)*13)","v":"-"},{"$f":"OFFSET(Datos!J5,0,($O$2-1)*13)","v":"-"},{"$f":"OFFSET(Datos!K5,0,($O$2-1)*13)","v":"-"},{"$f":"OFFSET(Datos!L5,0,($O$2-1)*13)","v":"-"},{"$f":"OFFSET(Datos!M5,0,($O$2-1)*13)","v":"-"},{"$f":"OFFSET(Datos!N5,0,($O$2-1)*13)","v":"-"},{"$f":"OFFSET(Datos!O5,0,($O$2-1)*13)","v":"-"}]
[null,"Ciclo combinado",{"$f":"OFFSET(Datos!C6,0,($O$2-1)*13)","v":0},{"$f":"OFFSET(Datos!D6,0,($O$2-1)*13)","v":0},{"$f":"OFFSET(Datos!E6,0,($O$2-1)*13)","v":0},{"$f":"OFFSET(Datos!F6,0,($O$2-1)*13)","v":0},{"$f":"OFFSET(Datos!G6,0,($O$2-1)*13)","v":0},{"$f":"OFFSET(Datos!H6,0,($O$2-1)*13)","v":0},{"$f":"OFFSET(Datos!I6,0,($O$2-1)*13)","v":"-"},{"$f":"OFFSET(Datos!J6,0,($O$2-1)*13)","v":"-"},{"$f":"OFFSET(Datos!K6,0,($O$2-1)*13)","v":"-"},{"$f":"OFFSET(Datos!L6,0,($O$2-1)*13)","v":"-"},{"$f":"OFFSET(Datos!M6,0,($O$2-1)*13)","v":"-"},{"$f":"OFFSET(Datos!N6,0,($O$2-1)*13)","v":"-"},{"$f":"OFFSET(Datos!O6,0,($O$2-1)*13)","v":0}]
[null,"Indisponibilidad permanente",{"$f":"OFFSET(Datos!C7,0,($O$2-1)*13)","v":0},{"$f":"OFFSET(Datos!D7,0,($O$2-1)*13)","v":0},{"$f":"OFFSET(Datos!E7,0,($O$2-1)*13)","v":0},{"$f":"OFFSET(Datos!F7,0,($O$2-1)*13)","v":0},{"$f":"OFFSET(Datos!G7,0,($O$2-1)*13)","v":0},{"$f":"OFFSET(Datos!H7,0,($O$2-1)*13)","v":0},{"$f":"OFFSET(Datos!I7,0,($O$2-1)*13)","v":"-"},{"$f":"OFFSET(Datos!J7,0,($O$2-1)*13)","v":"-"},{"$f":"OFFSET(Datos!K7,0,($O$2-1)*13)","v":"-"},{"$f":"OFFSET(Datos!L7,0,($O$2-1)*13)","v":"-"},{"$f":"OFFSET(Datos!M7,0,($O$2-1)*13)","v":"-"},{"$f":"OFFSET(Datos!N7,0,($O$2-1)*13)","v":"-"},{"$f":"OFFSET(Datos!O7,0,($O$2-1)*13)","v":0}]
[]
[null,"Datos a último día de cada mes."]

{"sheet":"Indisp.Peninsular P año","index":2,"n_rows":16,"n_cols":10,"rows_kept":16,"cut":false,"hidden":false,"merged":[[15,1,15,9]]}
[null,null,null,null,null,null,null,null,null,1]
[null,null,null,null,null,null,null,null,null,3]
[]
[null,null,null,null,null,null,null,"Concepto"]
[null,null,null,null,null,null,null,"Horizonte temporal"]
[null,null,null,null,null,null,null,"Periodo"]
[]
[null,null,{"$f":"OFFSET(Datos!C37,0,($J$2-1)*8)","v":2017},{"$f":"OFFSET(Datos!D37,0,($J$2-1)*8)","v":2018},{"$f":"OFFSET(Datos!E37,0,($J$2-1)*8)","v":2019},{"$f":"OFFSET(Datos!F37,0,($J$2-1)*8)","v":2020},{"$f":"OFFSET(Datos!G37,0,($J$2-1)*8)","v":2021},{"$f":"OFFSET(Datos!H37,0,($J$2-1)*8)","v":2022},{"$f":"OFFSET(Datos!I37,0,($J$2-1)*8)","v":2023},{"$f":"OFFSET(Datos!J37,0,($J$2-1)*8)","v":2024}]
[]
[null,"Nuclear",{"$f":"OFFSET(Datos!C38,0,($J$2-1)*8)","v":5.0574842366605397},{"$f":"OFFSET(Datos!D38,0,($J$2-1)*8)","v":0},{"$f":"OFFSET(Datos!E38,0,($J$2-1)*8)","v":0},{"$f":"OFFSET(Datos!F38,0,($J$2-1)*8)","v":0},{"$f":"OFFSET(Datos!G38,0,($J$2-1)*8)","v":"-"},{"$f":"OFFSET(Datos!H38,0,($J$2-1)*8)","v":"-"},{"$f":"OFFSET(Datos!I38,0,($J$2-1)*8)","v":"-"},{"$f":"OFFSET(Datos!J38,0,($J$2-1)*8)","v":"-"}]
[null,"Carbón",{"$f":"OFFSET(Datos!C39,0,($J$2-1)*8)","v":0},{"$f":"OFFSET(Datos!D39,0,($J$2-1)*8)","v":0},{"$f":"OFFSET(Datos!E39,0,($J$2-1)*8)","v":0},{"$f":"OFFSET(Datos!F39,0,($J$2-1)*8)","v":0},{"$f":"OFFSET(Datos!G39,0,($J$2-1)*8)","v":"-"},{"$f":"OFFSET(Datos!H39,0,($J$2-1)*8)","v":"-"},{"$f":"OFFSET(Datos!I39,0,($J$2-1)*8)","v":"-"},{"$f":"OFFSET(Datos!J39,0,($J$2-1)*8)","v":"-"}]
[null,"Fuel + Gas",{"$f":"OFFSET(Datos!C40,0,($J$2-1)*8)","v":"-"},{"$f":"OFFSET(Datos!D40,0,($J$2-1)*8)","v":"-"},{"$f":"OFFSET(Datos!E40,0,($J$2-1)*8)","v":"-"},{"$f":"OFFSET(Datos!F40,0,($J$2-1)*8)","v":"-"},{"$f":"OFFSET(Datos!G40,0,($J$2-1)*8)","v":"-"},{"$f":"OFFSET(Datos!H40,0,($J$2-1)*8)","v":"-"},{"$f":"OFFSET(Datos!I40,0,($J$2-1)*8)","v":"-"},{"$f":"OFFSET(Datos!J40,0,($J$2-1)*8)","v":"-"}]
[null,"Ciclo combinado",{"$f":"OFFSET(Datos!C41,0,($J$2-1)*8)","v":0},{"$f":"OFFSET(Datos!D41,0,($J$2-1)*8)","v":0.13208654926153901},{"$f":"OFFSET(Datos!E41,0,($J$2-1)*8)","v":0},{"$f":"OFFSET(Datos!F41,0,($J$2-1)*8)","v":0},{"$f":"OFFSET(Datos!G41,0,($J$2-1)*8)","v":"-"},{"$f":"OFFSET(Datos!H41,0,($J$2-1)*8)","v":"-"},{"$f":"OFFSET(Datos!I41,0,($J$2-1)*8)","v":"-"},{"$f":"OFFSET(Datos!J41,0,($J$2-1)*8)","v":"-"}]
[null,"Indisponibilidad permanente",{"$f":"OFFSET(Datos!C42,0,($J$2-1)*8)","v":0.90318666995035402},{"$f":"OFFSET(Datos!D42,0,($J$2-1)*8)","v":7.9030279903824899E-2},{"$f":"OFFSET(Datos!E42,0,($J$2-1)*8)","v":0},{"$f":"OFFSET(Datos!F42,0,($J$2-1)*8)","v":0},{"$f":"OFFSET(Datos!G42,0,($J$2-1)*8)","v":"-"},{"$f":"OFFSET(Datos!H42,0,($J$2-1)*8)","v":"-"},{"$f":"OFFSET(Datos!I42,0,($J$2-1)*8)","v":"-"},{"$f":"OFFSET(Datos!J42,0,($J$2-1)*8)","v":"-"}]
[]
[null,{"$f":"IF(MONTH(FACT)=1,\"Datos acumulados a 31 de diciembre.\",CONCATENATE(\"Datos acumulados a 31 de diciembre. Para el año \",YEAR(FACT), \" datos acumulados a \",TEXT(FACT-30,\"mmmm\"),\" de \",YEAR(FACT),\".\"))","v":"Datos acumulados a 31 de diciembre. Para el año 2020 datos acumulados a junio de 2020."}]

{"sheet":"Indisp.Peninsular Pr mes","index":3,"n_rows":16,"n_cols":15,"rows_kept":16,"cut":false,"hidden":false,"merged":[[15,1,15,13]]}
[null,null,null,null,null,null,null,null,null,null,null,null,null,null,2]
[null,null,null,null,null,null,null,null,null,null,null,null,null,null,20]
[]
[null,null,null,null,null,null,null,null,null,null,null,"Concepto"]
[null,null,null,null,null,null,null,null,null,null,null,"Horizonte temporal"]
[null,null,null,null,null,null,null,null,null,null,null,"Periodo"]
[]
[null,null,"Ene.","Feb.","Mar.","Abr.","May.","Jun.","Jul.","Ago.","Sep.","Oct.","Nov.","Dic.",{"$f":"OFFSET(Año!B13,($O$2-1),0)","v":2020}]
[]
[null,"Nuclear",{"$f":"OFFSET(Datos!C10,0,($O$2-1)*13)","v":0},{"$f":"OFFSET(Datos!D10,0,($O$2-1)*13)","v":0},{"$f":"OFFSET(Datos!E10,0,($O$2-1)*13)","v":0},{"$f":"OFFSET(Datos!F10,0,($O$2-1)*13)","v":0},{"$f":"OFFSET(Datos!G10,0,($O$2-1)*13)","v":6.3100997492671196},{"$f":"OFFSET(Datos!H10,0,($O$2-1)*13)","v":9.1834374629223898},{"$f":"OFFSET(Datos!I10,0,($O$2-1)*13)","v":"-"},{"$f":"OFFSET(Datos!J10,0,($O$2-1)*13)","v":"-"},{"$f":"OFFSET(Datos!K10,0,($O$2-1)*13)","v":"-"},{"$f":"OFFSET(Datos!L10,0,($O$2-1)*13)","v":"-"},{"$f":"OFFSET(Datos!M10,0,($O$2-1)*13)","v":"-"},{"$f":"OFFSET(Datos!N10,0,($O$2-1)*13)","v":"-"},{"$f":"OFFSET(Datos!O10,0,($O$2-1)*13)","v":2.5891433906019801}]
[null,"Carbón",{"$f":"OFFSET(Datos!C11,0,($O$2-1)*13)","v":0},{"$f":"OFFSET(Datos!D11,0,($O$2-1)*13)","v":0},{"$f":"OFFSET(Datos!E11,0,($O$2-1)*13)","v":0},{"$f":"OFFSET(Datos!F11,0,($O$2-1)*13)","v":0},{"$f":"OFFSET(Datos!G11,0,($O$2-1)*13)","v":0},{"$f":"OFFSET(Datos!H11,0,($O$2-1)*13)","v":0},{"$f":"OFFSET(Datos!I11,0,($O$2-1)*13)","v":"-"},{"$f":"OFFSET(Datos!J11,0,($O$2-1)*13)","v":"-"},{"$f":"OFFSET(Datos!K11,0,($O$2-1)*13)","v":"-"},{"$f":"OFFSET(Datos!L11,0,($O$2-1)*13)","v":"-"},{"$f":"OFFSET(Datos!M11,0,($O$2-1)*13)","v":"-"},{"$f":"OFFSET(Datos!N11,0,($O$2-1)*13)","v":"-"},{"$f":"OFFSET(Datos!O11,0,($O$2-1)*13)","v":0}]
[null,"Fuel + Gas",{"$f":"OFFSET(Datos!C12,0,($O$2-1)*13)","v":"-"},{"$f":"OFFSET(Datos!D12,0,($O$2-1)*13)","v":"-"},{"$f":"OFFSET(Datos!E12,0,($O$2-1)*13)","v":"-"},{"$f":"OFFSET(Datos!F12,0,($O$2-1)*13)","v":"-"},{"$f":"OFFSET(Datos!G12,0,($O$2-1)*13)","v":"-"},{"$f":"OFFSET(Datos!H12,0,($O$2-1)*13)","v":"-"},{"$f":"OFFSET(Datos!I12,0,($O$2-1)*13)","v":"-"},{"$f":"OFFSET(Datos!J12,0,($O$2-1)*13)","v":"-"},{"$f":"OFFSET(Datos!K12,0,($O$2-1)*13)","v":"-"},{"$f":"OFFSET(Datos!L12,0,($O$2-1)*13)","v":"-"},{"$f":"OFFSET(Datos!M12,0,($O$2-1)*13)","v":"-"},{"$f":"OFFSET(Datos!N12,0,($O$2-1)*13)","v":"-"},{"$f":"OFFSET(Datos!O12,0,($O$2-1)*13)","v":"-"}]
[null,"Ciclo combinado",{"$f":"OFFSET(Datos!C13,0,($O$2-1)*13)","v":0},{"$f":"OFFSET(Datos!D13,0,($O$2-1)*13)","v":7.2269603226998802},{"$f":"OFFSET(Datos!E13,0,($O$2-1)*13)","v":9.2120083049213104},{"$f":"OFFSET(Datos!F13,0,($O$2-1)*13)","v":1.75654326617698},{"$f":"OFFSET(Datos!G13,0,($O$2-1)*13)","v":3.45924049124649},{"$f":"OFFSET(Datos!H13,0,($O$2-1)*13)","v":5.4050847224710497},{"$f":"OFFSET(Datos!I13,0,($O$2-1)*13)","v":"-"},{"$f":"OFFSET(Datos!J13,0,($O$2-1)*13)","v":"-"},{"$f":"OFFSET(Datos!K13,0,($O$2-1)*13)","v":"-"},{"$f":"OFFSET(Datos!L13,0,($O$2-1)*13)","v":"-"},{"$f":"OFFSET(Datos!M13,0,($O$2-1)*13)","v":"-"},{"$f":"OFFSET(Datos!N13,0,($O$2-1)*13)","v":"-"},{"$f":"OFFSET(Datos!O13,0,($O$2-1)*13)","v":4.4892451642934796}]
[null,"Indisponibilidad prevista",{"$f":"OFFSET(Datos!C14,0,($O$2-1)*13)","v":0},{"$f":"OFFSET(Datos!D14,0,($O$2-1)*13)","v":4.3406264686439702},{"$f":"OFFSET(Datos!E14,0,($O$2-1)*13)","v":5.5328776265885704},{"$f":"OFFSET(Datos!F14,0,($O$2-1)*13)","v":1.0550076178690999},{"$f":"OFFSET(Datos!G14,0,($O$2-1)*13)","v":3.1759741140235098},{"$f":"OFFSET(Datos!H14,0,($O$2-1)*13)","v":4.8447955124542101},{"$f":"OFFSET(Datos!I14,0,($O$2-1)*13)","v":"-"},{"$f":"OFFSET(Datos!J14,0,($O$2-1)*13)","v":"-"},{"$f":"OFFSET(Datos!K14,0,($O$2-1)*13)","v":"-"},{"$f":"OFFSET(Datos!L14,0,($O$2-1)*13)","v":"-"},{"$f":"OFFSET(Datos!M14,0,($O$2-1)*13)","v":"-"},{"$f":"OFFSET(Datos!N14,0,($O$2-1)*13)","v":"-"},{"$f":"OFFSET(Datos!O14,0,($O$2-1)*13)","v":3.1469629249823199}]
[]
[null,"Datos a último día de cada mes."]

{"sheet":"Indisp.Peninsular Pr año","index":4,"n_rows":16,"n_cols":10,"rows_kept":16,"cut":false,"hidden":false,"merged":[[15,1,15,9]]}
[null,null,null,null,null,null,null,null,null,1]
[null,null,null,null,null,null,null,null,null,3]
[]
[null,null,null,null,null,null,null,"Concepto"]
[null,null,null,null,null,null,null,"Horizonte temporal"]
[null,null,null,null,null,null,null,"Periodo"]
[]
[null,null,{"$f":"OFFSET(Datos!C44,0,($J$2-1)*8)","v":2017},{"$f":"OFFSET(Datos!D44,0,($J$2-1)*8)","v":2018},{"$f":"OFFSET(Datos!E44,0,($J$2-1)*8)","v":2019},{"$f":"OFFSET(Datos!F44,0,($J$2-1)*8)","v":2020},{"$f":"OFFSET(Datos!G44,0,($J$2-1)*8)","v":2021},{"$f":"OFFSET(Datos!H44,0,($J$2-1)*8)","v":2022},{"$f":"OFFSET(Datos!I44,0,($J$2-1)*8)","v":2023},{"$f":"OFFSET(Datos!J44,0,($J$2-1)*8)","v":2024}]
[]
[null,"Nuclear",{"$f":"OFFSET(Datos!C45,0,($J$2-1)*8)","v":6.1765527400432196},{"$f":"OFFSET(Datos!D45,0,($J$2-1)*8)","v":5.4167816303009797},{"$f":"OFFSET(Datos!E45,0,($J$2-1)*8)","v":6.7573953939353997},{"$f":"OFFSET(Datos!F45,0,($J$2-1)*8)","v":2.5891433906019801},{"$f":"OFFSET(Datos!G45,0,($J$2-1)*8)","v":"-"},{"$f":"OFFSET(Datos!H45,0,($J$2-1)*8)","v":"-"},{"$f":"OFFSET(Datos!I45,0,($J$2-1)*8)","v":"-"},{"$f":"OFFSET(Datos!J45,0,($J$2-1)*8)","v":"-"}]
[null,"Carbón",{"$f":"OFFSET(Datos!C46,0,($J$2-1)*8)","v":5.2072246851478701},{"$f":"OFFSET(Datos!D46,0,($J$2-1)*8)","v":2.4390366941706199},{"$f":"OFFSET(Datos!E46,0,($J$2-1)*8)","v":1.83511272345556},{"$f":"OFFSET(Datos!F46,0,($J$2-1)*8)","v":0},{"$f":"OFFSET(Datos!G46,0,($J$2-1)*8)","v":"-"},{"$f":"OFFSET(Datos!H46,0,($J$2-1)*8)","v":"-"},{"$f":"OFFSET(Datos!I46,0,($J$2-1)*8)","v":"-"},{"$f":"OFFSET(Datos!J46,0,($J$2-1)*8)","v":"-"}]
[null,"Fuel + Gas",{"$f":"OFFSET(Datos!C47,0,($J$2-1)*8)","v":"-"},{"$f":"OFFSET(Datos!D47,0,($J$2-1)*8)","v":"-"},{"$f":"OFFSET(Datos!E47,0,($J$2-1)*8)","v":"-"},{"$f":"OFFSET(Datos!F47,0,($J$2-1)*8)","v":"-"},{"$f":"OFFSET(Datos!G47,0,($J$2-1)*8)","v":"-"},{"$f":"OFFSET(Datos!H47,0,($J$2-1)*8)","v":"-"},{"$f":"OFFSET(Datos!I47,0,($J$2-1)*8)","v":"-"},{"$f":"OFFSET(Datos!J47,0,($J$2-1)*8)","v":"-"}]
[null,"Ciclo combinado",{"$f":"OFFSET(Datos!C48,0,($J$2-1)*8)","v":4.6448474413324199},{"$f":"OFFSET(Datos!D48,0,($J$2-1)*8)","v":3.3142291855056301},{"$f":"OFFSET(Datos!E48,0,($J$2-1)*8)","v":4.6654064321284796},{"$f":"OFFSET(Datos!F48,0,($J$2-1)*8)","v":4.4892451642934796},{"$f":"OFFSET(Datos!G48,0,($J$2-1)*8)","v":"-"},{"$f":"OFFSET(Datos!H48,0,($J$2-1)*8)","v":"-"},{"$f":"OFFSET(Datos!I48,0,($J$2-1)*8)","v":"-"},{"$f":"OFFSET(Datos!J48,0,($J$2-1)*8)","v":"-"}]
[null,"Indisponibilidad prevista",{"$f":"OFFSET(Datos!C49,0,($J$2-1)*8)","v":5.0461264824120402},{"$f":"OFFSET(Datos!D49,0,($J$2-1)*8)","v":3.4738465986797902},{"$f":"OFFSET(Datos!E49,0,($J$2-1)*8)","v":4.3875650867737503},{"$f":"OFFSET(Datos!F49,0,($J$2-1)*8)","v":3.1469629249823199},{"$f":"OFFSET(Datos!G49,0,($J$2-1)*8)","v":"-"},{"$f":"OFFSET(Datos!H49,0,($J$2-1)*8)","v":"-"},{"$f":"OFFSET(Datos!I49,0,($J$2-1)*8)","v":"-"},{"$f":"OFFSET(Datos!J49,0,($J$2-1)*8)","v":"-"}]
[]
[null,{"$f":"IF(MONTH(FACT)=1,\"Datos acumulados a 31 de diciembre.\",CONCATENATE(\"Datos acumulados a 31 de diciembre. Para el año \",YEAR(FACT), \" datos acumulados a \",TEXT(FACT-30,\"mmmm\"),\" de \",YEAR(FACT),\".\"))","v":"Datos acumulados a 31 de diciembre. Para el año 2020 datos acumulados a junio de 2020."}]

{"sheet":"Indisp.Peninsular NP mes","index":5,"n_rows":16,"n_cols":15,"rows_kept":16,"cut":false,"hidden":false,"merged":[[15,1,15,13]]}
[null,null,null,null,null,null,null,null,null,null,null,null,null,null,3]
[null,null,null,null,null,null,null,null,null,null,null,null,null,null,20]
[]
[null,null,null,null,null,null,null,null,null,null,null,"Concepto"]
[null,null,null,null,null,null,null,null,null,null,null,"Horizonte temporal"]
[null,null,null,null,null,null,null,null,null,null,null,"Periodo"]
[]
[null,null,"Ene.","Feb.","Mar.","Abr.","May.","Jun.","Jul.","Ago.","Sep.","Oct.","Nov.","Dic.",{"$f":"OFFSET(Año!B13,($O$2-1),0)","v":2020}]
[]
[null,"Nuclear",{"$f":"OFFSET(Datos!C17,0,($O$2-1)*13)","v":5.4418317370187402E-2},{"$f":"OFFSET(Datos!D17,0,($O$2-1)*13)","v":0.13777060477095801},{"$f":"OFFSET(Datos!E17,0,($O$2-1)*13)","v":0.109809239633988},{"$f":"OFFSET(Datos!F17,0,($O$2-1)*13)","v":10.498633591861999},{"$f":"OFFSET(Datos!G17,0,($O$2-1)*13)","v":28.2170853404353},{"$f":"OFFSET(Datos!H17,0,($O$2-1)*13)","v":17.0716302486309},{"$f":"OFFSET(Datos!I17,0,($O$2-1)*13)","v":"-"},{"$f":"OFFSET(Datos!J17,0,($O$2-1)*13)","v":"-"},{"$f":"OFFSET(Datos!K17,0,($O$2-1)*13)","v":"-"},{"$f":"OFFSET(Datos!L17,0,($O$2-1)*13)","v":"-"},{"$f":"OFFSET(Datos!M17,0,($O$2-1)*13)","v":"-"},{"$f":"OFFSET(Datos!N17,0,($O$2-1)*13)","v":"-"},{"$f":"OFFSET(Datos!O17,0,($O$2-1)*13)","v":9.40280863121842}]
[null,"Carbón",{"$f":"OFFSET(Datos!C18,0,($O$2-1)*13)","v":14.393196619016599},{"$f":"OFFSET(Datos!D18,0,($O$2-1)*13)","v":13.5523244771486},{"$f":"OFFSET(Datos!E18,0,($O$2-1)*13)","v":13.039916138757899},{"$f":"OFFSET(Datos!F18,0,($O$2-1)*13)","v":11.148344846735201},{"$f":"OFFSET(Datos!G18,0,($O$2-1)*13)","v":10.8370867350136},{"$f":"OFFSET(Datos!H18,0,($O$2-1)*13)","v":18.2165567331242},{"$f":"OFFSET(Datos!I18,0,($O$2-1)*13)","v":"-"},{"$f":"OFFSET(Datos!J18,0,($O$2-1)*13)","v":"-"},{"$f":"OFFSET(Datos!K18,0,($O$2-1)*13)","v":"-"},{"$f":"OFFSET(Datos!L18,0,($O$2-1)*13)","v":"-"},{"$f":"OFFSET(Datos!M18,0,($O$2-1)*13)","v":"-"},{"$f":"OFFSET(Datos!N18,0,($O$2-1)*13)","v":"-"},{"$f":"OFFSET(Datos!O18,0,($O$2-1)*13)","v":13.518464730957101}]
[null,"Fuel + Gas",{"$f":"OFFSET(Datos!C19,0,($O$2-1)*13)","v":"-"},{"$f":"OFFSET(Datos!D19,0,($O$2-1)*13)","v":"-"},{"$f":"OFFSET(Datos!E19,0,($O$2-1)*13)","v":"-"},{"$f":"OFFSET(Datos!F19,0,($O$2-1)*13)","v":"-"},{"$f":"OFFSET(Datos!G19,0,($O$2-1)*13)","v":"-"},{"$f":"OFFSET(Datos!H19,0,($O$2-1)*13)","v":"-"},{"$f":"OFFSET(Datos!I19,0,($O$2-1)*13)","v":"-"},{"$f":"OFFSET(Datos!J19,0,($O$2-1)*13)","v":"-"},{"$f":"OFFSET(Datos!K19,0,($O$2-1)*13)","v":"-"},{"$f":"OFFSET(Datos!L19,0,($O$2-1)*13)","v":"-"},{"$f":"OFFSET(Datos!M19,0,($O$2-1)*13)","v":"-"},{"$f":"OFFSET(Datos!N19,0,($O$2-1)*13)","v":"-"},{"$f":"OFFSET(Datos!O19,0,($O$2-1)*13)","v":"-"}]
[null,"Ciclo combinado",{"$f":"OFFSET(Datos!C20,0,($O$2-1)*13)","v":16.285464396726699},{"$f":"OFFSET(Datos!D20,0,($O$2-1)*13)","v":10.640066035464701},{"$f":"OFFSET(Datos!E20,0,($O$2-1)*13)","v":11.586342484304399},{"$f":"OFFSET(Datos!F20,0,($O$2-1)*13)","v":13.5107223120265},{"$f":"OFFSET(Datos!G20,0,($O$2-1)*13)","v":14.395160102735399},{"$f":"OFFSET(Datos!H20,0,($O$2-1)*13)","v":14.2198974467554},{"$f":"OFFSET(Datos!I20,0,($O$2-1)*13)","v":"-"},{"$f":"OFFSET(Datos!J20,0,($O$2-1)*13)","v":"-"},{"$f":"OFFSET(Datos!K20,0,($O$2-1)*13)","v":"-"},{"$f":"OFFSET(Datos!L20,0,($O$2-1)*13)","v":"-"},{"$f":"OFFSET(Datos!M20,0,($O$2-1)*13)","v":"-"},{"$f":"OFFSET(Datos!N20,0,($O$2-1)*13)","v":"-"},{"$f":"OFFSET(Datos!O20,0,($O$2-1)*13)","v":13.4661253218329}]
[null,"Indisponibilidad no prevista",{"$f":"OFFSET(Datos!C21,0,($O$2-1)*13)","v":13.033997260359801},{"$f":"OFFSET(Datos!D21,0,($O$2-1)*13)","v":9.4683160046874804},{"$f":"OFFSET(Datos!E21,0,($O$2-1)*13)","v":9.9163368323053405},{"$f":"OFFSET(Datos!F21,0,($O$2-1)*13)","v":12.454141046198201},{"$f":"OFFSET(Datos!G21,0,($O$2-1)*13)","v":15.999184345384799},{"$f":"OFFSET(Datos!H21,0,($O$2-1)*13)","v":15.6168207495157},{"$f":"OFFSET(Datos!I21,0,($O$2-1)*13)","v":"-"},{"$f":"OFFSET(Datos!J21,0,($O$2-1)*13)","v":"-"},{"$f":"OFFSET(Datos!K21,0,($O$2-1)*13)","v":"-"},{"$f":"OFFSET(Datos!L21,0,($O$2-1)*13)","v":"-"},{"$f":"OFFSET(Datos!M21,0,($O$2-1)*13)","v":"-"},{"$f":"OFFSET(Datos!N21,0,($O$2-1)*13)","v":"-"},{"$f":"OFFSET(Datos!O21,0,($O$2-1)*13)","v":12.7706814319335}]
[]
[null,"Datos a último día de cada mes."]

{"sheet":"Indisp.Peninsular NP año","index":6,"n_rows":16,"n_cols":10,"rows_kept":16,"cut":false,"hidden":false,"merged":[[15,1,15,9]]}
[null,null,null,null,null,null,null,null,null,1]
[null,null,null,null,null,null,null,null,null,3]
[]
[null,null,null,null,null,null,null,"Concepto"]
[null,null,null,null,null,null,null,"Horizonte temporal"]
[null,null,null,null,null,null,null,"Periodo"]
[]
[null,null,{"$f":"OFFSET(Datos!C51,0,($J$2-1)*8)","v":2017},{"$f":"OFFSET(Datos!D51,0,($J$2-1)*8)","v":2018},{"$f":"OFFSET(Datos!E51,0,($J$2-1)*8)","v":2019},{"$f":"OFFSET(Datos!F51,0,($J$2-1)*8)","v":2020},{"$f":"OFFSET(Datos!G51,0,($J$2-1)*8)","v":2021},{"$f":"OFFSET(Datos!H51,0,($J$2-1)*8)","v":2022},{"$f":"OFFSET(Datos!I51,0,($J$2-1)*8)","v":2023},{"$f":"OFFSET(Datos!J51,0,($J$2-1)*8)","v":2024}]
[]
[null,"Nuclear",{"$f":"OFFSET(Datos!C52,0,($J$2-1)*8)","v":2.1697692400017199},{"$f":"OFFSET(Datos!D52,0,($J$2-1)*8)","v":7.7896252842493503},{"$f":"OFFSET(Datos!E52,0,($J$2-1)*8)","v":1.75809469509456},{"$f":"OFFSET(Datos!F52,0,($J$2-1)*8)","v":9.40280863121842},{"$f":"OFFSET(Datos!G52,0,($J$2-1)*8)","v":"-"},{"$f":"OFFSET(Datos!H52,0,($J$2-1)*8)","v":"-"},{"$f":"OFFSET(Datos!I52,0,($J$2-1)*8)","v":"-"},{"$f":"OFFSET(Datos!J52,0,($J$2-1)*8)","v":"-"}]
[null,"Carbón",{"$f":"OFFSET(Datos!C53,0,($J$2-1)*8)","v":5.8341618858834803},{"$f":"OFFSET(Datos!D53,0,($J$2-1)*8)","v":5.6074477537160998},{"$f":"OFFSET(Datos!E53,0,($J$2-1)*8)","v":9.1333012532734905},{"$f":"OFFSET(Datos!F53,0,($J$2-1)*8)","v":13.518464730957101},{"$f":"OFFSET(Datos!G53,0,($J$2-1)*8)","v":"-"},{"$f":"OFFSET(Datos!H53,0,($J$2-1)*8)","v":"-"},{"$f":"OFFSET(Datos!I53,0,($J$2-1)*8)","v":"-"},{"$f":"OFFSET(Datos!J53,0,($J$2-1)*8)","v":"-"}]
[null,"Fuel + Gas",{"$f":"OFFSET(Datos!C54,0,($J$2-1)*8)","v":"-"},{"$f":"OFFSET(Datos!D54,0,($J$2-1)*8)","v":"-"},{"$f":"OFFSET(Datos!E54,0,($J$2-1)*8)","v":"-"},{"$f":"OFFSET(Datos!F54,0,($J$2-1)*8)","v":"-"},{"$f":"OFFSET(Datos!G54,0,($J$2-1)*8)","v":"-"},{"$f":"OFFSET(Datos!H54,0,($J$2-1)*8)","v":"-"},{"$f":"OFFSET(Datos!I54,0,($J$2-1)*8)","v":"-"},{"$f":"OFFSET(Datos!J54,0,($J$2-1)*8)","v":"-"}]
[null,"Ciclo combinado",{"$f":"OFFSET(Datos!C55,0,($J$2-1)*8)","v":3.09619016104689},{"$f":"OFFSET(Datos!D55,0,($J$2-1)*8)","v":3.5172594383592002},{"$f":"OFFSET(Datos!E55,0,($J$2-1)*8)","v":7.77054241397743},{"$f":"OFFSET(Datos!F55,0,($J$2-1)*8)","v":13.4661253218329},{"$f":"OFFSET(Datos!G55,0,($J$2-1)*8)","v":"-"},{"$f":"OFFSET(Datos!H55,0,($J$2-1)*8)","v":"-"},{"$f":"OFFSET(Datos!I55,0,($J$2-1)*8)","v":"-"},{"$f":"OFFSET(Datos!J55,0,($J$2-1)*8)","v":"-"}]
[null,"Indisponibilidad no prevista",{"$f":"OFFSET(Datos!C56,0,($J$2-1)*8)","v":3.5526603352176398},{"$f":"OFFSET(Datos!D56,0,($J$2-1)*8)","v":4.7314378513196198},{"$f":"OFFSET(Datos!E56,0,($J$2-1)*8)","v":7.0345831301830497},{"$f":"OFFSET(Datos!F56,0,($J$2-1)*8)","v":12.7706814319335},{"$f":"OFFSET(Datos!G56,0,($J$2-1)*8)","v":"-"},{"$f":"OFFSET(Datos!H56,0,($J$2-1)*8)","v":"-"},{"$f":"OFFSET(Datos!I56,0,($J$2-1)*8)","v":"-"},{"$f":"OFFSET(Datos!J56,0,($J$2-1)*8)","v":"-"}]
[]
[null,{"$f":"IF(MONTH(FACT)=1,\"Datos acumulados a 31 de diciembre.\",CONCATENATE(\"Datos acumulados a 31 de diciembre. Para el año \",YEAR(FACT), \" datos acumulados a \",TEXT(FACT-30,\"mmmm\"),\" de \",YEAR(FACT),\".\"))","v":"Datos acumulados a 31 de diciembre. Para el año 2020 datos acumulados a junio de 2020."}]

{"sheet":"Disponibilidad Peninsular mes","index":7,"n_rows":16,"n_cols":15,"rows_kept":16,"cut":false,"hidden":false,"merged":[[15,1,15,13]]}
[null,null,null,null,null,null,null,null,null,null,null,null,null,null,20]
[]
[]
[null,null,null,null,null,null,null,null,null,null,null,"Concepto"]
[null,null,null,null,null,null,null,null,null,null,null,"Horizonte temporal"]
[null,null,null,null,null,null,null,null,null,null,null,"Periodo"]
[]
[null,null,"Ene.","Feb.","Mar.","Abr.","May.","Jun.","Jul.","Ago.","Sep.","Oct.","Nov.","Dic.",{"$f":"OFFSET(Año!B13,($O$1-1),0)","v":2020}]
[]
[null,"Nuclear",{"$f":"OFFSET(Datos!C24,0,($O$1-1)*13)","v":99.945581682629808},{"$f":"OFFSET(Datos!D24,0,($O$1-1)*13)","v":99.862229395229036},{"$f":"OFFSET(Datos!E24,0,($O$1-1)*13)","v":99.890190760366011},{"$f":"OFFSET(Datos!F24,0,($O$1-1)*13)","v":89.501366408137997},{"$f":"OFFSET(Datos!G24,0,($O$1-1)*13)","v":65.472814910297572},{"$f":"OFFSET(Datos!H24,0,($O$1-1)*13)","v":73.744932288446719},{"$f":"OFFSET(Datos!I24,0,($O$1-1)*13)","v":"-"},{"$f":"OFFSET(Datos!J24,0,($O$1-1)*13)","v":"-"},{"$f":"OFFSET(Datos!K24,0,($O$1-1)*13)","v":"-"},{"$f":"OFFSET(Datos!L24,0,($O$1-1)*13)","v":"-"},{"$f":"OFFSET(Datos!M24,0,($O$1-1)*13)","v":"-"},{"$f":"OFFSET(Datos!N24,0,($O$1-1)*13)","v":"-"},{"$f":"OFFSET(Datos!O24,0,($O$1-1)*13)","v":88.008047978179604}]
[null,"Carbón",{"$f":"OFFSET(Datos!C25,0,($O$1-1)*13)","v":85.606803380983393},{"$f":"OFFSET(Datos!D25,0,($O$1-1)*13)","v":86.447675522851398},{"$f":"OFFSET(Datos!E25,0,($O$1-1)*13)","v":86.960083861242097},{"$f":"OFFSET(Datos!F25,0,($O$1-1)*13)","v":88.851655153264801},{"$f":"OFFSET(Datos!G25,0,($O$1-1)*13)","v":89.1629132649864},{"$f":"OFFSET(Datos!H25,0,($O$1-1)*13)","v":81.783443266875793},{"$f":"OFFSET(Datos!I25,0,($O$1-1)*13)","v":"-"},{"$f":"OFFSET(Datos!J25,0,($O$1-1)*13)","v":"-"},{"$f":"OFFSET(Datos!K25,0,($O$1-1)*13)","v":"-"},{"$f":"OFFSET(Datos!L25,0,($O$1-1)*13)","v":"-"},{"$f":"OFFSET(Datos!M25,0,($O$1-1)*13)","v":"-"},{"$f":"OFFSET(Datos!N25,0,($O$1-1)*13)","v":"-"},{"$f":"OFFSET(Datos!O25,0,($O$1-1)*13)","v":86.481535269042894}]
[null,"Fuel + Gas",{"$f":"OFFSET(Datos!C26,0,($O$1-1)*13)","v":"-"},{"$f":"OFFSET(Datos!D26,0,($O$1-1)*13)","v":"-"},{"$f":"OFFSET(Datos!E26,0,($O$1-1)*13)","v":"-"},{"$f":"OFFSET(Datos!F26,0,($O$1-1)*13)","v":"-"},{"$f":"OFFSET(Datos!G26,0,($O$1-1)*13)","v":"-"},{"$f":"OFFSET(Datos!H26,0,($O$1-1)*13)","v":"-"},{"$f":"OFFSET(Datos!I26,0,($O$1-1)*13)","v":"-"},{"$f":"OFFSET(Datos!J26,0,($O$1-1)*13)","v":"-"},{"$f":"OFFSET(Datos!K26,0,($O$1-1)*13)","v":"-"},{"$f":"OFFSET(Datos!L26,0,($O$1-1)*13)","v":"-"},{"$f":"OFFSET(Datos!M26,0,($O$1-1)*13)","v":"-"},{"$f":"OFFSET(Datos!N26,0,($O$1-1)*13)","v":"-"},{"$f":"OFFSET(Datos!O26,0,($O$1-1)*13)","v":"-"}]
[null,"Ciclo combinado",{"$f":"OFFSET(Datos!C27,0,($O$1-1)*13)","v":83.714535603273305},{"$f":"OFFSET(Datos!D27,0,($O$1-1)*13)","v":82.13297364183542},{"$f":"OFFSET(Datos!E27,0,($O$1-1)*13)","v":79.201649210774292},{"$f":"OFFSET(Datos!F27,0,($O$1-1)*13)","v":84.732734421796522},{"$f":"OFFSET(Datos!G27,0,($O$1-1)*13)","v":82.145599406018107},{"$f":"OFFSET(Datos!H27,0,($O$1-1)*13)","v":80.375017830773558},{"$f":"OFFSET(Datos!I27,0,($O$1-1)*13)","v":"-"},{"$f":"OFFSET(Datos!J27,0,($O$1-1)*13)","v":"-"},{"$f":"OFFSET(Datos!K27,0,($O$1-1)*13)","v":"-"},{"$f":"OFFSET(Datos!L27,0,($O$1-1)*13)","v":"-"},{"$f":"OFFSET(Datos!M27,0,($O$1-1)*13)","v":"-"},{"$f":"OFFSET(Datos!N27,0,($O$1-1)*13)","v":"-"},{"$f":"OFFSET(Datos!O27,0,($O$1-1)*13)","v":82.044629513873616}]
[null,"Disponibilidad",{"$f":"OFFSET(Datos!C28,0,($O$1-1)*13)","v":86.966002739640203},{"$f":"OFFSET(Datos!D28,0,($O$1-1)*13)","v":86.191057526668544},{"$f":"OFFSET(Datos!E28,0,($O$1-1)*13)","v":84.55078554110608},{"$f":"OFFSET(Datos!F28,0,($O$1-1)*13)","v":86.490851335932703},{"$f":"OFFSET(Datos!G28,0,($O$1-1)*13)","v":80.824841540591692},{"$f":"OFFSET(Datos!H28,0,($O$1-1)*13)","v":79.538383738030092},{"$f":"OFFSET(Datos!I28,0,($O$1-1)*13)","v":"-"},{"$f":"OFFSET(Datos!J28,0,($O$1-1)*13)","v":"-"},{"$f":"OFFSET(Datos!K28,0,($O$1-1)*13)","v":"-"},{"$f":"OFFSET(Datos!L28,0,($O$1-1)*13)","v":"-"},{"$f":"OFFSET(Datos!M28,0,($O$1-1)*13)","v":"-"},{"$f":"OFFSET(Datos!N28,0,($O$1-1)*13)","v":"-"},{"$f":"OFFSET(Datos!O28,0,($O$1-1)*13)","v":84.082355643084185}]
[]
[null,"Datos a último día de cada mes."]

{"sheet":"Disponibilidad Peninsular año","index":8,"n_rows":16,"n_cols":10,"rows_kept":16,"cut":false,"hidden":false,"merged":[[15,1,15,9]]}
[null,null,null,null,null,null,null,null,null,3]
[]
[]
[null,null,null,null,null,null,null,"Concepto"]
[null,null,null,null,null,null,null,"Horizonte temporal"]
[null,null,null,null,null,null,null,"Periodo"]
[]
[null,null,{"$f":"OFFSET(Datos!C58,0,($J$1-1)*8)","v":2017},{"$f":"OFFSET(Datos!D58,0,($J$1-1)*8)","v":2018},{"$f":"OFFSET(Datos!E58,0,($J$1-1)*8)","v":2019},{"$f":"OFFSET(Datos!F58,0,($J$1-1)*8)","v":2020},{"$f":"OFFSET(Datos!G58,0,($J$1-1)*8)","v":2021},{"$f":"OFFSET(Datos!H58,0,($J$1-1)*8)","v":2022},{"$f":"OFFSET(Datos!I58,0,($J$1-1)*8)","v":2023},{"$f":"OFFSET(Datos!J58,0,($J$1-1)*8)","v":2024}]
[]
[null,"Nuclear",{"$f":"OFFSET(Datos!C59,0,($J$1-1)*8)","v":86.596193783294524},{"$f":"OFFSET(Datos!D59,0,($J$1-1)*8)","v":86.793593085449672},{"$f":"OFFSET(Datos!E59,0,($J$1-1)*8)","v":91.484509910970047},{"$f":"OFFSET(Datos!F59,0,($J$1-1)*8)","v":88.008047978179604},{"$f":"OFFSET(Datos!G59,0,($J$1-1)*8)","v":"-"},{"$f":"OFFSET(Datos!H59,0,($J$1-1)*8)","v":"-"},{"$f":"OFFSET(Datos!I59,0,($J$1-1)*8)","v":"-"},{"$f":"OFFSET(Datos!J59,0,($J$1-1)*8)","v":"-"}]
[null,"Carbón",{"$f":"OFFSET(Datos!C60,0,($J$1-1)*8)","v":88.958613428968661},{"$f":"OFFSET(Datos!D60,0,($J$1-1)*8)","v":91.953515552113274},{"$f":"OFFSET(Datos!E60,0,($J$1-1)*8)","v":89.031586023270947},{"$f":"OFFSET(Datos!F60,0,($J$1-1)*8)","v":86.481535269042894},{"$f":"OFFSET(Datos!G60,0,($J$1-1)*8)","v":"-"},{"$f":"OFFSET(Datos!H60,0,($J$1-1)*8)","v":"-"},{"$f":"OFFSET(Datos!I60,0,($J$1-1)*8)","v":"-"},{"$f":"OFFSET(Datos!J60,0,($J$1-1)*8)","v":"-"}]
[null,"Fuel + Gas",{"$f":"OFFSET(Datos!C61,0,($J$1-1)*8)","v":"-"},{"$f":"OFFSET(Datos!D61,0,($J$1-1)*8)","v":"-"},{"$f":"OFFSET(Datos!E61,0,($J$1-1)*8)","v":"-"},{"$f":"OFFSET(Datos!F61,0,($J$1-1)*8)","v":"-"},{"$f":"OFFSET(Datos!G61,0,($J$1-1)*8)","v":"-"},{"$f":"OFFSET(Datos!H61,0,($J$1-1)*8)","v":"-"},{"$f":"OFFSET(Datos!I61,0,($J$1-1)*8)","v":"-"},{"$f":"OFFSET(Datos!J61,0,($J$1-1)*8)","v":"-"}]
[null,"Ciclo combinado",{"$f":"OFFSET(Datos!C62,0,($J$1-1)*8)","v":92.258962397620692},{"$f":"OFFSET(Datos!D62,0,($J$1-1)*8)","v":93.036424826873628},{"$f":"OFFSET(Datos!E62,0,($J$1-1)*8)","v":87.564051153894098},{"$f":"OFFSET(Datos!F62,0,($J$1-1)*8)","v":82.044629513873616},{"$f":"OFFSET(Datos!G62,0,($J$1-1)*8)","v":"-"},{"$f":"OFFSET(Datos!H62,0,($J$1-1)*8)","v":"-"},{"$f":"OFFSET(Datos!I62,0,($J$1-1)*8)","v":"-"},{"$f":"OFFSET(Datos!J62,0,($J$1-1)*8)","v":"-"}]
[null,"Disponibilidad",{"$f":"OFFSET(Datos!C63,0,($J$1-1)*8)","v":90.498026512419969},{"$f":"OFFSET(Datos!D63,0,($J$1-1)*8)","v":91.71568527009677},{"$f":"OFFSET(Datos!E63,0,($J$1-1)*8)","v":88.577851783043201},{"$f":"OFFSET(Datos!F63,0,($J$1-1)*8)","v":84.082355643084185},{"$f":"OFFSET(Datos!G63,0,($J$1-1)*8)","v":"-"},{"$f":"OFFSET(Datos!H63,0,($J$1-1)*8)","v":"-"},{"$f":"OFFSET(Datos!I63,0,($J$1-1)*8)","v":"-"},{"$f":"OFFSET(Datos!J63,0,($J$1-1)*8)","v":"-"}]
[]
[null,{"$f":"IF(MONTH(FACT)=1,\"Datos acumulados a 31 de diciembre.\",CONCATENATE(\"Datos acumulados a 31 de diciembre. Para el año \",YEAR(FACT), \" datos acumulados a \",TEXT(FACT-30,\"mmmm\"),\" de \",YEAR(FACT),\".\"))","v":"Datos acumulados a 31 de diciembre. Para el año 2020 datos acumulados a junio de 2020."}]

{"sheet":"Horas funcionamiento mes","index":9,"n_rows":16,"n_cols":15,"rows_kept":16,"cut":false,"hidden":false,"merged":[[15,1,15,13]]}
[null,null,null,null,null,null,null,null,null,null,null,null,null,null,20]
[]
[]
[null,null,null,null,null,null,null,null,null,null,null,"Concepto"]
[null,null,null,null,null,null,null,null,null,null,null,"Horizonte temporal"]
[null,null,null,null,null,null,null,null,null,null,null,"Periodo"]
[]
[null,null,"Ene.","Feb.","Mar.","Abr.","May.","Jun.","Jul.","Ago.","Sep.","Oct.","Nov.","Dic.",{"$f":"OFFSET(Año!B13,($O$1-1),0)","v":2020}]
[]
[null,"Nuclear",{"$f":"OFFSET(Datos!C31,0,($O$1-1)*13)","v":743.99999999999989},{"$f":"OFFSET(Datos!D31,0,($O$1-1)*13)","v":696.00000000000011},{"$f":"OFFSET(Datos!E31,0,($O$1-1)*13)","v":743.00000000000023},{"$f":"OFFSET(Datos!F31,0,($O$1-1)*13)","v":654.51312226985283},{"$f":"OFFSET(Datos!G31,0,($O$1-1)*13)","v":487.24245183208791},{"$f":"OFFSET(Datos!H31,0,($O$1-1)*13)","v":541.8011476278192},{"$f":"OFFSET(Datos!I31,0,($O$1-1)*13)","v":"-"},{"$f":"OFFSET(Datos!J31,0,($O$1-1)*13)","v":"-"},{"$f":"OFFSET(Datos!K31,0,($O$1-1)*13)","v":"-"},{"$f":"OFFSET(Datos!L31,0,($O$1-1)*13)","v":"-"},{"$f":"OFFSET(Datos!M31,0,($O$1-1)*13)","v":"-"},{"$f":"OFFSET(Datos!N31,0,($O$1-1)*13)","v":"-"},{"$f":"OFFSET(Datos!O31,0,($O$1-1)*13)","v":3866.5567217297598}]
[null,"Carbón",{"$f":"OFFSET(Datos!C32,0,($O$1-1)*13)","v":154.29578461321421},{"$f":"OFFSET(Datos!D32,0,($O$1-1)*13)","v":153.01847412656466},{"$f":"OFFSET(Datos!E32,0,($O$1-1)*13)","v":108.71938296590902},{"$f":"OFFSET(Datos!F32,0,($O$1-1)*13)","v":83.162011057997503},{"$f":"OFFSET(Datos!G32,0,($O$1-1)*13)","v":66.468130937976454},{"$f":"OFFSET(Datos!H32,0,($O$1-1)*13)","v":86.434940667712056},{"$f":"OFFSET(Datos!I32,0,($O$1-1)*13)","v":"-"},{"$f":"OFFSET(Datos!J32,0,($O$1-1)*13)","v":"-"},{"$f":"OFFSET(Datos!K32,0,($O$1-1)*13)","v":"-"},{"$f":"OFFSET(Datos!L32,0,($O$1-1)*13)","v":"-"},{"$f":"OFFSET(Datos!M32,0,($O$1-1)*13)","v":"-"},{"$f":"OFFSET(Datos!N32,0,($O$1-1)*13)","v":"-"},{"$f":"OFFSET(Datos!O32,0,($O$1-1)*13)","v":652.09872436937405}]
[null,"Fuel + Gas",{"$f":"OFFSET(Datos!C33,0,($O$1-1)*13)","v":"-"},{"$f":"OFFSET(Datos!D33,0,($O$1-1)*13)","v":"-"},{"$f":"OFFSET(Datos!E33,0,($O$1-1)*13)","v":"-"},{"$f":"OFFSET(Datos!F33,0,($O$1-1)*13)","v":"-"},{"$f":"OFFSET(Datos!G33,0,($O$1-1)*13)","v":"-"},{"$f":"OFFSET(Datos!H33,0,($O$1-1)*13)","v":"-"},{"$f":"OFFSET(Datos!I33,0,($O$1-1)*13)","v":"-"},{"$f":"OFFSET(Datos!J33,0,($O$1-1)*13)","v":"-"},{"$f":"OFFSET(Datos!K33,0,($O$1-1)*13)","v":"-"},{"$f":"OFFSET(Datos!L33,0,($O$1-1)*13)","v":"-"},{"$f":"OFFSET(Datos!M33,0,($O$1-1)*13)","v":"-"},{"$f":"OFFSET(Datos!N33,0,($O$1-1)*13)","v":"-"},{"$f":"OFFSET(Datos!O33,0,($O$1-1)*13)","v":"-"}]
[null,"Ciclo combinado",{"$f":"OFFSET(Datos!C34,0,($O$1-1)*13)","v":229.15183866368429},{"$f":"OFFSET(Datos!D34,0,($O$1-1)*13)","v":181.41339947381832},{"$f":"OFFSET(Datos!E34,0,($O$1-1)*13)","v":146.39055918403574},{"$f":"OFFSET(Datos!F34,0,($O$1-1)*13)","v":215.03223290092853},{"$f":"OFFSET(Datos!G34,0,($O$1-1)*13)","v":212.63624253212089},{"$f":"OFFSET(Datos!H34,0,($O$1-1)*13)","v":259.98680148816095},{"$f":"OFFSET(Datos!I34,0,($O$1-1)*13)","v":"-"},{"$f":"OFFSET(Datos!J34,0,($O$1-1)*13)","v":"-"},{"$f":"OFFSET(Datos!K34,0,($O$1-1)*13)","v":"-"},{"$f":"OFFSET(Datos!L34,0,($O$1-1)*13)","v":"-"},{"$f":"OFFSET(Datos!M34,0,($O$1-1)*13)","v":"-"},{"$f":"OFFSET(Datos!N34,0,($O$1-1)*13)","v":"-"},{"$f":"OFFSET(Datos!O34,0,($O$1-1)*13)","v":1244.6110742427488}]
[null,"Horas de funcionamiento",{"$f":"OFFSET(Datos!C35,0,($O$1-1)*13)","v":301.88883778139689},{"$f":"OFFSET(Datos!D35,0,($O$1-1)*13)","v":264.5743711822214},{"$f":"OFFSET(Datos!E35,0,($O$1-1)*13)","v":241.73661399416059},{"$f":"OFFSET(Datos!F35,0,($O$1-1)*13)","v":261.80469088525996},{"$f":"OFFSET(Datos!G35,0,($O$1-1)*13)","v":227.49178612125931},{"$f":"OFFSET(Datos!H35,0,($O$1-1)*13)","v":269.92623917328137},{"$f":"OFFSET(Datos!I35,0,($O$1-1)*13)","v":"-"},{"$f":"OFFSET(Datos!J35,0,($O$1-1)*13)","v":"-"},{"$f":"OFFSET(Datos!K35,0,($O$1-1)*13)","v":"-"},{"$f":"OFFSET(Datos!L35,0,($O$1-1)*13)","v":"-"},{"$f":"OFFSET(Datos!M35,0,($O$1-1)*13)","v":"-"},{"$f":"OFFSET(Datos!N35,0,($O$1-1)*13)","v":"-"},{"$f":"OFFSET(Datos!O35,0,($O$1-1)*13)","v":1567.4225391375799}]
[]
[null,"Datos a último día de cada mes."]

{"sheet":"Horas funcionamiento año","index":10,"n_rows":16,"n_cols":10,"rows_kept":16,"cut":false,"hidden":false,"merged":[[15,1,15,9]]}
[null,null,null,null,null,null,null,null,null,3]
[]
[]
[null,null,null,null,null,null,null,"Concepto"]
[null,null,null,null,null,null,null,"Horizonte temporal"]
[null,null,null,null,null,null,null,"Periodo"]
[]
[null,null,{"$f":"OFFSET(Datos!C58,0,($J$1-1)*8)","v":2017},{"$f":"OFFSET(Datos!D58,0,($J$1-1)*8)","v":2018},{"$f":"OFFSET(Datos!E58,0,($J$1-1)*8)","v":2019},{"$f":"OFFSET(Datos!F58,0,($J$1-1)*8)","v":2020},{"$f":"OFFSET(Datos!G58,0,($J$1-1)*8)","v":2021},{"$f":"OFFSET(Datos!H58,0,($J$1-1)*8)","v":2022},{"$f":"OFFSET(Datos!I58,0,($J$1-1)*8)","v":2023},{"$f":"OFFSET(Datos!J58,0,($J$1-1)*8)","v":2024}]
[]
[null,"Nuclear",{"$f":"OFFSET(Datos!C66,0,($J$1-1)*8)","v":7997.1831975372661},{"$f":"OFFSET(Datos!D66,0,($J$1-1)*8)","v":7621.6579737512457},{"$f":"OFFSET(Datos!E66,0,($J$1-1)*8)","v":8040.4686264013426},{"$f":"OFFSET(Datos!F66,0,($J$1-1)*8)","v":3866.5567217297598},{"$f":"OFFSET(Datos!G66,0,($J$1-1)*8)","v":"-"},{"$f":"OFFSET(Datos!H66,0,($J$1-1)*8)","v":"-"},{"$f":"OFFSET(Datos!I66,0,($J$1-1)*8)","v":"-"},{"$f":"OFFSET(Datos!J66,0,($J$1-1)*8)","v":"-"}]
[null,"Carbón",{"$f":"OFFSET(Datos!C67,0,($J$1-1)*8)","v":5455.7997623709216},{"$f":"OFFSET(Datos!D67,0,($J$1-1)*8)","v":4702.5488423313791},{"$f":"OFFSET(Datos!E67,0,($J$1-1)*8)","v":1672.6178266012262},{"$f":"OFFSET(Datos!F67,0,($J$1-1)*8)","v":652.09872436937405},{"$f":"OFFSET(Datos!G67,0,($J$1-1)*8)","v":"-"},{"$f":"OFFSET(Datos!H67,0,($J$1-1)*8)","v":"-"},{"$f":"OFFSET(Datos!I67,0,($J$1-1)*8)","v":"-"},{"$f":"OFFSET(Datos!J67,0,($J$1-1)*8)","v":"-"}]
[null,"Fuel + Gas",{"$f":"OFFSET(Datos!C68,0,($J$1-1)*8)","v":"-"},{"$f":"OFFSET(Datos!D68,0,($J$1-1)*8)","v":"-"},{"$f":"OFFSET(Datos!E68,0,($J$1-1)*8)","v":"-"},{"$f":"OFFSET(Datos!F68,0,($J$1-1)*8)","v":"-"},{"$f":"OFFSET(Datos!G68,0,($J$1-1)*8)","v":"-"},{"$f":"OFFSET(Datos!H68,0,($J$1-1)*8)","v":"-"},{"$f":"OFFSET(Datos!I68,0,($J$1-1)*8)","v":"-"},{"$f":"OFFSET(Datos!J68,0,($J$1-1)*8)","v":"-"}]
[null,"Ciclo combinado",{"$f":"OFFSET(Datos!C69,0,($J$1-1)*8)","v":2358.2104229205811},{"$f":"OFFSET(Datos!D69,0,($J$1-1)*8)","v":1920.068765150522},{"$f":"OFFSET(Datos!E69,0,($J$1-1)*8)","v":3311.7025701636594},{"$f":"OFFSET(Datos!F69,0,($J$1-1)*8)","v":1244.6110742427488},{"$f":"OFFSET(Datos!G69,0,($J$1-1)*8)","v":"-"},{"$f":"OFFSET(Datos!H69,0,($J$1-1)*8)","v":"-"},{"$f":"OFFSET(Datos!I69,0,($J$1-1)*8)","v":"-"},{"$f":"OFFSET(Datos!J69,0,($J$1-1)*8)","v":"-"}]
[null,"Horas de funcionamiento",{"$f":"OFFSET(Datos!C70,0,($J$1-1)*8)","v":4032.9930366840886},{"$f":"OFFSET(Datos!D70,0,($J$1-1)*8)","v":3549.1652254647311},{"$f":"OFFSET(Datos!E70,0,($J$1-1)*8)","v":3747.7548943964553},{"$f":"OFFSET(Datos!F70,0,($J$1-1)*8)","v":1567.4225391375799},{"$f":"OFFSET(Datos!G70,0,($J$1-1)*8)","v":"-"},{"$f":"OFFSET(Datos!H70,0,($J$1-1)*8)","v":"-"},{"$f":"OFFSET(Datos!I70,0,($J$1-1)*8)","v":"-"},{"$f":"OFFSET(Datos!J70,0,($J$1-1)*8)","v":"-"}]
[]
[null,{"$f":"IF(MONTH(FACT)=1,\"Datos acumulados a 31 de diciembre.\",CONCATENATE(\"Datos acumulados a 31 de diciembre. Para el año \",YEAR(FACT), \" datos acumulados a \",TEXT(FACT-30,\"mmmm\"),\" de \",YEAR(FACT),\".\"))","v":"Datos acumulados a 31 de diciembre. Para el año 2020 datos acumulados a junio de 2020."}]

{"sheet":"Datos","index":11,"n_rows":70,"n_cols":262,"rows_kept":70,"cut":false,"hidden":true,"merged":[]}
[]
[null,"Indisponibilidad equipo térmico mensual peninsular (%)\nTipo permanente","2001-01-01","2001-02-01","2001-03-01","2001-04-01","2001-05-01","2001-06-01","2001-07-01","2001-08-01","2001-09-01","2001-10-01","2001-11-01","2001-12-01","2001","2002-01-01","2002-02-01","2002-03-01","2002-04-01","2002-05-01","2002-06-01","2002-07-01","2002-08-01","2002-09-01","2002-10-01","2002-11-01","2002-12-01","2002","2003-01-01","2003-02-01","2003-03-01","2003-04-01","2003-05-01","2003-06-01","2003-07-01","2003-08-01","2003-09-01","2003-10-01","2003-11-01","2003-12-01","2003","2004-01-01","2004-02-01","2004-03-01","2004-04-01","2004-05-01","2004-06-01","2004-07-01","2004-08-01","2004-09-01","2004-10-01","2004-11-01","2004-12-01","2004","2005-01-01","2005-02-01","2005-03-01","2005-04-01","2005-05-01","2005-06-01","2005-07-01","2005-08-01","2005-09-01","2005-10-01","2005-11-01","2005-12-01","2005","2006-01-01","2006-02-01","2006-03-01","2006-04-01","2006-05-01","2006-06-01","2006-07-01","2006-08-01","2006-09-01","2006-10-01","2006-11-01","2006-12-01","2006","2007-01-01","2007-02-01","2007-03-01","2007-04-01","2007-05-01","2007-06-01","2007-07-01","2007-08-01","2007-09-01","2007-10-01","2007-11-01","2007-12-01","2007","2008-01-01","2008-02-01","2008-03-01","2008-04-01","2008-05-01","2008-06-01","2008-07-01","2008-08-01","2008-09-01","2008-10-01","2008-11-01","2008-12-01","2008","2009-01-01","2009-02-01","2009-03-01","2009-04-01","2009-05-01","2009-06-01","2009-07-01","2009-08-01","2009-09-01","2009-10-01","2009-11-01","2009-12-01","2009","2010-01-31","2010-02-28","2010-03-31","2010-04-30","2010-05-31","2010-06-30","2010-07-31","2010-08-31","2010-09-30","2010-10-31","2010-11-30","2010-12-31","2010","2011-01-31","2011-02-28","2011-03-31","2011-04-30","2011-05-31","2011-06-30","2011-07-31","2011-08-31","2011-09-30","2011-10-31","2011-11-30","2011-12-31","2011","2012-01-31","2012-02-29","2012-03-31","2012-04-30","2012-05-31","2012-06-30","2012-07-31","2012-08-31","2012-09-30","2012-10-31","2012-11-30","2012-12-31","2012","2013-01-31","2013-02-28","2013-03-31","2013-04-30","2013-05-31","2013-06-30","2013-07-31","2013-08-31","2013-09-30","2013-10-31","2013-11-30","2013-12-31","2013","2014-01-31","2014-02-28","2014-03-31","2014-04-30","2014-05-31","2014-06-30","2014-07-31","2014-08-31","2014-09-30","2014-10-31","2014-11-30","2014-12-31","2014","2015-01-31","2015-02-28","2015-03-31","2015-04-30","2015-05-31","2015-06-30","2015-07-31","2015-08-31","2015-09-30","2015-10-31","2015-11-30","2015-12-31","2015","2016-01-31","2016-02-29","2016-03-31","2016-04-30","2016-05-31","2016-06-30","2016-07-31","2016-08-31","2016-09-30","2016-10-31","2016-11-30","2016-12-31","2016","2017-01-31","2017-02-28","2017-03-31","2017-04-30","2017-05-31","2017-06-30","2017-07-31","2017-08-31","2017-09-30","2017-10-31","2017-11-30","2017-12-31","2017","2018-01-31","2018-02-28","2018-03-31","2018-04-30","2018-05-31","2018-06-30","2018-07-31","2018-08-31","2018-09-30","2018-10-31","2018-11-30","2018-12-31","2018","2019-01-31","2019-02-28","2019-03-31","2019-04-30","2019-05-31","2019-06-30","2019-07-31","2019-08-31","2019-09-30","2019-10-31","2019-11-30","2019-12-31","2019","2020-01-31","2020-02-28","2020-03-27","2020-04-24","2020-05-22","2020-06-19","2020-07-17","2020-08-14","2020-09-11","2020-10-09","2020-11-06","2020-12-04","2020"]
[null,"Nuclear",0,0,0,0,0,0,0,0,0,0,0,0,0,0,0,0,0,0,0,0,0,0,0,0,0,0,0,0,0,0,0,0,0,0,0,0,0,0,0,0,0,0,0,0,0,0,0,0,0,0,0,0,0,0,0,0,0,0,0,0,0,0,0,0,0,0,0,0,0,0,0,0,0,0,0,0,0,0,0,0,0,0,0,0,0,0,0,0,0,0,0,0,0,0,0,0,0,0,0,0,0,0,0,0,0,0,0,0,0,0,0,0,0,0,0,0,0,0,0,0,0,0,0,0,0,0,0,0,0,0,0,0,0,0,0,0,0,0,0,0,0,0,0,0,0,0,0,0,0,0,0,0,0,0,2.9167752954561101,0.248254817304184,6.01130421002589,6.01130421002589,6.01130421002589,6.01130421002589,6.01130421002589,6.01130421002589,6.01130421002589,6.01130421002589,6.01130421002589,6.01130421002589,6.01130421002589,6.01130421002589,6.01130421002589,6.01130421002589,6.01130421002589,6.01130421002589,6.01130421002589,6.01130421002589,6.01130421002589,6.01130421002589,6.0113042100258998,6.01130421002589,6.01130421002589,6.01130421002589,6.01130421002589,6.01130421002589,6.01130421002589,6.01130421002589,6.01130421002589,6.01130421002589,6.01130421002589,6.01130421002589,6.01130421002589,6.0113042100258998,6.01130421002589,6.01130421002589,6.01130421002589,6.01130421002589,6.01130421002589,6.01130421002589,6.01130421002589,6.01130421002589,6.01130421002589,6.01130421002589,6.01130421002589,6.01130421002589,6.01130421002589,6.01130421002589,6.01130421002589,6.01130421002589,6.01130421002589,6.01130421002589,6.01130421002589,6.01130421002589,6.01130421002589,6.01130421002589,6.0113042100258998,6.0113042100258998,6.01130421002589,6.01130421002589,6.01130421002589,6.01130421002589,0,0,5.0574842366605397,0,0,0,0,0,0,0,0,0,0,0,0,0,0,0,0,0,0,0,0,0,0,0,0,0,0,0,0,0,0,0,0,"-","-","-","-","-","-",0]
[null,"Carbón",0,0,0,0,0,0,0,0,0,0,0,0,0,0,0,0.76197455217479348,1.2017981792305781,1.2017981792305781,1.2017981792305781,1.2017981792305781,1.2017981792305781,1.2017981792305781,1.2020322952965294,1.2026023229213292,1.2031488124990466,0.97044966997218762,1.2034913918694654,1.2034913918694654,1.2034913918694652,1.2034913918694654,1.2034913918694659,1.2044952123579398,1.2044952123579393,1.2044952123579398,1.2044952123579395,1.2044952123579398,1.2032692735691499,1.2032692735691499,1.2038749294335811,1.2032692735691499,1.2032692735691499,1.2041878607103584,1.2050714480519069,1.2050714480519069,1.2050714480519069,1.2050714480519069,1.2050714480519069,1.2050714480519069,1.2050714480519069,1.2050714480519069,1.2050714480519069,1.2047008874924376,1.2050714480519069,1.2050714480519067,1.2043872295109281,1.2043872295109281,0.15705225435521841,0,0,0,0,0,0,0,0.4123416590261158,0,0,0,0,0,0,0,0,0,0,0,0,0,0.61331160806642082,0.61331160806642071,0.61340425629311568,0.61340425629311568,0.61340425629311568,0.61340425629311568,0.61340425629311568,0.61340425629311568,0.61340425629311568,0.61340425629311579,0.61340425629311568,0.61694347480692491,0.61368827006285709,0.61707643919264299,0.61707643919264299,0.61714748903872363,0.61714748903872363,0.61714748903872374,0.61714748903872363,0.61714748903872374,0.61714748903872374,0.61714748903872363,0.61714748903872374,0.61714748903872363,0.61713366405016967,0.61713466945488205,0.61714748903872374,0.61714748903872374,0.61714748903872363,0.61714748903872363,0.61714748903872374,0.61714748903872363,0.61714748903872374,0.61714748903872374,0.61714748903872363,0.61714748903872374,0.61714748903872363,0.61714748903872374,0.61714748903872363,0.61714748903872374,0.61714748903872374,0.61714748903872363,0.61714748903872363,0.61714748903872374,0.61714748903872363,0.61714748903872374,0.61615144450728565,0.61615144450728576,0.61615144450728587,0.61615144450728576,0.61530948128786456,0.61665788722278814,0,0,0,0,0,0,0,0,0,0,0,0,0,1.3123052258029699,1.3123052258029699,1.3123052258029699,1.3123052258029699,1.3123052258029699,1.3123052258029699,1.3123052258029699,1.3123052258029699,1.3123052258029699,1.31231056379933,1.3123879696268199,3.0419118870521298,1.45857150375199,2.8586868621735899,2.68161418275945,2.6816141827594602,2.6816141827594602,2.6816141827594602,2.6816141827594602,4.16731494369151,4.5959136032693602,4.5942704120059101,4.5942704120059101,4.5942704120059101,4.5942704120059101,3.6244672119303298,4.5942704120059101,4.5942704120059199,4.5942952165591597,4.5943131311252898,4.5943131311252898,4.5943131311252898,4.5943131311252898,4.5943131311252898,4.5943131311252898,4.5943131311252898,4.4648851073972802,3.2840351026025401,4.4737530259031404,3.0743432255296401,1.96912082242562,1.96912082242562,1.96912082242562,1.96912082242562,1.96912082242562,1.96912082242562,1.96912082242562,1.96912082242562,1.96912082242562,1.96912082242562,1.96912082242562,2.0639675306186498,1.96912082242562,0,0,0,0,0,0,0,0,0,0,0,0.180319696838766,0,0,0,0,0,0,0,0,0,0,0,0,0,0,0,0,0,0,0,0,0,0,0,0,0,0,0,0,0,0,0,0,0,0,0,0,0,0,0,0,0,0,0,0,0,"-","-","-","-","-","-",0]
[null,"Fuel + Gas",3.9621231661884644,3.9621231661884644,3.9621231661884644,3.9621231661884639,3.9621231661884644,3.9621231661884639,3.9621231661884644,3.9621231661884644,3.9621231661884639,3.9621231661884639,3.9621231661884639,10.86719585233933,4.5485813943273046,7.082704395960997,7.0786388378481568,7.0786388378481835,7.0786388378481755,7.0786388378481835,7.0786388378481755,7.2079720754627026,7.3518141333241989,7.3559110492950763,7.3641185949527994,7.3641185949527923,7.3704327501154552,7.2059786926034768,7.3739101529768512,7.4331069242099952,7.7558960052498929,7.9379160733855354,7.9510155316607696,7.9742977180987591,7.9742977180987662,7.9996634251301995,7.9996634251301906,7.9996634251301977,7.9996634251301906,7.9996634251301995,7.8627663261707257,7.972781128888383,7.9727811288883679,7.9727811288883856,7.9727811288883652,7.972781128888383,7.9727811288883652,7.972781128888383,7.972781128888383,7.9727811288883652,7.972781128888383,7.9892915881343747,7.9892915881343907,7.9755281315633306,7.9892915881343907,7.989291588134356,8.3455906776357232,8.3580327539436006,8.3580327539436183,9.7369093070767025,10.791344318296138,10.791344318296138,10.791344318296121,10.791344318296138,10.791344318296142,10.802391001371472,9.626202476451013,10.791344318296138,10.791344318296108,10.79134431829614,10.791344318296121,10.791344318296138,10.791344318296121,10.791344318296138,10.791344318296138,10.791344318296121,10.791344318296138,10.791344318296121,10.791344318296138,10.791344318296133,15.893449211293287,15.893449211293262,15.88467138625316,15.884671386253165,15.88467138625316,15.884671386253165,16.014451603106295,16.548983052536826,17.897497756330988,18.121318324118381,18.121318324118391,13.904876258251541,16.318838591625205,8.4932859588602163,3.6931229285750025,3.6931229285750025,3.6931229285750029,7.1241532622188757,7.1241532622188766,7.152188840625481,11.699610293866334,13.931851511606489,13.931851511606455,13.931851511606489,8.8432526540232033,8.6191733875491785,7.4486740553245649,7.8041021505823345,7.1531271605912927,7.1531271605912936,7.1531271605912936,7.1531271605912936,7.1555642066026435,7.6333055227035453,7.7099809442276994,5.7197192543565061,9.0347913478976984,24.294387811681162,8.4876646658826367,16.741872647418322,0,0,0,0,0,0.1406968668144247,0,0,0.5939161891633703,9.8169414151398424,20.794576625217388,4.2454325358351124,24.007113218731501,24.007113218731501,32.267523053447498,56.140539957967199,56.140539957967199,47.744855702866701,35.373987613149097,35.373987613149097,35.373987613149097,35.373987613149097,35.373987613149097,35.373987613149097,38.0690254739661,35.373987613149097,14.5205449686013,0,0,0,0,0,0,0,0,0,0,5.6444669969725103,0,0,0,0,0,0,0,0,0,0,0,0,0,0,0,0,0,0,0,0,0,0,0,0,0,0,"-","-","-","-","-","-","-","-","-","-","-","-","-","-","-","-","-","-","-","-","-","-","-","-","-","-","-","-","-","-","-","-","-","-","-","-","-","-","-","-","-","-","-","-","-","-","-","-","-","-","-","-","-","-","-","-","-","-","-","-","-","-","-","-","-","-","-","-","-","-","-","-","-","-","-","-","-","-"]
[null,"Ciclo combinado","-","-","-","-","-","-","-","-","-","-","-","-","-","-","-",0,0,0,0,0,0,0,0,0,0,0,0,0,0,0,0,0,0,0,0,0,0,0,0,0,0,0,0,0,0,0,0,0,0,0,0,0,0,0,0,0,0,0,0,0,0,0,0,0,0,0,0,0,0,0,0,0,0,0,0,0,0,0,0,0,0,0,0,0,0,0,0,0,0,0,0,0,0,0,0,0,0,0,0,0,0,0,0,0,0,0,0,0,0,0,0,0,0,0,0,0,0,0,0,0,0,0,0,0,0,0,0,0,0,0,0,0,0,0,0,0,0,0,0,0,0,0,0,0,0,0,0,0,0,0,0,0,0,0,0,0,0,0,0,0,0,0,0,0,0,0,0,0,0,0,0,0,0,0,0,0,0,0,0,0,0,0,0,0,0,0,0,0,0,0,0,0,0,0,0,0,0,0,0,0,0,0,0,0,0,0,0,0,0,0,0,0,0,0,0,0,0,0,0,0,0,0,0,0,0,1.54657772575305,0,0,0,0,0,0,0,0.13208654926153901,0,0,0,0,0,0,0,0,0,0,0,0,0,0,0,0,0,0,0,"-","-","-","-","-","-",0]
[null,"Indisponibilidad permanente",1.1353557397185536,1.1353557397185541,1.135139067867984,1.1351390678679842,1.1345983978556851,1.1340932011493159,1.1340932011493159,1.1340932011493159,1.1341064370308331,1.1341924777919021,1.1341924777919021,3.1108300457685329,1.3024711057541853,2.0273532848749087,2.025854927304501,2.3134718876864153,2.4900019473955886,2.3897617349368696,2.3751864054905734,2.3468889454048991,2.3487145782320864,2.3397724703135521,2.3214585420520946,2.3239123032192319,2.3270709699229801,2.3061077844546243,2.3279188723083282,2.3349538348075169,2.3319642499863331,2.3448997197679367,2.3469144459038875,2.3489823900454709,2.3163471432162313,2.2657652053711139,2.2610634609902145,2.2610634609902163,2.2609904728508003,2.2597342791570085,2.3041931008141519,2.2291920301192363,2.2315802689012383,2.2248387771065152,2.1935547817835093,2.1663548231347596,2.1559906195291347,2.0880292286436113,2.0393920809431023,2.0393920809430988,2.0385848622834772,1.9950325069769299,1.9950325069769337,2.1122146490656402,1.9500946912526074,1.94160448800015,1.9399011603038891,1.9201845039321486,1.5912210001271163,1.7955949588625897,1.9888739946768819,1.9888632283153456,1.9472607898899046,1.8976924673173043,1.8742125798762728,1.8663206850604332,1.8912860340650088,1.854851026374313,1.8274455138829544,1.8087455838053705,1.7968676889521351,1.8033385110888256,1.7845888576232691,1.7162054333356542,1.7162054333356542,1.7162054333356509,1.716205433335654,1.7174620232019318,1.7161523036486326,1.7626655021621247,2.6900854128287062,2.6900854128287013,2.6697273130156343,2.6302118107573422,2.6007250698443776,2.5760115113078506,2.5727750797746358,2.5072088229198348,2.5085502737660517,2.4671719210761842,2.4612799887265764,1.7185645848906326,2.500400735949706,1.0177977760936672,0.51260938264512446,0.51216779170551185,0.50964694322793236,0.83525449474177638,0.83413587257460853,0.83441019388917437,1.2678232167699734,1.4805719816544511,1.4805719816544483,1.4805719816544511,0.99540573531136967,0.98286789295277677,0.86187719130691987,0.895719627979223,0.83373463456682018,0.83356317053723161,0.83063097630971061,0.82365871903515819,0.82388796684024246,0.82856165508673996,0.82929298467983181,0.64462180626460241,0.91719592676875283,1.8882621866106457,0.91758392902724784,1.1991426561963587,0.15443801849107139,0.15443801849107142,0.15279964992003789,0.15010012263548586,0.14897356104695655,0.15544212875603514,0.14762967338807678,0.14762967338807675,0.17573490295964067,0.61190327412436263,1.1305502166635175,0.3636880139089036,0.98394685767891699,0.98327734837672698,1.3205638595679401,2.29704105481325,2.29704105481325,1.6505070928636401,0.99535945770225298,0.99405310009176795,0.99393968240038999,0.99409431461262199,0.99393155147026102,0.99393155147026202,1.2935513970202901,1.3189951363169901,0.63789769839991195,0.32832692979392297,0.32832692979392297,0.32832692979392297,0.32832692979392297,0.32825520226754701,0.327956674604855,0.327956674604855,0.32785114612890498,0.32821421282427798,1.25677347450236,0.51596453162614297,1.7343323682227201,1.69603308086052,1.6985332096152701,1.6985332096152701,1.6985332096152701,1.6985332096152701,2.06319972008616,2.1690127827314498,2.16882223791018,2.16882223791018,2.1683734070118899,2.16807428960339,1.92929826968843,2.1680742896033798,2.16807428960339,2.1680771647250401,2.1680792412065202,2.16807924120653,2.16807924120653,2.1680792412065202,2.16807924120653,2.16807924120653,2.16807924120653,2.13583882851847,1.8417590678444,2.1378015116893501,1.79009823826213,1.5205829399469799,1.5205829399469799,1.5205829399469799,1.5280310586774799,1.5384651175775399,1.5384651175775399,1.5384651175775399,1.5384651175775399,1.5384651175775399,1.5384651175775399,1.5384651175775399,1.55476874365686,1.5384651175775399,1.0649125715394401,1.0806650355785601,1.0811247307282199,1.08176870317542,1.0824564532429699,1.0824564532429699,1.0824564532429699,1.0824564532429699,1.0824564532429699,1.0824564532429699,1.0824564532429699,1.1200739726234299,1.0824564532429699,1.0824564532429699,1.0824564532429699,1.0824564532429699,1.0824564532429699,1.0824564532429699,1.0824564532429699,1.0824564532429699,1.0824564532429699,1.0824564532429699,0,0,0.90318666995035402,0,0,0,0,0.92746404213735101,0,0,0,0,0,0,0,7.9030279903824899E-2,0,0,0,0,0,0,0,0,0,0,0,0,0,0,0,0,0,0,0,"-","-","-","-","-","-",0]
[]
[null,"Indisponibilidad equipo térmico mensual peninsular (%)\nTipo prevista","2001-01-01","2001-02-01","2001-03-01","2001-04-01","2001-05-01","2001-06-01","2001-07-01","2001-08-01","2001-09-01","2001-10-01","2001-11-01","2001-12-01","2001","2002-01-01","2002-02-01","2002-03-01","2002-04-01","2002-05-01","2002-06-01","2002-07-01","2002-08-01","2002-09-01","2002-10-01","2002-11-01","2002-12-01","2002","2003-01-01","2003-02-01","2003-03-01","2003-04-01","2003-05-01","2003-06-01","2003-07-01","2003-08-01","2003-09-01","2003-10-01","2003-11-01","2003-12-01","2003","2004-01-01","2004-02-01","2004-03-01","2004-04-01","2004-05-01","2004-06-01","2004-07-01","2004-08-01","2004-09-01","2004-10-01","2004-11-01","2004-12-01","2004","2005-01-01","2005-02-01","2005-03-01","2005-04-01","2005-05-01","2005-06-01","2005-07-01","2005-08-01","2005-09-01","2005-10-01","2005-11-01","2005-12-01","2005","2006-01-01","2006-02-01","2006-03-01","2006-04-01","2006-05-01","2006-06-01","2006-07-01","2006-08-01","2006-09-01","2006-10-01","2006-11-01","2006-12-01","2006","2007-01-01","2007-02-01","2007-03-01","2007-04-01","2007-05-01","2007-06-01","2007-07-01","2007-08-01","2007-09-01","2007-10-01","2007-11-01","2007-12-01","2007","2008-01-01","2008-02-01","2008-03-01","2008-04-01","2008-05-01","2008-06-01","2008-07-01","2008-08-01","2008-09-01","2008-10-01","2008-11-01","2008-12-01","2008","2009-01-01","2009-02-01","2009-03-01","2009-04-01","2009-05-01","2009-06-01","2009-07-01","2009-08-01","2009-09-01","2009-10-01","2009-11-01","2009-12-01","2009","2010-01-31","2010-02-28","2010-03-31","2010-04-30","2010-05-31","2010-06-30","2010-07-31","2010-08-31","2010-09-30","2010-10-31","2010-11-30","2010-12-31","2010","2011-01-31","2011-02-28","2011-03-31","2011-04-30","2011-05-31","2011-06-30","2011-07-31","2011-08-31","2011-09-30","2011-10-31","2011-11-30","2011-12-31","2011","2012-01-31","2012-02-29","2012-03-31","2012-04-30","2012-05-31","2012-06-30","2012-07-31","2012-08-31","2012-09-30","2012-10-31","2012-11-30","2012-12-31","2012","2013-01-31","2013-02-28","2013-03-31","2013-04-30","2013-05-31","2013-06-30","2013-07-31","2013-08-31","2013-09-30","2013-10-31","2013-11-30","2013-12-31","2013","2014-01-31","2014-02-28","2014-03-31","2014-04-30","2014-05-31","2014-06-30","2014-07-31","2014-08-31","2014-09-30","2014-10-31","2014-11-30","2014-12-31","2014","2015-01-31","2015-02-28","2015-03-31","2015-04-30","2015-05-31","2015-06-30","2015-07-31","2015-08-31","2015-09-30","2015-10-31","2015-11-30","2015-12-31","2015","2016-01-31","2016-02-29","2016-03-31","2016-04-30","2016-05-31","2016-06-30","2016-07-31","2016-08-31","2016-09-30","2016-10-31","2016-11-30","2016-12-31","2016","2017-01-31","2017-02-28","2017-03-31","2017-04-30","2017-05-31","2017-06-30","2017-07-31","2017-08-31","2017-09-30","2017-10-31","2017-11-30","2017-12-31","2017","2018-01-31","2018-02-28","2018-03-31","2018-04-30","2018-05-31","2018-06-30","2018-07-31","2018-08-31","2018-09-30","2018-10-31","2018-11-30","2018-12-31","2018","2019-01-31","2019-02-28","2019-03-31","2019-04-30","2019-05-31","2019-06-30","2019-07-31","2019-08-31","2019-09-30","2019-10-31","2019-11-30","2019-12-31","2019","2020-01-31","2020-02-28","2020-03-27","2020-04-24","2020-05-22","2020-06-19","2020-07-17","2020-08-14","2020-09-11","2020-10-09","2020-11-06","2020-12-04","2020"]
[null,"Nuclear",0,2.2794204801371296,14.251016592457669,13.897516714491228,0,0,0.25490834829033221,1.9755396992500747,10.411395070874413,9.8454668787004831,0.85853692848825491,0,4.4782331224372633,0,2.3392614996896199,17.13300722421133,17.401331022279219,12.549620248517938,3.6942851111987194,0,0.61868380366299391,11.771232117731383,1.4513808439233211,0,0,5.5758488333101184,0,0,14.402869653116007,9.4674943461749752,2.2791691546696953,7.8957948340458746,0,0,18.782436431395073,15.20537462015831,0.99251846306729308,1.8609696742055173,5.9159421281085631,0.70849416696064493,0,8.0035727398305383,4.7810490740801672,7.3906624452928851,2.4792503368766683,0,0,11.81004327977708,12.9702054533441,0,0,4.0263634299632729,0,2.023701637453184,13.19860431596274,14.388215377862338,15.339890709895265,8.3997654911192452,0,0,0,13.057304719583851,1.5233522172847827,0,5.6866657177374602,0,0,5.6735613162282439,18.160166582035995,5.2006944527973813,0,0,1.8090974770228387,12.611639378753287,12.253765122833723,1.6882209924199951,0,4.7942137796150233,0,2.3975331228422205,7.8625129082292089,10.669115540902848,29.108745482599787,37.930631971102336,27.002363272863079,14.016347487385289,3.9420977308271121,9.2436868734378503,23.545079285880139,0,13.84668369582505,0,0,0,7.2276961237981041,10.964076354501834,0,0,0,0,3.0361476385121287,13.305470533479625,8.6050388508413196,3.5980455028127052,0,8.7638897245259191,27.839428292820443,20.697898481803229,30.735368676883624,32.059283859277961,20.345948507586741,0,11.864908937705422,9.4247322995104206,11.835132582277675,12.661657443149965,15.533039838184715,6.9264712088199403,0,0,0,11.880207190513413,11.131627685671766,0,0,0,0,4.098859330205225,12.72059792132656,3.9249746357337036,11.4499469750006,13.968689715867001,19.455441547839399,15.8481404908275,30.237773435085501,9.7690615537695393,8.6208080655462993,0,2.7920045005085998,14.1566425377901,13.764468824663499,13.1959229295295,12.786065257812201,5.2145179318302004,0,0,1.50873106430227,18.647562445486798,27.8842551318217,5.4948738981737204,0,0,2.13893012882329,22.211944027721099,17.958304028409898,8.4166886176431106,4.2201331533361497,0,0,10.913536879544999,15.6862786716105,9.8644492572441607,0,0,4.1888940795227203,14.0248762460919,16.590762359210999,19.5474696272485,7.9593291390580099,10.678027942306599,0,0,0,15.987193286967999,22.503966964825501,13.3554126672813,8.1853709822258001,0,7.2468668449427398E-2,13.096244255454099,6.5703717710270002,7.5844481123349103,0,0,0,3.2267255647703101,26.567426226852199,16.043262373884101,4.2668075006972197,0,1.85378076230052,14.4733434985903,19.5117832890204,3.8178546538277498,7.5138575450886602,12.0626519738064,7.3491311004209603,0,1.0039926978970399,24.459120927556398,2.9812144909290499,0,0,0,1.3526143511636599,24.4300353916856,9.9275768488336205,6.9603806704946001,0,0,0,0.17620013690067499,19.1844328519303,10.454039230186799,12.278056473338699,0,3.72707500630947,13.944130414975801,13.9338503906031,0,6.1765527400432196,0,0,0,10.363438805522801,10.9984179624826,11.748534067704499,0,0,0,1.37324194681794,24.0032597088743,6.7770852256143002,5.4167816303009797,2.0091793377726799E-3,0,0,1.85784671874708,22.888501518961601,3.7595309016654599,0,0,0,11.85567282511,28.941002469760299,11.357169047994599,6.7573953939353997,0,0,0,0,6.3100997492671196,9.1834374629223898,"-","-","-","-","-","-",2.5891433906019801]
[null,"Carbón",0,1.1596418392439993,2.5749279267769722,7.5787632927428943,11.675860514236943,7.3357700668597881,0,0,0.57236288153256121,1.7718903761055005,0,0,2.7226692200686196,0,0,0,4.9233816010421609,5.1214232905520456,3.4805711804378983,4.5876887262718986,3.3436033687076296,1.8267173356291657,7.055946355056288,0.98282222734609181,0,2.6307514813683452,0,2.9492648878090066,7.550711820805331,6.4615112661339387,7.6545735290234287,4.1299966048731447,0,1.1881353452970509,1.7301788841423522,3.0956181365352649,1.5052256516904374,0,3.0177077144102782,0,0,3.9433225566527899,12.89148588329774,13.199641126299841,1.6658640407585972,0,0,0.2281279783864345,1.7636135812312321,3.8516982899764329,1.1227945592266313,3.2231194239932552,0,1.687563174026167,4.9156120400004717,13.357426611866543,10.982858002286665,4.0548218732648378,2.6522080622630826,0,0,6.082736885138218E-2,0.9494238224453555,0,3.2271609695247601,0,3.8719109386108639,0.45057723746222766,4.8772847044017995,8.0911362741778632,1.1237943544819042,2.5859780489367743E-2,3.2066127806815512,6.54468580239564,12.21386240690223,6.8586647301072556,1.646281532207456,4.0708668934638972,0,0,0,0,0,1.3552114184744546,0.36040945595492135,1.3000508118451108,2.3753901805473538,8.3614715561759141,11.428786868469547,5.9221511894563994,2.5993979442983406,10.574400703750376,17.337661866777442,17.474692130419264,14.752806673517041,17.14961911867654,18.039810661265513,16.576651753507075,15.042006216639269,7.755793817471722,9.8866001534615791,12.850868305024379,10.269951348585957,13.963511314587704,9.3750243484873064,8.1979293320069271,8.87724530928981,15.363846227587889,15.276492672871655,3.6928089524254379,1.2514470429810269,1.2465765201478698,1.8064116813840352,3.2434324453778167,2.421312415820251,0,5.8773025367777523,0,0,0.65814519391108584,5.0937695737076742,5.0937695737076751,0.36010121014127866,0,0,1.7550449315412702,5.7085386412839068,5.2602780038532453,1.2303746346143321,2.1037528236366398,0,0.81440061658659402,2.6696449480302098,2.4611333906772699,5.7990733401786096,1.3060003963035801E-3,0,0.47178931400162399,3.70964158545448,3.9233520366533798,2.8260404594919901,0,1.8947362930004501,0,0,0.25887501427708898,4.4184062742060499,7.8675247094113097,3.6955167032947398,0,1.6412073099607301,3.06797006506986,9.2927568276591597,2.6831715367039299,0,2.7523242413683602,0,0,2.5389348112755701,8.6305507447893994,13.832499634061399,6.3992242768849597,0,0,3.97232140366537,5.9902063733271396,0,0,3.4561341005456101,0,0,0,0.32739478920647902,4.1287959000889698,1.30039984182479,0.26962143630862401,1.2021238498794899,0.95764835512246005,5.2889994816639803,7.0155401878144996,0,1.7159719522015999,0.42092160971756798,0,3.20504265584258,13.411087278687599,10.660804111347399,2.89267182168888,0,0,0,0.87000297655039904,0.95007538529969404,0,2.70293422725213,0.69731284501709301,0.116723921627068,8.2462774885985795,17.498969253637899,12.7091163286432,4.1625978589316404,0,0.57041224972147497,5.8942599137885798,9.53604506267218,4.7035739631730999,6.6321264456674296,5.8381696132949603,5.8470638824504197,5.84706388245041,7.3522520369424402,15.124929642953299,5.4356905580082104,0,0,0,0.12145112064354401,13.4260327677717,8.2866646156786299,1.1865344901492201,5.2072246851478701,0,7.3422299413121204,3.10204194155396,8.6388431495251901,4.07872539082204,1.3513447372928999,0,0,1.70023134795361,2.8968875466742698,0.72469506119752003,0,2.4390366941706199,0,0,0,0,5.1156930150064204,2.8464240621958798,0,0,1.90473089571191,6.8817225448186496,5.3326314951685303,0,1.83511272345556,0,0,0,0,0,0,"-","-","-","-","-","-",0]
[null,"Fuel + Gas",0,0,0,1.4043863992908163,4.4778170234888774,1.7424496587285336,0,1.4632435089102596,0.99102322544795951,5.5812379003413497,7.2062777049468032,1.1910375651231524,2.0127947319599366,0,0,0,3.4701816992456012,1.4774327534886029,0,0,1.2904187845444692,3.605308495850057,5.5927859284297297,12.189467127526024,0,2.2614763582200728,0,0,2.1940908597131479,15.525123232684679,8.3557949859328637,2.3564537097365181,0,0,0,0.67238333005659567,0,0,2.4015887873658786,0,0,0,2.5557625456992223,2.518501240266199,0,0,0,0,4.0249842941610856,6.0386573712814045,0,1.2585591039957218,0,0.16774768347416277,1.1341911347720746,4.6284631409115677,4.4926823071122657,3.826997449354566,0,2.8682846452700379,6.8139142860332873,6.1533839217701329,0,0,2.4943934552373608,0,0,0,0,2.0894406668330316,0,1.3826766506545733,6.99349442379199,3.4190417182982236,8.7009768057521573,5.4725871172055314,0.29398674441920031,2.3846280542474849,0,0,3.2266898882042634,8.3534166792188227,7.3567862282032621,0,0,0,0,0,20.644398885585314,1.2177739144404589,3.329844952705483,0,0,0,1.9951467864138612E-2,7.6029302054592334,14.048111243393116,7.221557896270248,7.2225053169982694,7.2225053169982667,7.2225053169982703,7.2225053169982667,7.2225053169982694,5.4011252964452705,7.2225053169982694,7.222505316998296,7.2225053169982694,7.2225053169982667,7.2225053169982694,8.462284000679329,4.4168273442817316,0,0,0,0,0,4.2702944421240865,0,0,0,0,0,0,0,0,0,0,0,0,0,0,0,0,0,11.8709008164904,12.225887166097699,0,0,0,0,0,0,2.2450033629986499,0,0,0,0,0,0,0,0,0,0,0,0,0,0,0,0,0,0,0,0,0,0,0,0,0,0,0,0,0,0,0,0,0,0,0,0,0,0,0,0,0,0,0,0,"-","-","-","-","-","-","-","-","-","-","-","-","-","-","-","-","-","-","-","-","-","-","-","-","-","-","-","-","-","-","-","-","-","-","-","-","-","-","-","-","-","-","-","-","-","-","-","-","-","-","-","-","-","-","-","-","-","-","-","-","-","-","-","-","-","-","-","-","-","-","-","-","-"]
[null,"Ciclo combinado","-","-","-","-","-","-","-","-","-","-","-","-","-","-","-",0,0,0,0,0,0,0,8.7797571364445819,4.0285142482130762,0,1.8002816870491989,0,0,6.0420490600756835,23.103307204262595,13.41257747980104,0,0,0,0,0,0,0,3.0918776423015744,0,0,1.5415711044106881,0,4.2784758063241011,0,0,2.5404258140734921,0,0.33836412090940132,6.5436655993931545,0.47092892487629334,1.451048106104323,0,0.52487046837670692,3.9650643353237669,6.583120777008217,10.527061347090335,5.8044192609852621,2.7960606095225016,2.3280632122764331,2.1872022124631276,0.6203826406931936,1.0358372042194413,0,2.9370043615998975,0,0,0,1.4078079318472139,9.3142202637907831E-2,0,0,0.84829785078141995,1.0621113982364319,9.3361790818758728,5.2593851596266834,1.6913766559120957,1.7632784020925805,0,0.61744746652117699,0.54483277223649484,2.1038189295863434,1.2602452671136213,0,0,0.69988543852359986,0.97061608213843531,3.6062243618099927,5.0316647262927621,1.3894153817014347,1.4389145272773824,0,1.402473815418015,4.3070556936856761,4.7491143076774955,2.9300752461260657,2.186509770576635,0.41984606269110841,0.15770902551679947,3.6647673772148623,7.0235097053874442,2.9585568140751151,0.18658275122883825,2.4974593594691119,0,0.6118399439753095,3.6801148517068847,4.9453009248018081,5.9669714105638372,0.46191378129259764,0,0,1.7780992117664551,7.2823080845257158,2.3441513942693999,0,2.2603399410375968,0,0.77279633779671308,4.5125318276418538,3.5378120164921736,13.440767244430626,4.7845484429045841,1.5004034115816165,3.3791358694235858,4.4845026124744791,10.199007049230385,9.3024129420415296,2.1251788268181344,4.9141917693290997,1.2336483309313699,4.2561152346884397,3.53627872054436,5.3832163128643904,8.3735544666949,5.3743674374621904,1.2133600762180901,7.9390013780545496,7.9420623851057499,10.433193420051399,13.407411575870601,5.2983592072371204,6.19929742068995,3.5817233483790298,1.5255275717750301,16.982785155167701,10.4035610795303,9.4913043807178106,5.2100332812628096,4.4541713695236904,5.37721628603268,1.46916307874454,1.9099760859439101,0.45032282225065801,0,5.0967704522257904,0.40905341403661399,0.55403512612210504,2.4753227826906898,7.0593149255680503,6.6294388378455196,0.73427515914369501,0.38801714125217701,4.0054841877649503,2.4496230379186099,5.9002702918286598,3.0950776035685501,3.7026121339327802,3.1359747053120799,4.9656861715017797,5.8163588801752697,5.5028025190866199,9.0432249532979903,6.1839969784331696,4.1556437203296603,3.9720208074219099,5.01851814793618,5.8964289118546098,7.7564064346062098,7.7968527541929697,3.12883337208465,5.75915796263424,3.18274466273051,4.8000833821065303,11.372683998380101,6.9384664885888698,10.075497887386099,4.1004038375367502,4.8727022828610496,5.03079114571171,6.0964245467657099,10.7745404715577,9.0492447505351805,3.34007917377575,6.65214747684744,1.7639843967612401,1.34199851095482,4.1888729669312497,6.4882066321735801,6.8579154453972802,1.2622898966899301,1.3707614850187699,3.2233710251145702,8.1969014717031108,11.013206695772601,5.9535018870101402,6.0466487464536698,4.82141225215471,4.6164823975562701,3.0699046718032199,8.3385829321494001,8.9469743586660009,12.774112936847599,3.1190553502182201,2.0207229363122701,2.1507373178290301,0.97649900716498195,2.8155138769381098,5.1584501996805496,1.5939361727302801,4.6448474413324199,0,0.55969381772648596,5.0829063595484802,8.4185878013136506,8.740121732315,2.1130142397663199,0.38691583062570001,1.3879368434958601,1.44376201725146,6.2117143710995704,5.2730702499678896,0,3.3142291855056301,2.2760694326743902,4.4746691527471798,9.4721365271840199,7.6276431902166602,7.6684898702424,3.7939607062456799,2.0354981964436099,1.8800226729551699,0.382989662562366,4.5108909694111201,9.5044041614865495,2.4317116343003802,4.6654064321284796,0,7.2269603226998802,9.2120083049213104,1.75654326617698,3.45924049124649,5.4050847224710497,"-","-","-","-","-","-",4.4892451642934796]
[null,"Indisponibilidad prevista",0,1.1548815724905592,5.2540764560592512,7.6589217973407706,6.1994548504565952,3.586764613642242,7.4640470480491897E-2,0.99729325991231788,3.5732288410568289,5.2266043447458106,2.314272898184587,0.34094494049506946,3.0332762191380467,0,0.68486803205128499,4.9449684019214093,8.0258373820361957,5.9024902915133026,2.3895649638891889,1.7907039247552363,1.8039966222626487,4.8131328854798001,5.3433002484956038,3.8301982448872813,0,3.3013709497901194,0,1.1437153106860158,7.9367806441860811,11.163821283996073,6.9813676851240709,4.2905226388083966,0,0.44672945161504835,5.5154843480022064,5.2530994902853578,0.82212942254395283,0.48122084063201287,3.6478260907179307,0.1807305284206944,0,3.7242876672065619,6.4492910384011486,7.8704927247880851,1.2054465281906934,0,0.57016718036285219,2.8245542861032864,4.5119124092296383,4.0628229915409051,0.48537402363749654,2.6517754851913047,0,1.1621357976595303,5.7897296909357596,10.093787834848058,10.617006581201291,5.4579857874975355,1.6207164182462617,1.1810134761042783,1.8753886366812829,4.0333256526480072,0.93121560964623673,0,3.5424965899939096,0,1.124485569669686,1.2636978325624069,5.4910509651578083,3.71788179688448,0.31871985077230242,0.22694756237254746,2.647658825669807,5.0821160262664122,10.563108287530513,5.0646026068008281,1.1420259533434967,3.0941872284997136,0,0.68207777025844107,2.1697995598988338,4.0705422071209734,6.8673796358385619,7.1022255693630871,4.8922985634330631,3.0588016573740231,1.7144784661593737,5.2935933936679254,11.761234644457822,2.2570068817994371,4.2107836420461702,2.6428491808092938,5.0202092281255366,6.4471986495717326,7.210917991140783,8.2675595877815073,6.8720538040529942,4.9956368188913132,4.4886095014766081,4.3935312437046905,7.0733650438827675,7.5725420587723411,4.7833827334745145,5.8125156369423188,3.0062093787261479,4.5018817863873819,9.4057983415745952,10.412913650135062,12.570686776207301,7.305349272054726,4.1349321895377562,0.30637161381167249,3.3327915277441438,6.0224260516866321,3.7737201069945456,2.1635801443199041,5.5800041474848392,1.1781080395377044,0.40582856435976655,2.5344218535793006,3.1368463123281809,10.460802189272238,4.5323669581483861,0.81700529444686754,1.8502312430910453,2.8759781863406526,6.9514949456296575,7.0313645250515338,3.5654081198453578,3.8175784575029801,2.56281824974613,4.8425664927446599,5.8177916643116099,6.1816827285845299,11.5093433686067,5.0202211471367804,2.12200587051028,4.53474258351791,5.8070035656145302,9.1516203305031407,10.4695090177691,5.1612268696775896,6.1017782379127397,2.8676435175122799,0.854862103076238,9.6110861575865805,7.2089723978031603,10.461591848053899,8.5754585447502905,3.4347789161810298,3.4293700866462502,1.5916235681126001,3.7583729728620399,4.6994850499715097,3.0628182692497998,4.9751735518185196,0.953234087686472,0.31520523562951802,2.0335362413656601,8.0292465488704305,9.8871214808214791,3.6962213679784601,0.22107862655944499,2.2816086615705502,3.0959564761950502,7.2588114275091504,4.6328028429886201,5.4900583238061804,4.0094483370459297,4.6757441204808696,3.3136935784422201,3.1350585353857698,5.2325292678136197,7.3021596074285302,6.5788863943936704,4.6389049619417397,4.5700316542138104,3.5945374995210302,5.7306104250580798,8.4318648329046795,2.92910930915528,5.0154316367469303,1.92277317877305,2.7532829461553199,7.2946144018457604,7.7692835514044098,13.034335433115499,5.9102523887219203,3.5794725678423198,2.9195498238020501,3.8645489603980501,9.0144131671555705,8.9202621603548309,2.6109456826697799,5.8157408683387199,3.3185299038971201,2.1130055860153201,4.3609704299749499,8.0088592561277192,11.354889926170801,2.2294131574949301,0.81313105162326005,2.0414241542669802,6.1987987865697098,8.9387007212540794,8.9971738336338891,6.8782353151750399,5.4384990124916399,4.0642054574638902,3.1467808097021601,6.6134190398258097,8.7683676059687397,12.2645558515246,3.7326734439094098,3.4095974501918702,1.2758100633297,1.27792785473185,7.2252029641759004,7.3769322701767397,1.2278351192613901,5.0461264824120402,0,2.0185864462872098,3.7591904186477301,8.8018329214476498,8.0580517477755098,3.5870433597853699,0.23202876535953901,0.83082892530668395,1.2537620196358401,4.6091943157522701,7.4554492340999801,1.1697317772373901,3.4738465986797902,1.3558934118191599,2.6649550657486398,5.6704711032843704,4.9046490366051803,9.7423759118558895,3.5744596536892601,1.2225523531114999,1.1291712990657901,0.65922258402684997,6.3235008409962798,11.9474012564118,3.4372879065937001,4.3875650867737503,0,4.3406264686439702,5.5328776265885704,1.0550076178690999,3.1759741140235098,4.8447955124542101,"-","-","-","-","-","-",3.1469629249823199]
[]
[null,"Indisponibilidad equipo térmico mensual peninsular (%)\nTipo no prevista","2001-01-01","2001-02-01","2001-03-01","2001-04-01","2001-05-01","2001-06-01","2001-07-01","2001-08-01","2001-09-01","2001-10-01","2001-11-01","2001-12-01","2001","2002-01-01","2002-02-01","2002-03-01","2002-04-01","2002-05-01","2002-06-01","2002-07-01","2002-08-01","2002-09-01","2002-10-01","2002-11-01","2002-12-01","2002","2003-01-01","2003-02-01","2003-03-01","2003-04-01","2003-05-01","2003-06-01","2003-07-01","2003-08-01","2003-09-01","2003-10-01","2003-11-01","2003-12-01","2003","2004-01-01","2004-02-01","2004-03-01","2004-04-01","2004-05-01","2004-06-01","2004-07-01","2004-08-01","2004-09-01","2004-10-01","2004-11-01","2004-12-01","2004","2005-01-01","2005-02-01","2005-03-01","2005-04-01","2005-05-01","2005-06-01","2005-07-01","2005-08-01","2005-09-01","2005-10-01","2005-11-01","2005-12-01","2005","2006-01-01","2006-02-01","2006-03-01","2006-04-01","2006-05-01","2006-06-01","2006-07-01","2006-08-01","2006-09-01","2006-10-01","2006-11-01","2006-12-01","2006","2007-01-01","2007-02-01","2007-03-01","2007-04-01","2007-05-01","2007-06-01","2007-07-01","2007-08-01","2007-09-01","2007-10-01","2007-11-01","2007-12-01","2007","2008-01-01","2008-02-01","2008-03-01","2008-04-01","2008-05-01","2008-06-01","2008-07-01","2008-08-01","2008-09-01","2008-10-01","2008-11-01","2008-12-01","2008","2009-01-01","2009-02-01","2009-03-01","2009-04-01","2009-05-01","2009-06-01","2009-07-01","2009-08-01","2009-09-01","2009-10-01","2009-11-01","2009-12-01","2009","2010-01-31","2010-02-28","2010-03-31","2010-04-30","2010-05-31","2010-06-30","2010-07-31","2010-08-31","2010-09-30","2010-10-31","2010-11-30","2010-12-31","2010","2011-01-31","2011-02-28","2011-03-31","2011-04-30","2011-05-31","2011-06-30","2011-07-31","2011-08-31","2011-09-30","2011-10-31","2011-11-30","2011-12-31","2011","2012-01-31","2012-02-29","2012-03-31","2012-04-30","2012-05-31","2012-06-30","2012-07-31","2012-08-31","2012-09-30","2012-10-31","2012-11-30","2012-12-31","2012","2013-01-31","2013-02-28","2013-03-31","2013-04-30","2013-05-31","2013-06-30","2013-07-31","2013-08-31","2013-09-30","2013-10-31","2013-11-30","2013-12-31","2013","2014-01-31","2014-02-28","2014-03-31","2014-04-30","2014-05-31","2014-06-30","2014-07-31","2014-08-31","2014-09-30","2014-10-31","2014-11-30","2014-12-31","2014","2015-01-31","2015-02-28","2015-03-31","2015-04-30","2015-05-31","2015-06-30","2015-07-31","2015-08-31","2015-09-30","2015-10-31","2015-11-30","2015-12-31","2015","2016-01-31","2016-02-29","2016-03-31","2016-04-30","2016-05-31","2016-06-30","2016-07-31","2016-08-31","2016-09-30","2016-10-31","2016-11-30","2016-12-31","2016","2017-01-31","2017-02-28","2017-03-31","2017-04-30","2017-05-31","2017-06-30","2017-07-31","2017-08-31","2017-09-30","2017-10-31","2017-11-30","2017-12-31","2017","2018-01-31","2018-02-28","2018-03-31","2018-04-30","2018-05-31","2018-06-30","2018-07-31","2018-08-31","2018-09-30","2018-10-31","2018-11-30","2018-12-31","2018","2019-01-31","2019-02-28","2019-03-31","2019-04-30","2019-05-31","2019-06-30","2019-07-31","2019-08-31","2019-09-30","2019-10-31","2019-11-30","2019-12-31","2019","2020-01-31","2020-02-28","2020-03-27","2020-04-24","2020-05-22","2020-06-19","2020-07-17","2020-08-14","2020-09-11","2020-10-09","2020-11-06","2020-12-04","2020"]
[null,"Nuclear",0.44831958297730362,0.53831053788803096,0.16590390405794658,0.15786865890674598,0.25777978021354586,2.6429438237187028,2.3825743404654109E-2,6.9398704653786999E-3,0,1.6677865287812996,1.811866909084257,0.91654271794815145,0.7170349601035485,0,2.5299288797456215E-2,2.0232655239512241,1.1796325298797972,0.63613596490798996,0.97838164355853252,0.52573886037241513,0.64174323816242596,0.75410355313137967,0.67398980601278302,0.10819918773740535,0.22499202130348084,0.65140683712323644,1.4551140498242405,0.91973810889284369,0.50296150629652625,1.4148468178497973,11.542016245201776,6.0676994682659728,0.21354225574510433,0.8433446112032944,3.2348084319663163E-2,0,0.27171401665774103,0,1.9462399054783344,1.1632685634282194,0.16348421199515745,1.9907474530895566,3.8879885992591276E-2,4.4522025657805901,1.1327839980715741,0.20206540914645571,1.2604777905301097,0,4.4455638747976396,5.7387956027805229,7.0168941780964138,2.3189182032555062,0.1355101170194713,0.12500361971653012,3.627805420706069,12.769534299946331,17.421969585587199,20.630272720412218,29.045438715587853,17.005086219501166,2.7170573376748544,1.6229148135955971,1.3858989664722112,2.0578950942884142,9.1155505260456309,3.0511155586564516,2.8644630678598753,3.4584347521245049,11.273147660644247,13.619253397284659,2.8750402507373862,9.2098700488852856,0.41992418867700326,3.0591451333294253,2.2111540941966608,0.41277581380011319,1.3345659064518614,4.5005857372031652,1.8212574294622104,0.93649895207922884,0.45853519180182478,1.6015447366143754,4.1862753952222578,1.4616628057752026,0.41111680745318652,11.272416288698105,1.1168182459014293,0.37981611634720297,0,5.4014852227637107,2.4478833982182864,1.5773258461793807,1.0897877831101001E-2,1.964420611164849,15.529291794174952,2.3532204947051714,12.035212651563084,14.535251127151245,6.5928068540249294,14.66346409395776,16.652857512010598,8.9531474958899722,0,7.8970324959868803,0.13849048386851595,2.375976880978504,0,2.1236874608359524,1.0688922216023495,0,2.3412475518925575,0,3.0654271078892701,14.678659701890901,10.86910991747369,14.983293021461275,4.3244212889766054,10.549993052760628,5.7998382733639691,10.945133935778278,7.9072207214819858,6.9933241457282467,0.16572225843670857,0.48974902916161445,0.32000280972580619,3.1056638546023572,0.66567235534870628,0.27113786665046286,0,3.9170897170236372,2.1089519330868201,0,0.83454850480146703,6.2059411444657297E-3,3.1027756327820799,0.3749839214747,8.6352036217352199E-2,0.83774916885291695,1.77313607385329,3.61266264129753,0.64291184680528901,0,1.12876730882816,0.81120992637716605,0.71021048682333299,0.89076926124203504,0.83568225803113105,0,3.0666706955385199,0,0.101493871495051,5.0890248899581004E-3,0,2.1754244651363099,0.26424503275335498,0.72887376389564895,6.3263104820959999,5.7573904433016301,0,5.7399239342876898E-2,5.5193228784158501,1.9638274633317501,0.67840720233013896,1.42481212189372,0,0.69262246611591005,0,1.93262430683473,2.0155333587681699,1.61475062521904,0.75109074055907399,0,0,5.1816997551379397E-3,7.2566159121722897,2.6324748322004798,7.85082448541195,2.9781920380445999,1.0501194553587201,8.3274365532137407E-2,2.4047661875356101,2.2271737014666901,0.565039570699025,0.83325557208383505,1.0999134385673299,3.57249101635179,3.0948482690109,6.6944940214169701,0.28889270982964199,0,0,4.57985788375235,0.20434514743601101,1.9057075127954799,1.90459753475069,0,6.7344412095164801,0.19743528474484801,0,0,0.46265494867325302,2.2019073369446401E-2,5.4491892742347399E-2,0.17506925736153001,0.45481932088946198,3.6994729397402302E-3,4.7944787500788202,1.05402405397985,1.00447550612496E-2,6.1640342213955E-2,0.30053712806861999,1.7601028992716301,1.0796512433665501E-2,6.0098512544093001,0.28437437343198302,0.30661984552844201,4.97148452860975E-2,0.594990940253178,14.9570914279648,2.7187093027401801,2.1697692400017199,3.3100832437427101,3.5331657773054199,13.938759545147599,14.6869555443152,16.7626461022186,16.715360929235601,12.2216187507894,0.54670851893550199,0,0,0.55907012433104297,10.833853861673299,7.7896252842493503,3.8615536064684202,0.24773360912397399,1.02267749524799E-2,6.9083272447966602,0.90082582010927503,2.9840310757351598,0.44219852225322498,1.2555753546308299,2.4520996084602599E-2,0.21201309466018101,2.3074703613156302,1.96370761895007,1.75809469509456,5.4418317370187402E-2,0.13777060477095801,0.109809239633988,10.498633591861999,28.2170853404353,17.0716302486309,"-","-","-","-","-","-",9.40280863121842]
[null,"Carbón",1.5642168406698349,0.61437986265703071,2.8217172312423133,2.9314939079813498,4.5774483632612748,5.8260262048928801,7.7380423680192143,7.6188859350990175,6.5612596209166778,7.1563798378585854,5.9059259098503558,6.8869195961537262,5.05144411284593,6.8985442606113612,4.275862354635275,5.393164240531803,4.7677494061708039,5.8978665871880569,9.9544539908919685,7.7189250663920888,3.1032445425457924,5.3345914814898494,4.8002438202137947,5.5926232353418399,1.9980817344044381,5.4778095736523102,1.8333348106565579,2.5167808159364262,3.8517458698878051,2.4468484360946072,3.4941197686922449,6.6897740821811897,5.3773726639728796,3.8778285475739573,3.9664558145974955,1.9957752853648851,2.8619821242638399,1.1097544215192578,3.3340683516690666,4.6718154882180025,3.4880843931673504,5.7671124886494525,5.5886039940249121,6.625970409788362,7.5497003672565235,3.6861908465420257,4.3136381841289655,5.9557144254837784,5.0206202986040607,3.5044125359747089,4.7791930774749076,5.0814327856026669,5.3229085592389227,5.7173884694437769,7.4821581344470465,3.1479588789130375,4.5996021739784432,10.291377905720658,5.3638991097293518,6.5584451367321703,4.776649361887868,3.1999563676818616,2.045894089912812,5.427263634941526,5.3272662080019719,4.5506957087030528,5.3194943822632785,3.2864462044225746,2.5833035789054661,6.7312969693324813,6.6268533054579946,6.9717710848298822,3.4383321379121368,7.3298804169501839,2.4161477662189434,2.4355092122183595,1.8005843619746549,4.4471925070627183,2.3152248184204782,3.1951761370166669,3.0761070519418574,10.299342328233603,12.478268551225009,11.842676261746925,12.744219629635136,12.56494192783145,14.405781263060064,13.127420207650731,6.9024444574992101,4.4441080231726877,8.9791891234074832,6.5310486823397715,4.3660366819778291,3.4639579056178862,3.6275713625825121,5.7987694588158698,5.7719374780808588,6.0003255557826982,6.9057066820766924,10.040212632299502,7.9070048517036682,8.8707665140685119,8.226276323768646,6.4643000974331288,7.1977404785364172,8.5454906216536415,7.9195377829244515,11.485247036395666,5.4132079227765608,7.9495284058421891,7.5829618785886383,6.3672577340370005,5.8039068651432002,5.5269345757308468,6.8528013472510532,4.4904517283233059,7.0722175626668466,5.9818076604203831,7.8388221363318422,10.28882013208889,10.209147629423551,6.9228049904725326,4.5241399253145662,5.5242551418062478,5.8848785008550522,6.0343736125735816,5.0116592809860947,2.3841888714499984,2.677783366419376,6.0944000710246895,0.41546479038427497,1.5997836038834401,3.8051404374405098,5.1835230411495603,4.0592767527668396,5.4284455643022804,5.4602324453112097,7.9307309035818596,7.9382098312307701,11.816663658322,7.24964963161786,4.1872094185436604,5.4439421014305402,4.7364643857517699,4.0538489897054504,6.4394663997683201,5.7084042001173101,2.7719468233634901,5.7236394578247198,4.6612973440881804,5.4104540005063599,7.6446266715304203,3.1580007018663299,5.05945576382822,2.8070763302417698,4.8391977855845099,2.8475534126159299,1.0094891393073699,0.97095565865030697,2.1529267046148202,1.8368365072375801,3.00269847772875,3.29199855196438,3.1737786667626899,4.0462935326467102,1.9419865439820501,4.0532975505282902,2.7389382446544199,2.5946990905157001,4.0701781946597704,4.55542288930598,4.2603378851661597,7.2664155338180798,7.8422115047944603,6.7927977330630602,3.4644591816574999,5.4466950526196403,4.8189154976578497,7.9296696515815901,13.393737067463199,4.9885503670736302,6.2305617766578898,3.4085806153866698,2.3724927189026701,2.7557171348537999,5.1385729500400297,5.10464088378209,6.5864044914298896,6.9222229610461996,7.0788549428812901,4.10195046359107,5.4006706279623602,8.6693665246275504,6.9082863353968396,5.3854198036451502,9.6314056936668102,6.68776814556304,1.8075776898042999,4.3886847244678497,5.0711226128483204,8.2539553333263296,7.7889714744254404,7.5500543092683099,7.5487834057588401,15.1178640251718,10.035049841339699,4.3400732170021596,7.3642776990522396,7.9638220710746204,5.85621569859864,4.2705521706991298,4.4958416654721898,6.22799779661635,11.0775333198154,3.1083396740665701,3.3454779943005999,4.8058258985017197,8.4451347789842597,5.22129582530708,5.2614563714134697,5.8341618858834803,5.5626594134768101,3.3124305325610202,6.3606668345406501,1.0953609360196599,5.3623609930270399,3.59702612562534,4.3211538674074497,3.9814922200979201,8.3429527148205906,5.3594672036150799,5.0222210277547497,14.5876705499571,5.6074477537160998,13.0291617335573,9.5744931538933908,9.3537974701702993,4.0624776002681902,5.2376902469819004,3.9363541617676598,5.11350869834693,6.2007660644092102,10.922955504425101,11.7765408566034,11.699638393562401,18.376109940602799,9.1333012532734905,14.393196619016599,13.5523244771486,13.039916138757899,11.148344846735201,10.8370867350136,18.2165567331242,"-","-","-","-","-","-",13.518464730957101]
[null,"Fuel + Gas",2.70266925733918,1.8946262433023893,2.9455926957832768,3.5840675030361009,1.304753757204741,6.1899329989510159,5.6940744518502999,2.4901418942566691,9.0313788545632789,18.946139515290064,14.106940159038423,22.32672005168001,7.6432839727574668,23.52572799902946,24.384784861661078,19.443437324330212,17.308884802672381,24.783105274406502,21.666998314743509,21.463560831621901,14.664879130163316,13.223989059881017,10.112200610117998,9.2158238027505579,5.6483897528479439,17.179844791939963,7.1878110907749706,6.8935633139988601,4.9688326718693308,5.0650673130843247,5.8525980310290642,9.7323957751721792,9.5944358575833082,12.034149805017528,6.8737567654442682,9.772418892138953,5.223931068014168,6.3730010703712034,7.4644965199580966,6.3919547767489666,6.0097501302610459,5.9112911553075635,5.2538578536785998,12.32453113235567,8.3633508039503912,7.1202891607059646,7.4195038725255884,8.4875899785932631,6.4906728101183919,9.8179289971635235,17.412330466173636,8.433102184566188,16.886655117768761,13.082244862561945,11.779344408285827,6.9290818939583252,8.5165577342654668,12.654614866231242,11.429637791403232,9.5846363042950458,9.035016697982833,15.980507223435803,11.782160024365835,15.860579600353852,11.994724308845306,12.580431282938262,9.2745200440893871,10.146529395877103,7.4247627041539674,10.240311363047894,8.6923722339904899,16.899623789325645,8.718286067866881,9.1769802882575728,9.4400566295537995,16.965223544292638,12.960355440845412,11.062988222036122,7.6637431169553283,7.2031704937687051,6.3850918813074893,7.5290926674403273,2.1914355895289859,5.3541807514495474,2.2300658901557324,1.1861607764395901,4.8744446112423221,4.1290590151433104,15.358358304606501,8.7086289067139937,5.932397734545555,4.4523904126940961,4.7697224084302832,7.6255287053224121,5.4008471282726127,7.630373019891076,1.5409941498638244,7.7231784859286448,9.4723534606387787,7.3863673517560917,1.6034883367012773,0.63021321909949746,0.36316428352142155,4.8944512751921874,3.1597715832027551,8.2827027594184024,4.3330608898283849,7.0604136214041588,6.9360106596265512,4.225372836706196,4.9237354334703669,4.194820319842604,4.4234618931827701,7.0502801162601605,23.715766687428381,16.389309301635542,7.5718598265712451,7.2173827355065878,9.6615304530839978,11.537155468828528,7.6616821471088752,7.1092172616727236,7.2682553186380785,7.2818295421423942,22.217713505333361,22.698423552819555,17.83295837028232,1.7239838554512721,1.9111912787043606,10.247356993471412,1.6004742145821,1.6004742145821,1.19086600225082,6.7584559285804001E-3,0,0,0,0,0,0,0,0,0.43680592620916497,0,0,0,0,0,0,0,0,0,0,0,20.306369867900099,1.6228570743036099,36.982430273989401,11.1707655005196,0,0,0,0,0,0,0,0,0,0,5.6149496711546298,0,0,0,21.319843861701401,98.557223630337305,98.557223630337305,98.557223630337404,98.557223630337305,98.557223630337305,98.557223630337305,99.853824273072107,100,68.074485167788893,"-","-","-","-","-","-","-","-","-","-","-","-","-","-","-","-","-","-","-","-","-","-","-","-","-","-","-","-","-","-","-","-","-","-","-","-","-","-","-","-","-","-","-","-","-","-","-","-","-","-","-","-","-","-","-","-","-","-","-","-","-","-","-","-","-","-","-","-","-","-","-","-","-","-","-","-","-","-"]
[null,"Ciclo combinado","-","-","-","-","-","-","-","-","-","-","-","-","-","-","-",0,0,0,0,1.518143232624557,3.3832709801308156,4.9138426050389752,4.6001878138404901,10.22050518901518,3.7478560037151767,3.7863851697109077,2.4462603178827513,3.380552785974301,2.9415766153573912,7.825461223794357,7.8969238821542413,3.0687372799756933,4.0520229077914252,8.6307358099038858,1.2503854285767368,4.5489156889714968,0.36374695106718746,0.65827713081564931,3.8339960005801692,0.84644288670246171,0.49873410367683707,2.1742458626659076,4.3183300686925685,4.1744330556726998,4.9351013280206963,1.2716944931999505,7.9859524492916218,3.3414114026355093,4.1965394180980651,0.20886589050449936,4.1540784751368864,3.3145691101467589,5.8387362567760155,6.2971332232211044,16.334747888229536,10.595857909438259,12.1951935774393,6.3591728879958414,3.4913601383202995,8.5441510262595894,6.9661315582633376,7.4117901671101452,3.2165399731626296,6.0615393139322897,7.6658724880270714,3.0530479613084114,3.3025688865151475,2.1221640909964954,2.4606733541388768,6.7427010208141391,5.5471103477899772,4.064717401866881,5.8959291544541808,5.8065070575133539,3.6810903121288123,4.3196579574588165,6.741229226571388,4.5488579799424746,3.1156122244113655,5.4910866753827552,4.3251845308278494,7.7819054545140283,6.9228807043893132,4.4605952098282202,4.33552846820404,5.4476647596266119,8.8927071124889618,8.2658705425692833,7.4935163291853817,6.8714610280872845,6.2219067824784968,5.6250476785488042,3.5208549816034829,4.4772708723462671,3.2774484477971448,5.1426347999994757,4.8320903444485941,5.8009522405978817,3.8716599715337474,3.7201409291598528,5.2358845824344193,6.8424988801044568,7.0702762194500046,4.9668540106653172,3.9627632685306104,3.5307909892962952,5.8047079805647943,6.21242010140812,5.5332495335636418,2.2450543605644269,1.0347813264587302,5.97401737210786,11.424320097787383,9.4212374366378064,10.643444805752802,3.2696125535754255,5.7575593114761299,4.071172395920553,3.2960332399840455,5.0961866425519995,5.505781162948117,6.8523639088943771,4.2942564334905935,1.1707719026194139,3.40416337570122,2.9642868842817562,2.2183497160579146,2.5699397391475607,0.75078831014470748,3.481404864392379,1.07896843195238,0.55337740803063795,3.25917658453035,1.85199805068227,1.5250162497166599,1.12709470156236,1.02467067853156,1.96318158500588,6.1332373143596,5.2097864819643602,6.0005178935088601,2.8924537098343301,2.72664734851837,1.5934486949334701,1.68130826543168,5.52687370052241,3.5863638302260301,1.8374876027343601,2.8712645966739001,1.5493516404651599,1.2810890370669601,2.5107302368073201,5.4933874858629403,4.3263012278231798,1.35386092447248,2.80152287381221,0.29212641079889901,0.27932564680806299,2.4563130190011502,3.71384264886058,2.8452515397875602,1.66166685496944,0.45726235281599598,0.74322900418409499,1.33586494145678,4.1496793678224702,2.6900627996601898,1.531293549413,1.85388401158904,0.427744527381133,0.23178517716025199,0.94844038437821898,1.26535708431659,4.3489966495428201,2.8119311966223202,2.7415582029000798,1.9028899600598701,4.3214191739203001,5.5898953219872602,4.4189981809160299,1.7606654761957199,2.5768231621514399,1.4381706367136,0.68540211464696199,2.8753364400340402,3.0995758904113302,2.3649166338423,1.9275823398302001,0.45313427428730302,1.4225299344090101,0.92395874256042099,3.8725661085421299,11.8302035089079,8.4457245699877603,3.2868935929586298,5.7361395675251696,5.8538999001405303,5.7484726346243296,6.3011979106813802,6.8579537387072804,5.5954330925407803,1.84408752478855,3.6646466204772001,3.1462969737016802,6.2574775255466699,4.9698506760988304,2.7253945035311999,4.8853196743253804,2.52961232385293,2.6532388999479699,2.9575442025140699,4.2281700177632402,4.3393292563862698,1.91580779088196,1.0901258348232601,1.45207282166618,2.9584580947010499,5.2633858117941701,6.9937234531327697,0.84657046365606603,3.09619016104689,2.06980193128891,2.5392432190952698,4.4624468290968196,8.34003615563058,5.7175481735982396,3.7150309720874799,2.7273527319149,2.70557117830761,1.20637949790171,2.7530563370782799,2.9788300592119699,2.9018766909709499,3.5172594383592002,1.93350669698484,0.93089130140362297,5.0368699971593403,4.7528495137000197,7.4044113030631804,9.8740301144969997,11.515021391017701,5.6283110095397699,8.7360163812385796,12.840112200415099,12.356895493231001,11.714804320873499,7.77054241397743,16.285464396726699,10.640066035464701,11.586342484304399,13.5107223120265,14.395160102735399,14.2198974467554,"-","-","-","-","-","-",13.4661253218329]
[null,"Indisponibilidad no prevista",1.5640405419472914,0.95898702994252538,2.080017147807824,2.3067884427098235,2.3767813851243615,4.9981407904965067,4.8941671752844558,3.9219899835544072,5.3470549200274498,8.9240298710363675,7.0546395922263683,9.5583409617333377,4.5248688937377892,9.6378816620129975,8.7864478650542246,8.3085829341648445,7.1857411705385799,9.2144060839919604,10.018099378701919,8.8652743441177648,5.4131058903764862,6.0671092080524085,5.0137835922878544,5.4619697820774391,2.603585667143828,7.158446120685162,3.1401825332735922,3.2695488638532022,3.129568431233491,3.3542658538573731,6.6777393280034252,6.8579928777815322,4.8307957915739586,5.5931486435052875,3.2256330352826859,3.5936729234547924,2.3773218222832142,1.949152532302419,3.9952201548024244,3.5844049322616875,2.7560392299880188,4.2888997142383474,3.9156556282357209,6.8958631681534506,5.676745585448165,3.0787052427138448,5.063248578326272,4.501669733961938,5.0024403172736074,4.477736263460856,7.6614357885292694,4.77850298577959,6.560894806459558,6.0615256531549591,9.8229944011970929,8.0249376872296949,10.263319740867829,11.900934658064305,11.162644719973738,9.968931959593796,5.748316333070334,6.4359278194041885,3.9767690843035752,6.7418402089397516,8.0418184564285813,5.1311412797502935,4.8111535438963555,4.0689351845749462,5.0723616254651898,8.6689100868418478,5.8562764835215306,7.8565215251653209,4.6551847187478845,6.2466250152481315,3.9783507699646363,5.0901963355635838,5.3764072741097939,5.5751181090443156,3.3792224534559239,4.2915271058171829,3.5994398206262099,7.2898706778682767,7.1667377291492391,5.9872130642987944,5.5100365968392895,7.6565419061771278,8.4166005035649771,7.6074642877173941,7.0742878551138064,6.2266745646108488,6.227099061405478,5.037590293364179,3.2495277229309525,4.0960869849644341,5.6663049865390827,5.0688670225480399,5.9737651214127396,7.5180973159925601,5.6190563049326601,7.4942904306346652,7.4916968025942801,7.111286535007066,5.5155748256229202,5.8315987672046949,4.0368321938632663,5.0272927770727813,5.2017425144408627,6.9026069783054176,4.8813615978571621,3.448351809893762,3.219635549778503,4.9045891220492228,8.0145254721678949,9.1471326839415692,10.852616403757423,6.5117675159563362,6.0026388337032737,5.8429761379882326,5.1989617644889323,7.7405948502673034,7.1911420776368171,6.9062108776512492,3.8122512871369141,2.39738843893491,4.3769256706636677,4.6559036739149882,3.3686830280776978,2.1045277464902954,1.1431441986784439,4.5304702266679913,1.10724076438528,0.76128732936964005,2.9063553573309502,2.28620189999168,2.3444386892408202,2.0226145686100998,1.9385725447710001,3.1976601495805101,5.6769544319744396,6.43236861865664,5.2430344442709202,2.6469276380214701,3.0522886810713099,2.1960584831853498,2.0731447035259398,4.8687005033507704,3.58567206178946,1.7263997285446899,3.5653339980996002,2.0366869266462602,2.0887136981869201,3.3210598086381702,3.8746588278670302,4.06473207190247,1.87819653009399,2.9361793977615598,2.6308616117892001,1.5484436756772499,1.6378433299747499,2.6543892550659201,3.0271635443239502,2.0236387140533298,1.18596251849419,1.4494891881279,1.7550756290351099,2.9605245700989999,2.52814211422917,1.8793888727381101,2.1104337710507202,1.5226843056783601,1.38086531194786,1.5867783640009001,2.7554265707389902,5.5593212053861398,5.6799558140644502,4.0226352481091299,4.9341893547815001,5.3151879708740504,6.4684842758587697,6.9752059610645301,3.7954397907424999,4.1786763017823096,2.9073536142735499,2.27154596116406,3.6663315187455798,4.79895053857972,4.2318619000895099,3.90176343691614,1.99940829058465,2.5492299850868698,1.5350218948941701,4.3692568847671298,9.0124634395785996,6.9192317914436297,4.0167677131137198,5.6741135575016903,6.2094055391727698,3.8519754267904598,4.7324864318424096,5.2178136879709998,5.2739483482947902,2.8638902440817402,3.8955166289194398,3.60945760920543,7.2215362181102396,5.2240441511602604,3.4640761675913301,4.7665111304238401,3.30802945051405,2.9127906974275399,2.7767991030246999,3.8444348631670802,3.9881136706357201,4.7302906188692804,1.4026302311562699,1.6751088405238499,2.8535399665761698,5.1441555294616199,7.9499710184181396,2.1788444143746002,3.5526603352176398,3.08262435948529,2.8865266896329,6.5189209547872302,7.7653952500122303,7.5259243847221402,5.9123083809926804,4.7171214379634803,2.628446667705,2.64915737516632,2.8806249314491401,3.0336983474138202,6.9796868055064101,4.7314378513196198,4.83873918130943,2.8169589413819498,5.1485195967797299,4.9724580881336102,5.7842074489372504,7.3368602049691898,8.1452969128217099,4.9962090750398396,7.71252652735763,10.4024834251624,10.4596506493055,11.5185762886485,7.0345831301830497,13.033997260359801,9.4683160046874804,9.9163368323053405,12.454141046198201,15.999184345384799,15.6168207495157,"-","-","-","-","-","-",12.7706814319335]
[]
[null,"Disponibilidad equipo térmico mensual peninsular (%)","2001-01-01","2001-02-01","2001-03-01","2001-04-01","2001-05-01","2001-06-01","2001-07-01","2001-08-01","2001-09-01","2001-10-01","2001-11-01","2001-12-01","2001","2002-01-01","2002-02-01","2002-03-01","2002-04-01","2002-05-01","2002-06-01","2002-07-01","2002-08-01","2002-09-01","2002-10-01","2002-11-01","2002-12-01","2002","2003-01-01","2003-02-01","2003-03-01","2003-04-01","2003-05-01","2003-06-01","2003-07-01","2003-08-01","2003-09-01","2003-10-01","2003-11-01","2003-12-01","2003","2004-01-01","2004-02-01","2004-03-01","2004-04-01","2004-05-01","2004-06-01","2004-07-01","2004-08-01","2004-09-01","2004-10-01","2004-11-01","2004-12-01","2004","2005-01-01","2005-02-01","2005-03-01","2005-04-01","2005-05-01","2005-06-01","2005-07-01","2005-08-01","2005-09-01","2005-10-01","2005-11-01","2005-12-01","2005","2006-01-01","2006-02-01","2006-03-01","2006-04-01","2006-05-01","2006-06-01","2006-07-01","2006-08-01","2006-09-01","2006-10-01","2006-11-01","2006-12-01","2006","2007-01-01","2007-02-01","2007-03-01","2007-04-01","2007-05-01","2007-06-01","2007-07-01","2007-08-01","2007-09-01","2007-10-01","2007-11-01","2007-12-01","2007","2008-01-01","2008-02-01","2008-03-01","2008-04-01","2008-05-01","2008-06-01","2008-07-01","2008-08-01","2008-09-01","2008-10-01","2008-11-01","2008-12-01","2008","2009-01-01","2009-02-01","2009-03-01","2009-04-01","2009-05-01","2009-06-01","2009-07-01","2009-08-01","2009-09-01","2009-10-01","2009-11-01","2009-12-01","2009","2010-01-31","2010-02-28","2010-03-31","2010-04-30","2010-05-31","2010-06-30","2010-07-31","2010-08-31","2010-09-30","2010-10-31","2010-11-30","2010-12-31","2010","2011-01-31","2011-02-28","2011-03-31","2011-04-30","2011-05-31","2011-06-30","2011-07-31","2011-08-31","2011-09-30","2011-10-31","2011-11-30","2011-12-31","2011","2012-01-31","2012-02-29","2012-03-31","2012-04-30","2012-05-31","2012-06-30","2012-07-31","2012-08-31","2012-09-30","2012-10-31","2012-11-30","2012-12-31","2012","2013-01-31","2013-02-28","2013-03-31","2013-04-30","2013-05-31","2013-06-30","2013-07-31","2013-08-31","2013-09-30","2013-10-31","2013-11-30","2013-12-31","2013","2014-01-31","2014-02-28","2014-03-31","2014-04-30","2014-05-31","2014-06-30","2014-07-31","2014-08-31","2014-09-30","2014-10-31","2014-11-30","2014-12-31","2014","2015-01-31","2015-02-28","2015-03-31","2015-04-30","2015-05-31","2015-06-30","2015-07-31","2015-08-31","2015-09-30","2015-10-31","2015-11-30","2015-12-31","2015","2016-01-31","2016-02-29","2016-03-31","2016-04-30","2016-05-31","2016-06-30","2016-07-31","2016-08-31","2016-09-30","2016-10-31","2016-11-30","2016-12-31","2016","2017-01-31","2017-02-28","2017-03-31","2017-04-30","2017-05-31","2017-06-30","2017-07-31","2017-08-31","2017-09-30","2017-10-31","2017-11-30","2017-12-31","2017","2018-01-31","2018-02-28","2018-03-31","2018-04-30","2018-05-31","2018-06-30","2018-07-31","2018-08-31","2018-09-30","2018-10-31","2018-11-30","2018-12-31","2018","2019-01-31","2019-02-28","2019-03-31","2019-04-30","2019-05-31","2019-06-30","2019-07-31","2019-08-31","2019-09-30","2019-10-31","2019-11-30","2019-12-31","2019","2020-01-31","2020-02-28","2020-03-27","2020-04-24","2020-05-22","2020-06-19","2020-07-17","2020-08-14","2020-09-11","2020-10-09","2020-11-06","2020-12-04","2020"]
[null,"Nuclear",99.551680417022695,97.182268981974843,85.583079503484385,85.944614626602032,99.742220219786461,97.357056176281304,99.721265908305014,98.017520430284549,89.58860492912558,88.486746592518216,97.329596162427492,99.083457282051853,94.804731917459193,100,97.635439211512931,80.843727251837436,81.419036447840995,86.814243786574082,95.327333245242741,99.474261139627586,98.739572958174577,87.474664329137241,97.874629350063898,99.891800812262588,99.775007978696522,93.772744329566649,98.544885950175754,99.080261891107156,85.094168840587471,89.117658835975234,86.178814600128533,86.036505697688156,99.786457744254889,99.156655388796707,81.18521548428528,84.79462537984169,98.735767520274962,98.139030325794479,92.137817966413095,98.128237269611134,99.836515788004846,90.0056798070799,95.180071039927242,88.157134988926529,96.387965665051766,99.797934590853544,98.739522209469897,88.189956720222924,82.584230671858279,94.261204397219473,92.983105821903592,93.654718366781225,99.864489882980536,97.851294742830291,83.173590263331192,72.842250322191333,67.238139704517579,70.969961788468481,70.954561284412151,82.994913780498834,97.282942662325141,85.319780466820546,97.090748816243007,97.942104905711588,85.197783756216907,96.948884441343552,97.135536932140127,90.868003931647252,70.566685757319831,81.180052149918012,97.124959749262615,90.790129951114722,97.770978334300153,84.329215487917281,85.535080782969615,97.89900319377989,98.665434093548143,90.705200483181827,98.178742570537793,96.665967925078547,91.678951899968951,87.729339722482777,66.704979122177903,60.607705223122402,72.586519919683738,74.711236223916558,94.941084023271458,90.376497010214948,76.454920714119865,94.598514777236289,83.705432905956656,98.422674153820623,99.989102122168902,98.035579388835146,77.243012082026894,86.682703150792989,87.964787348436914,85.464748872848759,93.407193145975072,85.336535906042243,80.310994849477268,77.741381970630457,91.394961149158675,88.504922001200413,99.861509516131477,88.860133394495577,72.160571707179557,77.178414057360769,68.195739101514079,67.940716140722031,77.312803940520638,100,85.069663954405314,75.896607998598625,77.295757500248698,72.355049535388758,80.142538872838671,82.52353573841944,94.200161726636026,89.054866064221727,92.092779278518009,81.126468663758402,88.702650055891525,99.510250970838385,99.679997190274193,96.894336145397645,99.334327644651296,95.630002803144308,87.279402078673442,92.157935647242667,86.441101091912586,86.031310284132999,79.71000994735914,84.145653568028024,66.659450932132415,89.855954524755759,91.292839898236352,99.162250831147077,95.434859425638109,82.230694820912362,85.592619328531214,86.804077070470498,86.085167433359643,93.974272141792639,99.289789513176672,99.109230738757958,97.655586677666605,81.352437554513202,69.049074172639777,94.505126101826278,99.898506128504948,99.994910975110045,97.86106987117671,75.612631507142581,78.860675643380645,90.606182801157047,83.442252154541961,88.231305346672485,93.988695789974116,83.017759671086239,72.783094239947772,82.160419069398202,93.310288587643981,92.563883668080393,89.799801710451391,79.271197077766303,77.397933430763118,72.508601855890888,84.013833292147936,81.695917222448472,93.237605049415038,93.988695789974116,93.988695789974116,77.996320803250981,64.228112912976314,78.00080829049233,77.952500322336348,91.010503751929519,92.866107666165959,80.809177168987887,85.013557831411504,84.177073976172508,93.423656219275088,93.155440217890288,92.888782351406789,87.189479208852021,64.326421294111015,71.25093939467304,89.432995579447251,93.988695789974102,92.1349150276736,74.935494407631467,74.272567353517701,88.265133623350891,84.570240710134769,81.92604381616772,79.905123480036679,93.791260505229275,92.984703092077069,69.529574862417718,90.544826350371821,93.966676716604667,93.934203897231768,93.813626532612588,92.181262117920994,69.554960925348766,79.266640191061668,85.974291065499671,93.978651034912872,93.927055447760168,93.68815866190549,92.052392753801811,74.793466425610134,77.52480530537801,81.426264943203435,93.682075944445671,90.211905938378536,79.449574434745131,71.109058181432104,97.28129069725982,86.596193783294524,96.68991675625729,96.466834222694587,86.061240454852395,74.949605650161999,72.238935935298798,71.536105003059902,87.778381249210597,99.453291481064497,100,98.626758053182058,75.437670166794661,82.389060912712395,86.793593085449672,96.136437214193805,99.752266390876031,99.989773225047514,91.23382603645625,76.21067266092912,93.256438022599383,99.557801477746779,98.744424645369165,99.975479003915396,87.932314080229816,68.751527168924071,86.67912333305533,91.484509910970047,99.945581682629808,99.862229395229036,99.890190760366011,89.501366408137997,65.472814910297572,73.744932288446719,"-","-","-","-","-","-",88.008047978179604]
[null,"Carbón",98.435783159330171,98.225978298098966,94.603354841980718,89.48974279927576,83.746691122501787,86.838203728247336,92.261957631980792,92.381114064900984,92.866377497550758,91.071729786035917,94.094074090149647,93.113080403846268,92.225886667085447,93.101455739388641,95.724137645364721,93.844861207293405,89.107070813556462,87.778911943029314,85.363176649439552,86.49158802810544,92.351353909516007,91.636893003650414,86.941777529433381,92.22195221439074,96.798769453096511,90.920989275007159,96.963173797473971,93.330462904385101,87.394050917437397,89.888148905901986,87.647815310414856,87.975734100587729,93.418132123669182,93.729540894771048,93.098870088902217,93.704111365741909,94.429522950476567,97.686976304911596,92.44434900448708,94.12491523821285,95.308646333263496,89.085377093987404,80.314838674625449,78.969317015859872,89.579364143932978,95.108737705406071,94.481290367819128,92.611086148077874,92.010694672112791,91.438817725996955,92.892940915246555,90.490746902911638,93.472019992709164,91.389976908478147,86.397842596041556,82.290227279709498,84.260487569379663,85.653800221014507,91.983892828007569,93.441554863267825,95.223350638112137,96.739216263466759,97.004682087641839,94.572736365058475,91.033231163447155,95.449304291296954,90.808594679125861,96.262976558115199,92.53941171669274,85.177566756489654,92.249352340060099,93.002369134680748,93.355055081406306,86.125433780654177,85.369989826878808,90.705826057674386,96.55313410581789,91.481940599473376,97.0714635735131,96.191512254916915,96.31048869176503,89.08725341547327,86.908327192481877,86.188708063485507,86.281966658116815,85.521603004030325,82.605424300099457,77.897703979880262,81.055364417738105,89.016797312563995,87.807724662231323,82.277474174717199,77.679225012052086,78.444202474924111,81.002474474861728,76.434463933468876,75.571104371614908,76.805875201671498,77.435139612245308,81.586846061190045,81.589247505796024,77.661217691868387,80.886638663595221,78.955053918524285,82.810087683937553,82.639432557300708,82.586069418747016,72.533759246977723,78.693151915313052,87.740515152693646,90.548443589391596,91.769018256776405,91.772533964434032,90.612485489852617,90.108738747889987,94.892400782637964,86.433332411516673,93.401044850540899,91.544030374629429,88.435887184961302,84.079935307830041,87.366277946781068,94.498611375505433,93.858597369155035,93.498970054637667,91.594430011377867,88.663650633222716,91.739381680189467,95.476532517678436,91.18518921811588,99.584535209615723,97.585815779529966,93.525214614529276,92.355343568173168,90.141649907054557,94.570248435301423,94.539767554688794,91.597479782416514,88.352148583314758,84.259984305024616,89.924309908890152,95.812790581456341,92.661321605569015,93.951230388445254,94.633845784491569,91.989353360151611,88.560884299873663,88.048223241422221,89.268538613077567,94.026397430108844,91.63603346372993,87.975098037596752,86.236931906675181,90.944984729841025,94.151011782706107,90.949906469295144,94.293759725210492,96.308896677933177,93.808495347314661,86.534908367836323,81.649049675941555,87.916463062626818,92.540686504344109,92.230307729967947,87.387114651681998,87.473536670684894,91.352432037465803,92.666791343339668,90.324699597008362,91.335551393334313,90.850306698688087,91.145366898274673,87.811876545850154,83.434679463991273,87.312489293986872,91.671606250908582,88.75686796637558,89.629123016094397,82.187017735629141,75.12583763732502,91.727414530323827,87.579713245237372,93.096154549366119,95.658386458671714,92.070119386878005,79.481218948846745,82.265434182444878,88.55180286445561,91.108656216528175,90.952024234693084,93.928928713983311,91.760205573061626,88.411437267647131,91.122592842177539,89.847678438484067,87.702160638890476,93.195507932809889,89.946144821597116,78.112346021894254,82.219761058508482,87.583446807742035,92.211028525574562,91.879533441010224,86.556956680452586,75.346090912156029,85.261376195487202,89.027800337330419,86.617232990814031,86.18911404647497,88.29672041895094,88.377195792358421,80.379228691574511,88.336311645375446,88.922466680184598,96.891660325933429,96.654522005699405,95.072722980854735,78.128832453244044,86.492039559014287,93.552009138437313,88.958613428968661,94.437340586523192,89.34533952612685,90.537291223905385,90.265795914455154,90.558913616150917,95.051629137081761,95.678846132592554,96.01850777990208,89.956815937225798,91.743645249710653,94.253083911047725,85.412329450042904,91.953515552113274,86.970838266442698,90.425506846106614,90.646202529829708,95.937522399731805,89.646616738011687,93.217221776036467,94.886491301653066,93.799233935590792,87.172313599862989,81.341736598577953,82.967730111269077,81.623890059397198,89.031586023270947,85.606803380983393,86.447675522851398,86.960083861242097,88.851655153264801,89.1629132649864,81.783443266875793,"-","-","-","-","-","-",86.481535269042894]
[null,"Fuel + Gas",93.335207576472357,94.14325059050914,93.092284138028262,91.049422931484614,90.25530605311792,88.105494176131984,90.34380238196124,92.084491430644604,86.015474753800305,71.510499418180117,74.724658969826308,65.615046530857512,85.795339900955298,69.391567605009541,68.536576300490765,73.477923837821606,72.142294660233844,66.660823134256702,71.254362847408316,71.328467092915389,76.692887951968018,75.814791394973852,76.930894866499472,71.230590474770622,86.981177497036597,73.352700157236484,85.438278756248181,85.673329761791138,85.081180463167627,71.471893380845458,77.840591451377307,79.93685279699254,82.431266424317926,79.966186769852271,85.12657980942555,81.555534352674258,86.776405506855639,85.627335504498603,82.271148366505301,85.635264094362654,86.017468740850603,86.115927715804048,84.217598471733808,77.184186498489808,83.663868067161218,84.906929710405677,84.607714998586033,83.539628892518351,81.511561766832145,76.154122043420699,74.598377945691965,82.33281057987476,75.124053294096854,78.760715865829525,78.740873779306384,80.084422211186507,78.632727204678645,73.781478377337493,77.779017890300636,76.755734732138762,73.35972469768771,67.074764536497923,77.426495657338023,73.337029398274666,75.884679759466309,76.628224398765596,79.934135637614503,79.062126285826764,81.783892977549911,76.878903651822952,80.516283447713391,70.926355241723641,73.496875190045031,76.612633675148075,71.067622246397889,66.770845020205712,75.954313496439312,75.761039405420263,76.442807671751325,76.903380294938032,74.503546844235132,68.232819267087677,74.567106796014599,78.761147862297292,81.755482506737991,82.264856171023595,77.228057632426697,77.749622660738311,45.875924485689708,76.168720920594026,74.418918721123745,87.054323628445687,91.537154662994723,88.681348366102583,90.886078475288258,77.642543512430777,77.286741344524188,77.903074777175618,71.60553092849662,71.459275819639146,77.242154834693977,78.215429952295736,83.571077745457131,81.085250040813364,82.169049044474406,76.690689773000997,81.291306632582049,78.563953901006272,78.688356862783877,80.159216002023186,83.50387301564524,88.171874157453829,87.866557162589515,87.230000629383326,67.249441964673906,59.316302886683317,79.670181065422028,76.04074461707512,90.338469546916002,88.46284453117147,92.338317852891123,92.890782738327275,92.731744681361917,92.577473591043187,77.782286494666636,77.301576447180452,81.573125440554307,88.459074729408883,77.294232096078247,85.507210470693479,74.392412566686389,74.392412566686389,66.541610944301695,43.852701586104217,31.988559225542403,40.0292571310356,64.626012386850903,64.626012386850903,64.626012386850903,64.626012386850903,64.626012386850903,64.626012386850903,59.24916523682608,64.626012386850903,85.4794550313987,100,100,100,100,100,100,100,100,100,79.693630132099898,92.732675928723879,63.017569726010599,88.829234499480407,100,100,100,100,100,100,100,100,100,100,94.385050328845367,100,100,100,78.680156138298599,1.4427763696626954,1.4427763696626954,1.4427763696625959,1.4427763696626954,1.4427763696626954,1.4427763696626954,0.14617572692789338,0,31.925514832211107,"-","-","-","-","-","-","-","-","-","-","-","-","-","-","-","-","-","-","-","-","-","-","-","-","-","-","-","-","-","-","-","-","-","-","-","-","-","-","-","-","-","-","-","-","-","-","-","-","-","-","-","-","-","-","-","-","-","-","-","-","-","-","-","-","-","-","-","-","-","-","-","-","-","-","-","-","-","-"]
[null,"Ciclo combinado","-","-","-","-","-","-","-","-","-","-","-","-","-","-","-",100,100,100,100,98.481856767375447,96.616729019869183,95.08615739496102,86.620055049714935,85.750980562771744,96.252143996284829,94.413333143239896,97.553739682117254,96.619447214025698,91.016374324566925,69.071231571943045,78.690498638044716,96.931262720024307,95.947977092208575,91.369264190096118,98.749614571423265,95.451084311028509,99.636253048932815,99.341722869184352,93.07412635711826,99.153557113297538,99.501265896323162,96.284183032923409,95.681669931307425,91.547091138003225,95.064898671979307,98.728305506800055,89.473621736634882,96.658588597364485,95.465096460992527,93.247468510102351,95.374992599986825,95.234382783748927,94.161263743223984,93.177996308402186,79.700187776446697,82.821021313553587,77.277745075470321,87.83640785101889,93.712579252157198,89.127785761463969,90.846666229273524,91.967827192196665,95.747622822617942,93.938460686067714,89.397123150373034,96.946952038691592,96.697431113484853,97.877835909003508,96.131518714013907,93.164156776547955,94.452889652210018,95.935282598133114,93.255772994764399,93.131381544250218,86.982730605995314,90.420956882914524,91.567394117516514,93.68786361796495,96.884387775588635,93.891465858096069,95.129982696935656,90.114275615899658,91.81687402849704,95.539404790171773,95.664471531795954,93.852449801849787,90.136676805372602,88.127905095620719,87.474818944521857,91.739123590211278,92.339178690244125,94.37495232145119,95.076671202978503,91.21567343396805,91.973437244525385,91.927289953874435,92.981399884974749,93.779201696711013,95.97063100294946,92.615091693625288,87.740605712178137,90.198944305820447,92.74314102932118,92.535686629865566,96.037236731469392,95.857369066728396,90.515177167728297,88.842278973790101,88.499779055872523,97.293031858142982,98.965218673541273,94.025982627892134,86.797580690446182,83.29645447883648,87.012403799977804,96.730387446424572,91.982100747486271,95.928827604079444,95.931170422219239,90.391281529806164,90.956406820559721,79.706868846674993,90.921195123604804,97.328824685798963,93.216700754875177,92.551210503243766,87.582643234711739,88.127647318810872,97.124032863037158,91.604403366278518,97.687383237116251,95.190507357280921,93.204544694925289,92.76478563645334,90.101429283588445,93.49853786097546,97.761969245250341,90.09781703693956,85.924700300534653,84.357020097984247,80.592070530620546,91.809187082928545,91.074055230791686,94.8248279566875,96.793164162793289,77.49034114430988,86.01007509024366,88.671208016547837,91.918702122063294,93.996476990011146,93.34169467690036,96.020106684448137,92.59663642819315,95.223375949926165,98.646139075527515,92.101706673961999,99.298820175164479,99.166639227069837,95.06836419830816,89.226842425571377,90.525309622366919,97.604057985886868,99.15472050593182,95.251286808050949,96.21451202062461,89.950050340348866,94.214859596771248,94.766094316654232,95.010141283098875,94.606569301117091,93.95185594266448,93.548757096535169,89.691417962385415,89.467006372024002,93.032425083048011,93.286420989678007,93.078591892003956,89.782151914225082,86.653698243406538,87.784149064890997,95.110501151719617,91.664018875214325,95.379084700555893,94.514514503246502,85.75197956158587,89.961957620999797,87.559585478771609,93.972013822633059,94.674163442851636,93.546678919879284,92.979616710673881,85.35289341990017,79.12055174055692,88.214196256236491,90.06095893019392,92.499876035713584,92.804101588904643,90.062654398444408,87.210595457145033,86.284130815895438,93.142277010769277,96.785150990192676,93.111982354408227,88.656801554595205,82.729315778680728,89.076647436891037,91.227956750015124,90.293268073519897,92.853905278590801,94.27685642824882,88.703872865336535,86.824855623570755,82.886557806766135,94.965136858899825,96.889151228864478,96.397189860504795,96.065042898133967,91.921100311267722,87.847826347186682,97.559493363613655,92.258962397620692,97.930198068711093,96.901062963178248,90.454646811354706,83.241376043055766,83.995752368333697,94.171954788146209,96.885731437459398,95.906491978196527,97.349858484846834,91.035229291822148,91.74809969082014,97.098123309029049,93.036424826873628,95.790423870340774,94.594439545849198,85.490993475656637,87.619507296083327,84.927098826694419,86.332009179257312,86.449480412538691,92.491666317505064,90.880993956199049,82.648996830173786,78.138700345282444,85.853484044826118,87.564051153894098,83.714535603273305,82.13297364183542,79.201649210774292,84.732734421796522,82.145599406018107,80.375017830773558,"-","-","-","-","-","-",82.044629513873616]
[null,"Disponibilidad",97.300603718334159,96.750775657848365,91.530767328264943,88.89915069208142,90.289165366563353,90.281001394711936,93.897099153085733,93.946623555383965,89.945609801884885,84.715173306425925,89.496895031797138,86.989884052003063,91.139383781369986,88.334765053112093,88.502829175589994,84.432976776227335,82.298419500029638,82.493341889557868,85.217149251918315,86.997132785722101,90.434182909128779,86.779985436154234,87.321457617164441,88.383919669816052,95.069343362933196,87.234075145070094,94.531898594418081,93.251781990653271,86.601686674594092,83.137013142378621,83.993978540968612,86.502502093364598,92.852857065209804,91.694356699508546,88.997819155724898,88.89216412526963,94.539558282322034,95.309892347908558,90.052760653665501,94.005672509198376,95.012380501110755,89.761973841448579,87.441498551579613,83.067289283923714,90.961817266832,94.833265528642556,92.327192160367773,90.634383898991672,88.447062411213281,89.464408238021306,89.858157680856294,90.457506879963461,91.48901050228784,90.834734061185358,82.447374747563259,79.961089973990113,77.528452677803756,80.845484595575556,85.227764867103119,86.861191335986575,90.429034240358462,87.633054060630499,93.217802726173915,91.391839105999821,86.524398919512493,93.014007693875399,92.23691537255101,92.85862139905727,87.639719720424878,85.809869605184858,92.0404148080829,90.200325479126477,90.980951022246657,86.955053525149808,83.742335509169195,88.127739034433674,91.765414468898086,89.568029160293847,93.930692133715354,92.33630971109568,91.561033306459322,86.00937530425341,83.365157565167806,84.334549855030261,87.024889759953012,86.777447613529006,87.360370756509596,84.631770397538503,78.703197511701774,89.797753968699084,87.06171656059864,91.301762749732859,91.217653666298389,88.944546573758316,86.613130079092201,85.828318894928671,86.320045201959644,86.651855671226954,88.624510976820758,86.631606344006201,83.9543661718685,83.835599424566155,88.705636705591203,87.373017702900214,92.095081236103667,89.575105808560622,84.558724509417715,81.850916201022287,81.717320649625833,88.422640199016357,91.821544293843488,93.960477609052361,87.823390015408137,84.185819458107176,84.45646756247929,89.436390153113109,87.49977308978464,91.779773166277707,94.240771652660229,89.570545277662333,89.519211960114973,82.482886810441045,91.506408193667738,96.630164137862181,93.625213412857207,92.320488466356281,89.504087123333022,90.252204454333793,94.160897464812678,91.288263301920125,95.345994128189673,93.412868829508966,89.955289118789494,89.235074316610536,83.849176887339226,91.30665719138949,94.944062127016466,91.273544166809813,87.522102320010632,83.421916736227601,83.293524986489729,91.197913940830674,89.552381683995662,93.617302862985383,96.434095494997905,85.191886409268733,88.877028610613451,87.483681493607492,87.530880527356189,94.200278954905173,94.153959540561985,94.759359948644388,92.039117053142036,90.907568665301739,93.802211726153857,91.572682518793783,94.681571932301608,96.440318007832715,94.630087219044327,87.617830986448382,85.387181765239305,92.581606708352936,96.5297591348602,94.099889367570114,92.980145656859662,87.611841764481682,90.670681635770322,90.462478513852318,91.950819622214922,91.633497284237393,93.13736682000652,93.110085935888293,89.843964920240865,84.970439945978796,85.573078550335353,89.170380548742614,88.327699749798171,88.922195288398399,85.632826057876628,82.457090377512316,91.433691832257807,88.668090549781425,93.379774968691265,93.454588152733635,87.518471139461681,85.911182970068893,81.205771608117502,88.649519056784399,92.882654023995485,92.992755073533544,93.06196402713023,85.077864830499763,80.528809282489021,88.93135740830904,88.612722674890691,89.468891421023656,90.61267630327248,90.706389107656022,86.177529581301656,82.345527682682786,91.414182040967304,95.240522251052028,92.980602763570616,89.109287150981885,82.757306607392707,84.69632556196288,88.575232063990669,88.6749158844611,91.54530863877909,92.857972039627327,89.527325403906516,86.304741077621216,82.664874024596699,90.45457948397835,94.105315865408897,95.966624642903483,94.78607572544901,86.548185053119511,84.673096711405123,96.59332046636402,90.498026512419969,96.917375640514706,95.094886864079882,89.721888626565033,83.432771828540112,83.488559825365002,90.500648259221947,95.050849796676971,96.540724406988303,96.097080605197831,92.51018075279859,89.510852418486209,91.850581417256208,91.71568527009677,93.805367406871412,94.518085992869402,89.181009299935894,90.122892875261215,84.47341663920686,89.088680141341555,90.632150734066798,93.874619625894368,91.628250888615526,83.274015733841324,77.592948094282704,85.044135804757801,88.577851783043201,86.966002739640203,86.191057526668544,84.55078554110608,86.490851335932703,80.824841540591692,79.538383738030092,"-","-","-","-","-","-",84.082355643084185]
[]
[null,"Horas de funcionamiento del equipo térmico mensual peninsular (número de horas)","2001-01-01","2001-02-01","2001-03-01","2001-04-01","2001-05-01","2001-06-01","2001-07-01","2001-08-01","2001-09-01","2001-10-01","2001-11-01","2001-12-01","2001","2002-01-01","2002-02-01","2002-03-01","2002-04-01","2002-05-01","2002-06-01","2002-07-01","2002-08-01","2002-09-01","2002-10-01","2002-11-01","2002-12-01","2002","2003-01-01","2003-02-01","2003-03-01","2003-04-01","2003-05-01","2003-06-01","2003-07-01","2003-08-01","2003-09-01","2003-10-01","2003-11-01","2003-12-01","2003","2004-01-01","2004-02-01","2004-03-01","2004-04-01","2004-05-01","2004-06-01","2004-07-01","2004-08-01","2004-09-01","2004-10-01","2004-11-01","2004-12-01","2004","2005-01-01","2005-02-01","2005-03-01","2005-04-01","2005-05-01","2005-06-01","2005-07-01","2005-08-01","2005-09-01","2005-10-01","2005-11-01","2005-12-01","2005","2006-01-01","2006-02-01","2006-03-01","2006-04-01","2006-05-01","2006-06-01","2006-07-01","2006-08-01","2006-09-01","2006-10-01","2006-11-01","2006-12-01","2006","2007-01-01","2007-02-01","2007-03-01","2007-04-01","2007-05-01","2007-06-01","2007-07-01","2007-08-01","2007-09-01","2007-10-01","2007-11-01","2007-12-01","2007","2008-01-01","2008-02-01","2008-03-01","2008-04-01","2008-05-01","2008-06-01","2008-07-01","2008-08-01","2008-09-01","2008-10-01","2008-11-01","2008-12-01","2008","2009-01-01","2009-02-01","2009-03-01","2009-04-01","2009-05-01","2009-06-01","2009-07-01","2009-08-01","2009-09-01","2009-10-01","2009-11-01","2009-12-01","2009","2010-01-31","2010-02-28","2010-03-31","2010-04-30","2010-05-31","2010-06-30","2010-07-31","2010-08-31","2010-09-30","2010-10-31","2010-11-30","2010-12-31","2010","2011-01-31","2011-02-28","2011-03-31","2011-04-30","2011-05-31","2011-06-30","2011-07-31","2011-08-31","2011-09-30","2011-10-31","2011-11-30","2011-12-31","2011","2012-01-31","2012-02-29","2012-03-31","2012-04-30","2012-05-31","2012-06-30","2012-07-31","2012-08-31","2012-09-30","2012-10-31","2012-11-30","2012-12-31","2012","2013-01-31","2013-02-28","2013-03-31","2013-04-30","2013-05-31","2013-06-30","2013-07-31","2013-08-31","2013-09-30","2013-10-31","2013-11-30","2013-12-31","2013","2014-01-31","2014-02-28","2014-03-31","2014-04-30","2014-05-31","2014-06-30","2014-07-31","2014-08-31","2014-09-30","2014-10-31","2014-11-30","2014-12-31","2014","2015-01-31","2015-02-28","2015-03-31","2015-04-30","2015-05-31","2015-06-30","2015-07-31","2015-08-31","2015-09-30","2015-10-31","2015-11-30","2015-12-31","2015","2016-01-31","2016-02-29","2016-03-31","2016-04-30","2016-05-31","2016-06-30","2016-07-31","2016-08-31","2016-09-30","2016-10-31","2016-11-30","2016-12-31","2016","2017-01-31","2017-02-28","2017-03-31","2017-04-30","2017-05-31","2017-06-30","2017-07-31","2017-08-31","2017-09-30","2017-10-31","2017-11-30","2017-12-31","2017","2018-01-31","2018-02-28","2018-03-31","2018-04-30","2018-05-31","2018-06-30","2018-07-31","2018-08-31","2018-09-30","2018-10-31","2018-11-30","2018-12-31","2018","2019-01-31","2019-02-28","2019-03-31","2019-04-30","2019-05-31","2019-06-30","2019-07-31","2019-08-31","2019-09-30","2019-10-31","2019-11-30","2019-12-31","2019","2020-01-31","2020-02-28","2020-03-27","2020-04-24","2020-05-22","2020-06-19","2020-07-17","2020-08-14","2020-09-11","2020-10-09","2020-11-06","2020-12-04","2020"]
[null,"Nuclear",740.39529449461349,652.71540458411005,634.43993023013638,616.74118764969285,742.65745079662599,699.22026487828327,742.10348188871978,729.30198463757938,644.54374130827512,659.24104833573767,700.19713806683035,737.47233464602743,8298.4420750965019,743.99999999999989,656.28031608635195,592.61438894737523,582.15211005835636,645.95156028645329,686.84472517903328,742.83998128436065,738.49475572191659,632.23614197891891,731.20035611702474,719.35535020340262,742.32441741074319,8214.2941032739363,733.01295798079036,665.69097334603509,632.91664821247684,620.90297595102402,641.75085686542093,613.39377803425771,740.7781916428404,737.42751095139431,584.10609212286556,628.1078600844636,709.75774923499216,730.15438562391068,8037.3097536086671,729.71636825923815,696.00000000000011,667.16284394906563,684.45430195714187,658.69843678978668,692.67338326647041,744,733.67105393174052,634.98476314697348,610.68687311844951,679.89451196616676,689.95824720196572,8222.1903835892572,743.21606292365755,657.58779194659155,617.56693843059634,531.40057757513227,509.94294405366139,520.10477434029019,537.44160015163322,624.8279489501507,711.69504217298834,645.12302034412323,709.03518101215195,740.17646052271346,7548.1190781437581,731.54344186340381,662.08829080934242,684.86186766842877,482.76377203420174,609.16010424406966,669.6979269218491,675.99940715544597,717.64144975977729,616.09576853846386,636.67822221745337,701.99153922297126,739.82007838424363,7922.3028845508998,740.37690427840619,655.87830859570954,681.12414057658827,608.80923549878082,492.87371472105451,436.53745650908451,539.46947923568655,555.22856437728524,683.82986702577136,673.49402729230985,536.53906201797849,700.5556039905681,7304.7163641192228,728.58798376517984,696,728.73397911363043,554.18052519052833,644.42693392063404,630.90811848306907,645.97298801702891,696.30629944283351,614.77830027979041,598.1170090053356,564.58907690615615,679.88702689797435,7782.4882410221599,744,597.0931302460707,537.20209963544073,554.59560222008213,506.19676805828652,488.53218663068463,575.13509344678755,744,612.79110679517896,565.05072710640877,552.72339643595808,547.01753049393881,7024.3376410688379,627.56415060934216,634.75867471075355,671.87166524938357,669.05623841471765,599.66502136654697,639.92529085597641,741.4566787796208,742.98267151184825,697.87310538270242,742.15268443203729,690.22409675105803,649.38845060189976,8106.0209996314197,643.97856659086642,578.61974223823347,598.58440002924578,605.92907231021798,498.4829410848086,646.56303267842668,679.89714469837224,744,700.04914045147098,612.18989300872352,617.58038607713615,646.56625879158753,7571.6462817164038,699.34286861281089,692.82510716294837,738.73123162779405,706.51209495310718,602.28787810759354,487.81138264633717,703.41658721334079,744,720.00000000000011,729.08840844203689,544.82597740796393,586.64178258928928,7955.4833187632221,620.87566720985456,592.86820079814277,697.38836433553683,598.00452421763794,541.72548589780502,591.76936262145796,694.76292360067498,688.66766148393265,646.50379395133496,591.53802534935244,557.1259900852815,540.22361467293842,7361.4536142239494,607.10061960388668,626.41682359248762,697.38836433553683,676.71108129593892,580.04989976995944,470.12818484585176,581.49278713463582,581.79597442351212,654.80204897142062,693.03705474224114,582.42036399747519,640.8602563459217,7392.2034590588664,694.29166281505104,626.4895729064599,697.38836433553683,630.40458866066774,478.66698536033948,514.68021334868695,667.25722673118003,699.26811733913655,663.22317624904599,560.92726389156667,536.08735992224581,661.13289790269619,7429.8174294626142,609.5241199168579,559.25749744472796,697.38836433553683,669.32942141251738,517.29574068547311,655.23375124462223,699.26811733913655,699.26811733913655,676.71108129593892,690.1311600537731,500.68294953635359,589.72432645148672,7563.8146470555603,699.26811733913655,631.59700920954288,697.38836433553683,666.06616239115328,556.48871586698328,560.41318942817372,606.71961999741177,699.26811733913655,649.87577021305822,591.4131550937725,512.04714153842269,719.88742063341522,7997.1831975372661,719.03572567648644,647.63367236687009,639.19162771223318,539.63620422941892,539.21668921738478,518.09185097136697,654.99732341944753,743.99999999999989,720.00000000000023,734.76947686549249,547.03880269035005,618.04660060219555,7621.6579737512457,720.80880503674871,672.00000000000011,743.00000000000023,661.10178312250889,567.02280783837671,678.4404288711014,741.35260190325243,737.53775945619748,720.00000000000023,656.67371991305697,498.19639919126524,644.33432106883379,8040.4686264013426,743.99999999999989,696.00000000000011,743.00000000000023,654.51312226985283,487.24245183208791,541.8011476278192,"-","-","-","-","-","-",3866.5567217297598]
[null,"Carbón",484.2048481853472,416.72749118219662,416.41077613866645,419.86291291168988,508.34476701400757,595.18955753364469,647.95057670158144,646.17099351063803,655.22260482074125,661.03657151537948,660.3599360875603,692.48092302294629,6805.11987289852,693.05291019159051,642.01467368468593,688.89572096595657,640.64960806017996,655.90087966205056,626.03182054351998,646.86800099396828,664.8505270291638,654.27943163078578,636.43685840487899,635.23197565860551,524.25912888940377,7708.7502863947557,566.24860874585329,563.16980811098915,573.82455991124937,514.92732088338073,558.71326591368518,625.18328794590104,680.21711162048064,681.19589348639761,661.0366130319137,681.81728169882717,623.94076748675934,585.18234776834265,7316.1613955028488,610.08978198208297,604.32257477911401,640.61169245489373,526.77685701057112,543.52443712743582,619.82922234836701,679.43201177164519,665.12985596224951,646.50353049691523,649.35869359382207,614.21044896613023,676.66403332883328,7476.3968436188761,697.48009321635379,620.3195151807289,639.67581699109667,558.3361915645803,595.81303597813371,599.52198266538096,676.96299528137592,644.38378417519391,650.1051149591749,679.82362721769846,676.46522993668179,675.19308136785082,7744.7874327678564,690.91152671503835,595.55880193696612,574.9446335234295,409.24253453310513,542.9471069084517,619.13706782127906,677.3432759993774,612.10235987660531,585.58507364316245,556.84275788837726,520.20821929093847,528.40900469595294,6913.3020504746319,656.66360041375628,562.98362549545504,544.0455951623461,612.85167152659835,648.75993280019031,611.12263507482157,640.60430390061003,638.69552626880829,604.93218403958736,589.77775173607142,580.91804736030178,637.17272153734893,7368.6196442139844,567.79985540149119,511.34304016062401,454.10447938543166,413.55028370362174,282.38057551306139,265.02054456357536,447.06426623926905,378.09892597914592,392.67421705169306,478.89114439409008,465.9269481596109,518.56111049703384,5175.3852409638548,534.53753546295252,376.54387273866098,366.47651247190595,233.64592958991923,288.71136748830185,311.33510832320104,421.00554511624472,240.6120776684721,359.51814229394643,411.53366585608472,285.01791938395786,250.28296304483982,4079.2206394384862,223.64746508971658,198.7791137025165,141.89345823661617,95.114852989941411,117.0119754246343,184.55954920599825,305.38174348771224,351.53836278445272,377.85168039212982,282.36275134610696,215.31042813329097,273.02602734057086,2769.2204948523754,327.12582729877829,356.9065645872704,489.50637868254648,378.19708035113592,394.04346330264895,359.88405793185683,573.52844761824986,544.88682105194891,578.28808859276307,553.53603629161887,539.74101242953725,555.16213786960554,4777.6609972269734,551.7508976988106,572.75343926494509,493.46949084919095,290.8449617639298,429.9264972229202,554.40474591244083,526.79685041669552,529.33098094115121,434.53839969190449,464.52546533742645,433.04992407124166,420.14663625115247,5787.0186881752297,414.94671873923471,354.61387397423465,238.51165604969475,177.46577640553537,281.37239606158886,364.6400464828277,653.62429773891006,575.38851614034184,595.43826558357512,556.42913018113404,380.19337779926605,572.49272268544826,4372.9408691685585,280.36384593562713,133.83390211651431,188.66896064887462,193.06748021039789,384.50410488325383,563.96550732612263,613.40342777335161,575.69623004159337,611.45267204304173,489.01658193239973,375.33886064413321,475.06999986625931,4895.2051323937094,561.1174596533059,367.94017302221425,329.16787224327044,348.87795686290252,335.97695170624434,590.58055487093077,654.03121698277232,599.59067330784626,531.74538833513884,505.03626855890622,530.8829195970203,535.60130186988545,5890.5487370104383,329.17327058985359,263.27882420319122,252.32181858005561,153.14527467484379,170.01206706886734,274.61557886170851,465.46364726029179,444.79351857774901,546.01345026725392,525.97746928177514,559.0333257479391,617.65698567618892,4649.3013537307033,611.06947137492421,457.41981591611454,257.43949319778898,261.98740649778148,460.50905475850647,531.83571504225608,522.61469063651236,401.08382979214264,381.05229517600389,488.16140110970468,567.18894867484562,515.43764019433991,5455.7997623709216,398.82824849751523,448.20510451589621,207.71597452565942,224.29084813446491,301.16077085782416,316.20014639461311,464.69396217693355,456.23037914052554,523.22238699671288,457.138987166763,515.74700399188862,385.23948194342319,4702.5488423313791,417.84631803963447,312.65654593391048,135.04430818593394,111.33208079155897,58.636866770063236,82.477897152132059,111.88662597038868,66.117575081913699,85.112926419358502,124.10896276782098,95.99167110267949,71.406048385831667,1672.6178266012262,154.29578461321421,153.01847412656466,108.71938296590902,83.162011057997503,66.468130937976454,86.434940667712056,"-","-","-","-","-","-",652.09872436937405]
[null,"Fuel + Gas",189.53191104634621,151.77936558164768,121.29893820417433,58.61538420628569,105.04367642483534,279.0971411552913,348.47668330403843,308.52970661674567,274.90072089368482,241.85552343901657,268.4295898803652,361.22599790991359,2708.7846386623446,421.74248326734232,284.38710741076585,252.84501716476851,233.59322024884264,193.62669886002539,289.39201352971992,342.31590154313528,229.63906928573897,226.19730415718601,222.90152358689565,140.59325140221173,118.0257615944488,2955.1210573333979,176.96679385876831,171.54941573835146,43.933771181070661,21.881602194705572,56.323237753882921,300.78196796201576,312.32365553550176,277.87091001430446,226.26912616749411,190.45060914041187,98.89235464172809,128.92917352838651,2026.7610784219451,135.27740306571704,94.106277292249459,161.66760061817507,42.596571883816637,75.165799105083778,195.40831601205204,284.45026446152281,184.88884229946748,255.0484207184488,158.01421293495386,130.66953384794536,206.84714102210114,1925.9039709360259,254.58903468228914,293.99039604316988,288.52205365216525,95.940460790716386,152.66680115291874,294.17741353109625,351.52089194212806,130.1373094167588,142.46041394554408,133.85375954486088,137.61648497940322,224.68576999397172,2525.4801583065409,204.27379464734253,159.57940445091936,81.920101037375673,90.635956181553311,35.443572289761889,182.81692234753345,385.618095674671,151.99702194062095,278.21018160353668,187.79175091680901,92.837056038380382,47.225236737667039,1898.3490938661714,39.449886340801775,48.666823131216731,39.920609592308082,25.839913767133609,41.357503953908726,42.941193452829246,104.23220796641456,83.570765809330709,90.603024276910347,55.6616804998935,120.41740068984157,105.82732381097705,972.39715479246991,108.74452405176089,83.835203324287178,52.838917891155326,93.807945694414343,58.02524904753168,107.79823873776206,78.926145756329561,134.79009997631573,89.91899741386942,80.571176007598112,103.35783339194593,86.639300572489418,1081.3076682001633,70.250019736889328,56.465302548570698,62.706413173237259,49.315850037918757,49.955717597410526,51.513242854647977,102.70225287620306,59.401377997931966,53.354904089384206,51.131098093250493,70.820783274108337,102.68444518359419,1049.4217694536937,158.59939968280182,129.39056881583718,43.266966388353673,72.400683330493408,94.936853097051284,99.514078301372152,109.85027904829845,85.451298262300739,93.519892390397203,72.838776756698792,98.546580317886608,99.92872029429455,1191.7194503890823,0,0,0,0,0,0,0,0,0,0,0,0,0,0,0,0,0,0,0,0,0,0,0,0,0,0,0,0,0,0,0,0,0,0,0,0,0,0,0,0,0,0,0,0,0,0,0,0,0,0,0,0,"-","-","-","-","-","-","-","-","-","-","-","-","-","-","-","-","-","-","-","-","-","-","-","-","-","-","-","-","-","-","-","-","-","-","-","-","-","-","-","-","-","-","-","-","-","-","-","-","-","-","-","-","-","-","-","-","-","-","-","-","-","-","-","-","-","-","-","-","-","-","-","-","-","-","-","-","-","-"]
[null,"Ciclo combinado","-","-","-","-","-","-","-","-","-","-","-","-","-","-","-","-",0,109.45251915684318,282.35392614505895,383.35073181000007,420.1695857444185,551.19910119753092,550.26899767074065,366.22049817331407,338.9449163380379,2899.2074999904562,374.39557344374066,442.87830880125995,385.43607411425171,202.81274566919114,367.76804707553941,654.95968687796153,611.56671907826069,556.9350780752651,600.62452578419106,581.45010933139838,451.22830051768051,355.50173775748038,5074.8553962644874,454.16740191779547,525.41037054727428,574.23615665943271,457.08157830049367,488.74509253081442,547.01592508761553,561.43621558448274,447.56075604856602,533.71881012889855,508.71086858653757,438.22961692268012,468.42593722711769,4687.6361398051131,481.11366874050179,451.17221174890028,439.23874966868016,429.40948960671005,490.63221422082466,618.592095215825,673.34058776823406,593.77305114653018,510.49170493894081,458.74288483778651,467.94084405334405,445.80363097536178,5147.0520464261863,551.39745551376461,507.19998655375935,465.38935881377921,438.99621369713759,488.50970685325598,523.23454658378068,594.98388296148357,475.09523003617437,553.65564099615256,471.774022326656,427.19062584233041,448.10352749311977,5546.3043250144401,556.33075799397977,395.37781392517354,359.73105410431629,346.8723076969352,383.29467064936131,504.0462534093582,534.52453809768042,420.26627539020728,432.50024743023033,454.63570221387056,517.80229218293812,473.222125258983,4644.7663694399389,506.25202968633533,505.21405824996231,446.6869851508431,450.91539293186929,481.60387160775605,494.36831003050889,557.66667696108721,521.06469553610214,496.34589873294499,469.26358180817442,452.10139669981572,386.41277535636556,5736.7801967987443,400.09894921436319,320.67201260902442,333.63981363009759,347.91085743689734,349.33791288790366,466.34546350217431,525.08197900921039,509.66513123686701,491.9294742823862,429.06807492374872,372.07027826854909,390.92070587790545,4743.5570236803251,348.50366051233556,324.03571188723873,314.00543623062248,295.45145871455497,292.78700641947034,338.17331819806321,409.8386694095546,359.25587692738571,390.69819498972214,339.19988584005841,351.84616162372981,316.98252280797504,3985.9352513526192,328.49549918331633,279.80359748551956,264.46720962373951,190.76043052810863,254.56900183166724,297.67543883945433,300.3921959655151,305.24519292718719,285.35682788790666,262.87330145276934,242.67435059708814,244.26391784111334,3256.6525516292918,260.93280193707938,243.15478965098322,211.70184148390393,162.23987621031256,156.12954159231626,183.69218344970699,214.63865676317079,220.67476088544282,196.08596572921965,225.66520793450826,214.66612520710822,201.65254005277436,2491.7429371272947,175.137844716008,136.93309927043404,122.78651066570841,104.03340346669093,117.29328944420149,106.20508495569334,133.31025693340192,142.53929759484942,147.5291503709158,194.33124082330605,161.94384494608926,191.64661405796366,1733.6896372452625,138.19998108042785,124.4359634611754,123.54148336660958,112.55739304328935,110.13365555395664,116.49333666296428,124.64527445605229,148.34490139575936,177.09703535915725,176.06133188176392,166.35507066580462,178.01060858892455,1695.8760355158847,178.14624107783848,153.2679837147378,153.35985827957759,153.43734755614844,147.57746703004005,142.43752392504163,230.70867907314943,186.23465400231123,184.30424916755882,184.30424916755882,184.93037677606475,188.93016112500908,2067.0170913482634,161.96384598025227,133.03564174828071,133.58660534373698,122.86505655228477,159.90635453113734,159.03089461918549,190.08708374435969,164.96029936214592,162.84752187675744,232.2589355896794,227.69028219423748,217.58545493754738,2065.817976479605,214.92861909970892,132.17757742093366,121.56843453767902,105.76524939563589,127.61395775403832,211.5277963388223,246.20536434005368,241.38184306295042,213.35980657142477,264.4523252835632,277.17296176683158,202.05648734893907,2358.2104229205811,157.97435155370979,136.23466963500857,124.20150105961629,113.95977225965832,141.21861405315354,150.91241600932511,160.21634009694679,186.87449709813052,161.07173560959961,172.114876072089,206.30244574311558,190.46298122373469,1920.068765150522,203.39810584377562,164.9305125914731,160.21464498209824,194.89096754073188,257.87354459312127,334.26524619878137,418.51420820735899,418.06161504055461,343.5548842799364,350.7607046046187,261.51631065399778,203.7218256272123,3311.7025701636594,229.15183866368429,181.41339947381832,146.39055918403574,215.03223290092853,212.63624253212089,259.98680148816095,"-","-","-","-","-","-",1244.6110742427488]
[null,"Horas de funcionamiento",474.70191997037404,409.83299031366295,395.66539033356707,373.98026876893391,461.39095557552298,535.17479382718398,589.80024584704961,573.86850874355389,543.22494918969937,540.51652457543889,559.83231040336136,610.83151989404053,6069.810400697259,630.31994738111837,543.84758392318406,535.92331540095586,492.33968975762724,503.12459934846765,532.62615923556348,573.43148929471135,553.49899383665388,530.77787572862815,549.51221291817194,508.06280272036599,463.36543337717944,6203.3981735047964,495.31602611521606,480.71094723159945,444.64329508099632,394.04082958844765,442.28465243516189,548.68841352256982,602.82368008975811,587.18710649330183,534.35171599901184,542.77304006336681,503.30703564237064,487.38843793066178,5993.3104696267119,510.8553966615051,501.26170851398342,530.73939861880183,448.19944040717303,460.51109174320572,532.91045047703801,587.74321570936013,533.9548875683206,538.39313527262527,508.23969802834512,490.00820319948753,535.48417286204074,5863.0239637763962,565.16127288958069,520.32182083423481,515.29828918306202,431.55696316500894,465.76005158760512,531.08150700279111,585.29926246163791,531.12623345495842,530.28343573145719,506.88722190903792,522.25436939391386,536.13728734811627,5957.5740273879246,569.7344816104229,505.28818098579177,476.41734328155155,381.18614702319621,451.9973264732663,522.49404060228619,599.23053327700848,506.22660727607172,530.18123943287787,480.50805722748669,450.76747097729947,460.55236161930475,5781.2518569596768,535.78868947930846,434.37177010311723,417.63606949239477,414.83709659954951,420.09255656210377,449.89237518026755,498.43493481907103,451.16129654314091,475.37509934654111,474.67681293699599,486.08381417678089,514.90846505987577,5398.653662374445,521.46560956976793,498.75895190315458,458.92306155449359,425.01919220278239,419.37826371129569,423.84974670560024,499.67900590865548,478.65082328101693,452.08083487523936,456.50577191644396,441.40808061461922,440.43231115424226,5501.9150234269773,460.34512985659501,356.27807646941153,350.5346564808288,326.32760080249824,332.68184876725746,393.17409692347718,468.32011383593618,443.50276453653163,441.23727590396328,415.79754441781023,355.70381327625137,364.08879775319815,4728.8003333928782,355.19792707298467,335.82099965193822,318.15268065214337,297.69078047126499,291.14760213744802,339.73570303031767,425.59472806674893,408.01059099683749,424.44271803415444,379.74331515315731,363.20176975074151,351.2418817814343,4244.6584326626989,367.0269169379589,336.84597736108833,364.12916538873736,297.65868291311506,318.9488179540254,363.68872896116608,423.73108718390159,430.16068863083365,419.95973545764122,386.50151852041819,372.77389768441805,386.20778155354463,4313.9395085666565,403.71072472948072,397.80304220861819,368.15328593203662,284.23999855904873,297.80934141767113,324.12682612236239,371.60316426602157,382.57204137851591,341.15494941759948,366.79114872931262,321.28617768275342,319.22061892727606,4211.7745504029217,308.73633992400056,267.39951893130871,249.21907371360192,206.40692723331884,229.48671904827603,252.07890126954288,355.7169552880203,340.91217585957332,341.32310550556917,349.05684709339806,281.71580601235036,342.52288582547794,3331.9897232067528,252.53941110335504,212.3928139447587,237.53118994375771,228.73256549954644,256.70430564519148,284.4064889203824,320.37036425626354,324.94176277416818,362.75042184144286,339.34562557493791,287.15929500805061,328.02273012057117,3437.9446654847352,358.11306362304708,285.5447016277941,288.60972510353764,281.73561767266762,251.77722362195672,317.1363607920386,410.6912742091979,377.26347139489781,341.30526880447275,328.74903200428224,331.03061855653317,356.52812985669817,3942.7605276876434,281.52047847426428,239.58626812499512,262.01428683724873,228.03423625777435,226.54882685437767,274.58439144230005,344.20883956119621,324.61686088316196,342.25271232561403,381.30097374558216,351.97416835012996,375.30507278838581,3641.5629151591584,391.95969532168408,295.84828120303899,256.05744247691655,242.07435771596835,280.3176944828059,346.97471357346944,373.79253455379666,360.03931980475642,329.98114877820512,374.04858194376283,383.83473110057554,362.48377786329962,4032.9930366840886,309.17282306836375,295.238183720677,231.45207636282609,212.07708108027546,245.97256115076448,251.61907984135914,314.75301758070316,344.00310039976563,341.49636211889901,335.30050769815699,336.85187643182616,309.41410594883149,3549.1652254647311,342.4123550230546,286.69030994368717,254.95465124060888,255.97518588280025,265.03208769710949,335.28441668784302,403.13620752531943,391.59657370425174,348.60023437818245,351.00445745306121,263.98454209690152,249.08387276363541,3747.7548943964553,301.88883778139689,264.5743711822214,241.73661399416059,261.80469088525996,227.49178612125931,269.92623917328137,"-","-","-","-","-","-",1567.4225391375799]
[]
[null,"Indisponibilidad equipo térmico anual peninsular (%)\nTipo permanente",2001,2002,2003,2004,2005,2006,2007,2008,2009,2010,2011,2012,2013,2014,2015,2016,2017,2018,2019,2020,2021,2022,2023,2024]
[null,"Nuclear",0,0,0,0,0,0,0,0,0,0,0,0.248254817304184,6.01130421002589,6.01130421002589,6.01130421002589,6.01130421002589,5.0574842366605397,0,0,0,"-","-","-","-"]
[null,"Carbón",0,0.97044966997218762,1.2038749294335811,1.2047008874924376,0.4123416590261158,0,0.61368827006285709,0.61713466945488205,0.61714748903872363,0.61665788722278814,0,1.45857150375199,3.6244672119303298,4.4737530259031404,2.0639675306186498,0.180319696838766,0,0,0,0,"-","-","-","-"]
[null,"Fuel + Gas",4.5485813943273046,7.2059786926034768,7.8627663261707257,7.9755281315633306,9.626202476451013,10.791344318296133,16.318838591625205,8.6191733875491785,8.4876646658826367,4.2454325358351124,38.0690254739661,5.6444669969725103,0,0,"-","-","-","-","-","-","-","-","-","-"]
[null,"Ciclo combinado","-",0,0,0,0,0,0,0,0,0,0,0,0,0,0,0,0,0.13208654926153901,0,0,"-","-","-","-"]
[null,"Indisponibilidad permanente",1.3024711057541853,2.3061077844546243,2.3041931008141519,2.1122146490656402,1.8912860340650088,1.7626655021621247,2.500400735949706,0.98286789295277677,0.91758392902724784,0.3636880139089036,1.2935513970202901,0.51596453162614297,1.92929826968843,2.1378015116893501,1.55476874365686,1.1200739726234299,0.90318666995035402,7.9030279903824899E-2,0,0,"-","-","-","-"]
[]
[null,"Indisponibilidad equipo térmico anual peninsular (%)\nTipo prevista",2001,2002,2003,2004,2005,2006,2007,2008,2009,2010,2011,2012,2013,2014,2015,2016,2017,2018,2019,2020,2021,2022,2023,2024]
[null,"Nuclear",4.4782331224372633,5.5758488333101184,5.9159421281085631,4.0263634299632729,5.6866657177374602,4.7942137796150233,13.84668369582505,3.5980455028127052,15.533039838184715,3.9249746357337036,12.786065257812201,8.4166886176431106,7.9593291390580099,7.5844481123349103,7.5138575450886602,6.9603806704946001,6.1765527400432196,5.4167816303009797,6.7573953939353997,2.5891433906019801,"-","-","-","-"]
[null,"Carbón",2.7226692200686196,2.6307514813683452,3.0177077144102782,3.2231194239932552,3.2271609695247601,4.0708668934638972,2.5993979442983406,13.963511314587704,5.8773025367777523,2.1037528236366398,1.8947362930004501,2.7523242413683602,3.4561341005456101,1.7159719522015999,2.70293422725213,5.8381696132949603,5.2072246851478701,2.4390366941706199,1.83511272345556,0,"-","-","-","-"]
[null,"Fuel + Gas",2.0127947319599366,2.2614763582200728,2.4015887873658786,1.2585591039957218,2.4943934552373608,2.3846280542474849,3.329844952705483,5.4011252964452705,4.2702944421240865,0,2.2450033629986499,0,0,0,"-","-","-","-","-","-","-","-","-","-"]
[null,"Ciclo combinado","-",1.8002816870491989,3.0918776423015744,1.451048106104323,2.9370043615998975,1.7632784020925805,1.4389145272773824,2.4974593594691119,2.2603399410375968,4.9141917693290997,6.19929742068995,5.0967704522257904,3.1359747053120799,5.75915796263424,6.65214747684744,4.82141225215471,4.6448474413324199,3.3142291855056301,4.6654064321284796,4.4892451642934796,"-","-","-","-"]
[null,"Indisponibilidad prevista",3.0332762191380467,3.3013709497901194,3.6478260907179307,2.6517754851913047,3.5424965899939096,3.0941872284997136,4.2107836420461702,5.8125156369423188,5.5800041474848392,3.8175784575029801,6.1017782379127397,4.9751735518185196,4.0094483370459297,5.0154316367469303,5.8157408683387199,5.4384990124916399,5.0461264824120402,3.4738465986797902,4.3875650867737503,3.1469629249823199,"-","-","-","-"]
[]
[null,"Indisponibilidad equipo térmico anual peninsular (%)\nTipo no prevista",2001,2002,2003,2004,2005,2006,2007,2008,2009,2010,2011,2012,2013,2014,2015,2016,2017,2018,2019,2020,2021,2022,2023,2024]
[null,"Nuclear",0.7170349601035485,0.65140683712323644,1.9462399054783344,2.3189182032555062,9.1155505260456309,4.5005857372031652,2.4478833982182864,7.8970324959868803,4.3244212889766054,3.9170897170236372,1.12876730882816,0.72887376389564895,2.0155333587681699,2.2271737014666901,1.90459753475069,1.05402405397985,2.1697692400017199,7.7896252842493503,1.75809469509456,9.40280863121842,"-","-","-","-"]
[null,"Carbón",5.05144411284593,5.4778095736523102,3.3340683516690666,5.0814327856026669,5.3272662080019719,4.4471925070627183,8.9791891234074832,6.4643000974331288,7.0722175626668466,6.0944000710246895,5.4439421014305402,4.8391977855845099,2.5946990905157001,6.2305617766578898,5.3854198036451502,7.3642776990522396,5.8341618858834803,5.6074477537160998,9.1333012532734905,13.518464730957101,"-","-","-","-"]
[null,"Fuel + Gas",7.6432839727574668,17.179844791939963,7.4644965199580966,8.433102184566188,11.994724308845306,11.062988222036122,5.932397734545555,4.8944512751921874,7.5718598265712451,10.247356993471412,0.43680592620916497,1.6228570743036099,5.6149496711546298,68.074485167788893,"-","-","-","-","-","-","-","-","-","-"]
[null,"Ciclo combinado","-",3.7863851697109077,3.8339960005801692,3.3145691101467589,7.6658724880270714,4.5488579799424746,6.2219067824784968,4.9668540106653172,5.7575593114761299,3.481404864392379,2.72664734851837,2.80152287381221,1.85388401158904,2.5768231621514399,3.2868935929586298,4.8853196743253804,3.09619016104689,3.5172594383592002,7.77054241397743,13.4661253218329,"-","-","-","-"]
[null,"Indisponibilidad no prevista",4.5248688937377892,7.158446120685162,3.9952201548024244,4.77850298577959,8.0418184564285813,5.5751181090443156,6.227099061405478,5.8315987672046949,6.0026388337032737,4.5304702266679913,3.0522886810713099,2.9361793977615598,2.1104337710507202,4.1786763017823096,4.0167677131137198,4.7665111304238401,3.5526603352176398,4.7314378513196198,7.0345831301830497,12.7706814319335,"-","-","-","-"]
[]
[null,"Disponibilidad equipo térmico anual peninsular (%)",2001,2002,2003,2004,2005,2006,2007,2008,2009,2010,2011,2012,2013,2014,2015,2016,2017,2018,2019,2020,2021,2022,2023,2024]
[null,"Nuclear",94.804731917459193,93.772744329566649,92.137817966413095,93.654718366781225,85.197783756216907,90.705200483181827,83.705432905956656,88.504922001200413,80.142538872838671,92.157935647242667,86.085167433359643,90.606182801157047,84.013833292147936,84.177073976172508,84.570240710134769,85.974291065499671,86.596193783294524,86.793593085449672,91.484509910970047,88.008047978179604,"-","-","-","-"]
[null,"Carbón",92.225886667085447,90.920989275007159,92.44434900448708,90.490746902911638,91.033231163447155,91.481940599473376,87.807724662231323,78.955053918524285,86.433332411516673,91.18518921811588,92.661321605569015,90.949906469295144,90.324699597008362,87.579713245237372,89.847678438484067,86.617232990814031,88.958613428968661,91.953515552113274,89.031586023270947,86.481535269042894,"-","-","-","-"]
[null,"Fuel + Gas",85.795339900955298,73.352700157236484,82.271148366505301,82.33281057987476,75.884679759466309,75.761039405420263,74.418918721123745,81.085250040813364,79.670181065422028,85.507210470693479,59.24916523682608,92.732675928723879,94.385050328845367,31.925514832211107,"-","-","-","-","-","-","-","-","-","-"]
[null,"Ciclo combinado","-",94.413333143239896,93.07412635711826,95.234382783748927,89.397123150373034,93.68786361796495,92.339178690244125,92.535686629865566,91.982100747486271,91.604403366278518,91.074055230791686,92.101706673961999,95.010141283098875,91.664018875214325,90.06095893019392,90.293268073519897,92.258962397620692,93.036424826873628,87.564051153894098,82.044629513873616,"-","-","-","-"]
[null,"Disponibilidad",91.139383781369986,87.234075145070094,90.052760653665501,90.457506879963461,86.524398919512493,89.568029160293847,87.06171656059864,87.373017702900214,87.49977308978464,91.288263301920125,89.552381683995662,91.572682518793783,91.950819622214922,88.668090549781425,88.612722674890691,88.6749158844611,90.498026512419969,91.71568527009677,88.577851783043201,84.082355643084185,"-","-","-","-"]
[]
[null,"Horas de funcionamiento del equipo térmico anual peninsular (número de horas)",2001,2002,2003,2004,2005,2006,2007,2008,2009,2010,2011,2012,2013,2014,2015,2016,2017,2018,2019,2020,2021,2022,2023,2024]
[null,"Nuclear",8298.4420750965019,8214.2941032739363,8037.3097536086671,8222.1903835892572,7548.1190781437581,7922.3028845508998,7304.7163641192228,7782.4882410221599,7024.3376410688379,8106.0209996314197,7571.6462817164038,7955.4833187632221,7361.4536142239494,7392.2034590588664,7429.8174294626142,7563.8146470555603,7997.1831975372661,7621.6579737512457,8040.4686264013426,3866.5567217297598,"-","-","-","-"]
[null,"Carbón",6805.11987289852,7708.7502863947557,7316.1613955028488,7476.3968436188761,7744.7874327678564,6913.3020504746319,7368.6196442139844,5175.3852409638548,4079.2206394384862,2769.2204948523754,4777.6609972269734,5787.0186881752297,4372.9408691685585,4895.2051323937094,5890.5487370104383,4649.3013537307033,5455.7997623709216,4702.5488423313791,1672.6178266012262,652.09872436937405,"-","-","-","-"]
[null,"Fuel + Gas",2708.7846386623446,2955.1210573333979,2026.7610784219451,1925.9039709360259,2525.4801583065409,1898.3490938661714,972.39715479246991,1081.3076682001633,1049.4217694536937,1191.7194503890823,0,0,0,0,"-","-","-","-","-","-","-","-","-","-"]
[null,"Ciclo combinado","-",2899.2074999904562,5074.8553962644874,4687.6361398051131,5147.0520464261863,5546.3043250144401,4644.7663694399389,5736.7801967987443,4743.5570236803251,3985.9352513526192,3256.6525516292918,2491.7429371272947,1733.6896372452625,1695.8760355158847,2067.0170913482634,2065.817976479605,2358.2104229205811,1920.068765150522,3311.7025701636594,1244.6110742427488,"-","-","-","-"]
[null,"Horas de funcionamiento",6069.810400697259,6203.3981735047964,5993.3104696267119,5863.0239637763962,5957.5740273879246,5781.2518569596768,5398.653662374445,5501.9150234269773,4728.8003333928782,4244.6584326626989,4313.9395085666565,4211.7745504029217,3331.9897232067528,3437.9446654847352,3942.7605276876434,3641.5629151591584,4032.9930366840886,3549.1652254647311,3747.7548943964553,1567.4225391375799,"-","-","-","-"]

{"sheet":"Mozart Reports","index":12,"n_rows":2,"n_cols":2,"rows_kept":2,"cut":false,"hidden":true,"merged":[]}
[1,"b59690c4c4f0483f9022b9a0e20b43aa"]
["<mi app=\"e\" ver=\"22\"><rptloc guid=\"aa722ef237a449dba13f390ab7a687ea\" rank=\"0\" ds=\"1\"><ri hasPG=\"0\" name=\"Producción nominal e indisponibilidades por UFI Mensual\" id=\"8051CC5848F9A091C4BE638E2050FB10\" path=\"Profiles\\Jose Antonio Rodriguez Ortiz (RODORTJO)\\Mis Informes\\Producción nominal e indisponibilidades por UFI Mensual\" cf=\"0\" prompt=\"1\" ve=\"0\" vm=\"0\" flashpth=\"d:\\Usuarios\\RODORTJO\\AppData\\Local\\Temp\\1\\\" fimagepth=\"d:\\Usuarios\\RODORTJO\\AppData\\Local\\Temp\\1\\\" swfn=\"DashboardViewer.swf\" fvars=\"\" dvis=\"\"><ans><pan pk=\"86BA8826468B4BC44041DF8DC3E31322@0@10\" aid=\"A4C0881342DFAEA4495A3C840552915F\" /><pan pk=\"9060EF18485322A500D2E1B585344256@0@10\" aid=\"D476281211EAAAF71FB80080EF651250\" /><pan pk=\"B7C3BF0D4428274429E8B8B9E552B212@0@10\" aid=\"\" /></ans><ci ps=\"BI\" srv=\"apcpr64b\" prj=\"BDEbi\" prjid=\"D066E1C611E6257C10D00080EF253B44\" li=\"RODORTJO\" am=\"s\" /><lu ut=\"06/10/2020 08:55:42\" si=\"2.000000013fd19901676884ac73837200924128255e417131cf0284b54ed638b8dd5d3776825f8fd72ac6f7f2629a61db9cd0f3fbe08dbd34d9be23abb62297b067ed685f8f31981b117b32a46d82ff84e653172b3cbb57a3db7d549fe8633a594e08be2a006c0c8465540bdf38fba58d5168f7ba76215a3fae494365a32585b52511.3082.0.1.Europe/Madrid.upriv*_1*_pidn2*_3*_session*-lat*_1.000000014b0c53fbbc8bf3a2ec311f329db143fb93bcab4f60bb8a2e764168e08298be20756090e77e0eaf24399b6e4060f44c48f4e46c8b.0000000196bf089944457c678d76fdfe201d54f7bf8b3a33f0724d2c7e669cd077fb2005a6ab490abd6d82107c59d7cf0b39ffc438709e0d.0.1.1.BDEbi.D066E1C611E6257C10D00080EF253B44.0-3082.1.1_-0.1.0_-3082.1.1_5.5.0.*0.0000000109fad14318f31e9e440b3f6c4ebb1e13c911585abd8168832dfabb524929c113aa1794d5.0.10*.25*.15*.214.23.10*.4*.0400*.0074J.e.00000001433e2076c35e85c5aca7f12e36707577c911585a572ec9568188534ba07493ec423c7676.0\" msgID=\"7843C04111EAAAF7312E0080EF259352\" /></ri><do pa=\"6\" cfmt=\"0\" fmt=\"1\" saf=\"0\" hd=\"0\" afg=\"1\" rafg=\"1\" arh=\"1\" gosdo=\"0\" cwd=\"1\" ab=\"0\" af=\"1\" om=\"0\" ag=\"0\" lck=\"0\" ppt=\"3\" wpt=\"3\" dai=\"0\" rscd=\"1\" rsrgb=\"1\" rsrl=\"1\" cit=\"2\" c2d=\"1\" cdf=\"0\" cdt=\"0\" dtlk=\"1\" gaf=\"17\" fqg=\"0\" xqg=\"0\" don=\"0\" dcom=\"0\" oaw=\"0\" tws=\"0\" ssm=\"1\" ssn=\"MSTRStyle.Todos\" glo=\"11101\" pgsel=\"4\" phdr=\"1\" rdc=\"0\" adt=\"0\" rsoox=\"0\" eco=\"1\" ecfw=\"400\" ecfh=\"300\" ecfsu=\"1\" ecwr=\"100\" echr=\"100\" eclar=\"1\" ecrups=\"1\"><details dbit=\"11169976358211\" dsel=\"239\" /></do><excel><epo ews=\"BDE\" ece=\"A1\" enr=\"MSTR.Producción_nominal_e_indisponibilidades_por_UFI_Mensual\" ptn=\"\" qtn=\"\" rows=\"18\" cols=\"126\" /><esdo ews=\"\" ece=\"\" ptn=\"\" /></excel><pgs><pg rows=\"15\" cols=\"124\" nrr=\"210\" nrc=\"1641\"><pg /><bls><bl sr=\"1\" sc=\"1\" rfetch=\"15\" cfetch=\"124\" posid=\"1\" darows=\"0\" dacols=\"1\"><excel><epo ews=\"BDE\" ece=\"A1\" enr=\"MSTR.Producción_nominal_e_indisponibilidades_por_UFI_Mensual\" ptn=\"\" qtn=\"\" rows=\"18\" cols=\"126\" /><esdo ews=\"\" ece=\"\" ptn=\"\" /></excel><gridRng><sect id=\"TITLE_AREA\" rngprop=\"1:1:3:2\" /><sect id=\"ROWHEADERS_AREA\" rngprop=\"4:1:15:2\" /><sect id=\"COLUMNHEADERS_AREA\" rngprop=\"1:3:3:124\" /><sect id=\"DATA_AREA\" rngprop=\"4:3:15:124\" /></gridRng><shapes /></bl></bls></pg></pgs></rptloc></mi>"]

{"sheet":"Año","index":13,"n_rows":32,"n_cols":26,"rows_kept":32,"cut":false,"hidden":true,"merged":[]}
[null,null,null,null,null,null,null,null,null,null,null,null,null,null,null,null,null,null,null,null,null,null,null,1,null,1]
["Permanente ",1990,"1990-1997","2001-2008",null,null,null,null,null,null,null,null,null,"Indisponibilidad permanente",null,"Mensual"]
["Prevista",1991,"1998-2005","2009-2016",null,null,null,null,null,null,null,null,null,"Indisponibilidad prevista",null,"Anual"]
["No prevista",1992,"2006-2013","2017-2024",null,null,null,null,null,null,null,null,null,"Indisponibilidad no prevista"]
[null,1993,"2014-2021",null,null,null,null,null,null,null,null,null,null,"Disponibilidad"]
[null,1994,null,null,null,null,null,null,null,null,null,null,null,"Horas de funcionamiento"]
[null,1995]
[null,1996]
[null,1997]
[null,1998]
[null,1999]
[null,2000]
[null,2001]
[null,2002]
[null,2003]
[null,2004]
[null,2005]
[null,2006]
[null,2007]
[null,2008]
[null,2009]
[null,2010]
[null,2011]
[null,2012]
[null,2013]
[null,2014]
[null,2015]
[null,2016]
[null,2017]
[null,2018]
[null,2019]
[null,2020]