{"text_format":"1","workbook":"xlsx","n_sheets":15,"sheets":["AVISO LEGAL","Balance nacional mensual","Balance nacional anual","Balance Peninsular mensual","Balance Peninsular anual","Balance Baleares mensual","Balance Baleares anual","Balance Canarias mensual","Balance Canarias anual","Balance Ceuta mensual","Balance Ceuta anual","Balance Melilla mensual","Balance Melilla anual","Balance","Año"],"not_rendered":{"charts":0,"images":1,"macros":1,"external_links":0,"defined_names":13,"comments":0,"pivot_tables":0},"unopened":[],"bounds":{"document_bytes":16777216,"sheet_cells":100000,"rows_first":2000,"rows_last":500,"rows_between":2000,"halvings":0,"cell_chars":16384,"cell_head_chars":4096},"cells_cut":0,"cells_raw":0,"read":"whole","date_system":"1900"}

{"sheet":"AVISO LEGAL","index":0,"n_rows":23,"n_cols":10,"rows_kept":23,"cut":false,"hidden":false,"merged":[]}
[]
[null,null,null,null,null,null,null,"Fecha de actualización:",null,"2018-04-03"]
[]
[]
[]
[]
[]
[]
[]
[]
[]
[]
[]
[]
[]
[]
[]
[]
[]
[]
[]
[]
[null,null,null,null,null,null,null,null,null,"www.ree.es"]

{"sheet":"Balance nacional mensual","index":1,"n_rows":105,"n_cols":15,"rows_kept":105,"cut":false,"hidden":false,"merged":[[39,1,39,14],[37,1,37,14],[36,1,36,11],[35,1,35,14],[5,2,5,9],[32,1,32,14],[33,1,33,14],[34,1,34,14],[31,1,31,9],[31,11,31,13]]}
[" mensual"]
[]
[]
[null,null,null,null,null,null,null,null,null,null,null,null,"Sistema eléctrico"]
[null,null,null,null,null,null,null,null,null,null,null,null,"Horizonte temporal"]
[null,null,null,null,null,null,null,null,null,null,null,null,"Periodo"]
[]
[null,null,"Ene.","Feb.","Mar.","Abr.","May.","Jun.","Jul.","Ago.","Sep.","Oct.","Nov.","Dic.",{"$f":"OFFSET(Año!C19,($A$104-1),0)","v":2018}]
[]
[null,"Hidráulica",{"$f":"OFFSET(Balance!C85,0,($A$104-1)*12)","v":2195.4199847860004},{"$f":"OFFSET(Balance!D85,0,($A$104-1)*12)","v":2386.6504253499998},{"$f":"OFFSET(Balance!E85,0,($A$104-1)*12)","v":4379.9547000000002},{"$f":"OFFSET(Balance!F85,0,($A$104-1)*12)","v":"-"},{"$f":"OFFSET(Balance!G85,0,($A$104-1)*12)","v":"-"},{"$f":"OFFSET(Balance!H85,0,($A$104-1)*12)","v":"-"},{"$f":"OFFSET(Balance!I85,0,($A$104-1)*12)","v":"-"},{"$f":"OFFSET(Balance!J85,0,($A$104-1)*12)","v":"-"},{"$f":"OFFSET(Balance!K85,0,($A$104-1)*12)","v":"-"},{"$f":"OFFSET(Balance!L85,0,($A$104-1)*12)","v":"-"},{"$f":"OFFSET(Balance!M85,0,($A$104-1)*12)","v":"-"},{"$f":"OFFSET(Balance!N85,0,($A$104-1)*12)","v":"-"},{"$f":"IF(SUM(C10:N10)=0,\"-\",SUM(C10:N10))","v":8962.0251101360009}]
[null,"Turbinación bombeo",{"$f":"OFFSET(Balance!C86,0,($A$104-1)*12)","v":273.43523521399999},{"$f":"OFFSET(Balance!D86,0,($A$104-1)*12)","v":180.62302364999999},{"$f":"OFFSET(Balance!E86,0,($A$104-1)*12)","v":283.77729999999997},{"$f":"OFFSET(Balance!F86,0,($A$104-1)*12)","v":"-"},{"$f":"OFFSET(Balance!G86,0,($A$104-1)*12)","v":"-"},{"$f":"OFFSET(Balance!H86,0,($A$104-1)*12)","v":"-"},{"$f":"OFFSET(Balance!I86,0,($A$104-1)*12)","v":"-"},{"$f":"OFFSET(Balance!J86,0,($A$104-1)*12)","v":"-"},{"$f":"OFFSET(Balance!K86,0,($A$104-1)*12)","v":"-"},{"$f":"OFFSET(Balance!L86,0,($A$104-1)*12)","v":"-"},{"$f":"OFFSET(Balance!M86,0,($A$104-1)*12)","v":"-"},{"$f":"OFFSET(Balance!N86,0,($A$104-1)*12)","v":"-"},{"$f":"IF(SUM(C11:N11)=0,\"-\",SUM(C11:N11))","v":737.83555886399995}]
[null,"Nuclear",{"$f":"OFFSET(Balance!C87,0,($A$104-1)*12)","v":5098.7070000000003},{"$f":"OFFSET(Balance!D87,0,($A$104-1)*12)","v":4594.5630000000001},{"$f":"OFFSET(Balance!E87,0,($A$104-1)*12)","v":4486.4690999999993},{"$f":"OFFSET(Balance!F87,0,($A$104-1)*12)","v":"-"},{"$f":"OFFSET(Balance!G87,0,($A$104-1)*12)","v":"-"},{"$f":"OFFSET(Balance!H87,0,($A$104-1)*12)","v":"-"},{"$f":"OFFSET(Balance!I87,0,($A$104-1)*12)","v":"-"},{"$f":"OFFSET(Balance!J87,0,($A$104-1)*12)","v":"-"},{"$f":"OFFSET(Balance!K87,0,($A$104-1)*12)","v":"-"},{"$f":"OFFSET(Balance!L87,0,($A$104-1)*12)","v":"-"},{"$f":"OFFSET(Balance!M87,0,($A$104-1)*12)","v":"-"},{"$f":"OFFSET(Balance!N87,0,($A$104-1)*12)","v":"-"},14179.739099999999]
[null,"Carbón",{"$f":"OFFSET(Balance!C88,0,($A$104-1)*12)","v":3240.0929860000001},{"$f":"OFFSET(Balance!D88,0,($A$104-1)*12)","v":3693.5238909999998},{"$f":"OFFSET(Balance!E88,0,($A$104-1)*12)","v":1520.622408},{"$f":"OFFSET(Balance!F88,0,($A$104-1)*12)","v":"-"},{"$f":"OFFSET(Balance!G88,0,($A$104-1)*12)","v":"-"},{"$f":"OFFSET(Balance!H88,0,($A$104-1)*12)","v":"-"},{"$f":"OFFSET(Balance!I88,0,($A$104-1)*12)","v":"-"},{"$f":"OFFSET(Balance!J88,0,($A$104-1)*12)","v":"-"},{"$f":"OFFSET(Balance!K88,0,($A$104-1)*12)","v":"-"},{"$f":"OFFSET(Balance!L88,0,($A$104-1)*12)","v":"-"},{"$f":"OFFSET(Balance!M88,0,($A$104-1)*12)","v":"-"},{"$f":"OFFSET(Balance!N88,0,($A$104-1)*12)","v":"-"},8454.2392849999997]
[null,"Fuel + Gas",{"$f":"OFFSET(Balance!C89,0,($A$104-1)*12)","v":573.4582620000001},{"$f":"OFFSET(Balance!D89,0,($A$104-1)*12)","v":533.37623299999996},{"$f":"OFFSET(Balance!E89,0,($A$104-1)*12)","v":528.17185099999995},{"$f":"OFFSET(Balance!F89,0,($A$104-1)*12)","v":"-"},{"$f":"OFFSET(Balance!G89,0,($A$104-1)*12)","v":"-"},{"$f":"OFFSET(Balance!H89,0,($A$104-1)*12)","v":"-"},{"$f":"OFFSET(Balance!I89,0,($A$104-1)*12)","v":"-"},{"$f":"OFFSET(Balance!J89,0,($A$104-1)*12)","v":"-"},{"$f":"OFFSET(Balance!K89,0,($A$104-1)*12)","v":"-"},{"$f":"OFFSET(Balance!L89,0,($A$104-1)*12)","v":"-"},{"$f":"OFFSET(Balance!M89,0,($A$104-1)*12)","v":"-"},{"$f":"OFFSET(Balance!N89,0,($A$104-1)*12)","v":"-"},1635.0063460000001]
[null,"Ciclo combinado (2)",{"$f":"OFFSET(Balance!C90,0,($A$104-1)*12)","v":2544.337974},{"$f":"OFFSET(Balance!D90,0,($A$104-1)*12)","v":2238.1759200000001},{"$f":"OFFSET(Balance!E90,0,($A$104-1)*12)","v":1524.5291400000001},{"$f":"OFFSET(Balance!F90,0,($A$104-1)*12)","v":"-"},{"$f":"OFFSET(Balance!G90,0,($A$104-1)*12)","v":"-"},{"$f":"OFFSET(Balance!H90,0,($A$104-1)*12)","v":"-"},{"$f":"OFFSET(Balance!I90,0,($A$104-1)*12)","v":"-"},{"$f":"OFFSET(Balance!J90,0,($A$104-1)*12)","v":"-"},{"$f":"OFFSET(Balance!K90,0,($A$104-1)*12)","v":"-"},{"$f":"OFFSET(Balance!L90,0,($A$104-1)*12)","v":"-"},{"$f":"OFFSET(Balance!M90,0,($A$104-1)*12)","v":"-"},{"$f":"OFFSET(Balance!N90,0,($A$104-1)*12)","v":"-"},6307.0430340000003]
[null,"Régimen ordinario",{"$f":"OFFSET(Balance!C91,0,($A$104-1)*12)","v":"-"},{"$f":"OFFSET(Balance!D91,0,($A$104-1)*12)","v":"-"},{"$f":"OFFSET(Balance!E91,0,($A$104-1)*12)","v":"-"},{"$f":"OFFSET(Balance!F91,0,($A$104-1)*12)","v":"-"},{"$f":"OFFSET(Balance!G91,0,($A$104-1)*12)","v":"-"},{"$f":"OFFSET(Balance!H91,0,($A$104-1)*12)","v":"-"},{"$f":"OFFSET(Balance!I91,0,($A$104-1)*12)","v":"-"},{"$f":"OFFSET(Balance!J91,0,($A$104-1)*12)","v":"-"},{"$f":"OFFSET(Balance!K91,0,($A$104-1)*12)","v":"-"},{"$f":"OFFSET(Balance!L91,0,($A$104-1)*12)","v":"-"},{"$f":"OFFSET(Balance!M91,0,($A$104-1)*12)","v":"-"},{"$f":"OFFSET(Balance!N91,0,($A$104-1)*12)","v":"-"},"-"]
[]
[null,"Hidroeólica",{"$f":"OFFSET(Balance!C92,0,($A$104-1)*12)","v":2.2628509999999999},{"$f":"OFFSET(Balance!D92,0,($A$104-1)*12)","v":1.7680279999999999},{"$f":"OFFSET(Balance!E92,0,($A$104-1)*12)","v":1.685079},{"$f":"OFFSET(Balance!F92,0,($A$104-1)*12)","v":"-"},{"$f":"OFFSET(Balance!G92,0,($A$104-1)*12)","v":"-"},{"$f":"OFFSET(Balance!H92,0,($A$104-1)*12)","v":"-"},{"$f":"OFFSET(Balance!I92,0,($A$104-1)*12)","v":"-"},{"$f":"OFFSET(Balance!J92,0,($A$104-1)*12)","v":"-"},{"$f":"OFFSET(Balance!K92,0,($A$104-1)*12)","v":"-"},{"$f":"OFFSET(Balance!L92,0,($A$104-1)*12)","v":"-"},{"$f":"OFFSET(Balance!M92,0,($A$104-1)*12)","v":"-"},{"$f":"OFFSET(Balance!N92,0,($A$104-1)*12)","v":"-"},{"$f":"IF(SUM(C18:N18)=0,\"-\",SUM(C18:N18))","v":5.7159579999999997}]
[null,"Resto hidráulica (3)",{"$f":"OFFSET(Balance!C93,0,($A$104-1)*12)","v":"-"},{"$f":"OFFSET(Balance!D93,0,($A$104-1)*12)","v":"-"},{"$f":"OFFSET(Balance!E93,0,($A$104-1)*12)","v":"-"},{"$f":"OFFSET(Balance!F93,0,($A$104-1)*12)","v":"-"},{"$f":"OFFSET(Balance!G93,0,($A$104-1)*12)","v":"-"},{"$f":"OFFSET(Balance!H93,0,($A$104-1)*12)","v":"-"},{"$f":"OFFSET(Balance!I93,0,($A$104-1)*12)","v":"-"},{"$f":"OFFSET(Balance!J93,0,($A$104-1)*12)","v":"-"},{"$f":"OFFSET(Balance!K93,0,($A$104-1)*12)","v":"-"},{"$f":"OFFSET(Balance!L93,0,($A$104-1)*12)","v":"-"},{"$f":"OFFSET(Balance!M93,0,($A$104-1)*12)","v":"-"},{"$f":"OFFSET(Balance!N93,0,($A$104-1)*12)","v":"-"},"-"]
[null,"Eólica",{"$f":"OFFSET(Balance!C94,0,($A$104-1)*12)","v":5333.6570000000002},{"$f":"OFFSET(Balance!D94,0,($A$104-1)*12)","v":4669.4970000000003},{"$f":"OFFSET(Balance!E94,0,($A$104-1)*12)","v":7744.2150359999996},{"$f":"OFFSET(Balance!F94,0,($A$104-1)*12)","v":"-"},{"$f":"OFFSET(Balance!G94,0,($A$104-1)*12)","v":"-"},{"$f":"OFFSET(Balance!H94,0,($A$104-1)*12)","v":"-"},{"$f":"OFFSET(Balance!I94,0,($A$104-1)*12)","v":"-"},{"$f":"OFFSET(Balance!J94,0,($A$104-1)*12)","v":"-"},{"$f":"OFFSET(Balance!K94,0,($A$104-1)*12)","v":"-"},{"$f":"OFFSET(Balance!L94,0,($A$104-1)*12)","v":"-"},{"$f":"OFFSET(Balance!M94,0,($A$104-1)*12)","v":"-"},{"$f":"OFFSET(Balance!N94,0,($A$104-1)*12)","v":"-"},17747.369036]
[null,"Solar fotovoltaica",{"$f":"OFFSET(Balance!C95,0,($A$104-1)*12)","v":442.29599999999999},{"$f":"OFFSET(Balance!D95,0,($A$104-1)*12)","v":508.14800000000002},{"$f":"OFFSET(Balance!E95,0,($A$104-1)*12)","v":587.50707},{"$f":"OFFSET(Balance!F95,0,($A$104-1)*12)","v":"-"},{"$f":"OFFSET(Balance!G95,0,($A$104-1)*12)","v":"-"},{"$f":"OFFSET(Balance!H95,0,($A$104-1)*12)","v":"-"},{"$f":"OFFSET(Balance!I95,0,($A$104-1)*12)","v":"-"},{"$f":"OFFSET(Balance!J95,0,($A$104-1)*12)","v":"-"},{"$f":"OFFSET(Balance!K95,0,($A$104-1)*12)","v":"-"},{"$f":"OFFSET(Balance!L95,0,($A$104-1)*12)","v":"-"},{"$f":"OFFSET(Balance!M95,0,($A$104-1)*12)","v":"-"},{"$f":"OFFSET(Balance!N95,0,($A$104-1)*12)","v":"-"},1537.9510700000001]
[null,"Solar térmica",{"$f":"OFFSET(Balance!C96,0,($A$104-1)*12)","v":112.38800000000001},{"$f":"OFFSET(Balance!D96,0,($A$104-1)*12)","v":229.80799999999999},{"$f":"OFFSET(Balance!E96,0,($A$104-1)*12)","v":227.90559999999999},{"$f":"OFFSET(Balance!F96,0,($A$104-1)*12)","v":"-"},{"$f":"OFFSET(Balance!G96,0,($A$104-1)*12)","v":"-"},{"$f":"OFFSET(Balance!H96,0,($A$104-1)*12)","v":"-"},{"$f":"OFFSET(Balance!I96,0,($A$104-1)*12)","v":"-"},{"$f":"OFFSET(Balance!J96,0,($A$104-1)*12)","v":"-"},{"$f":"OFFSET(Balance!K96,0,($A$104-1)*12)","v":"-"},{"$f":"OFFSET(Balance!L96,0,($A$104-1)*12)","v":"-"},{"$f":"OFFSET(Balance!M96,0,($A$104-1)*12)","v":"-"},{"$f":"OFFSET(Balance!N96,0,($A$104-1)*12)","v":"-"},570.10159999999996]
[null,"Otras renovables",{"$f":"OFFSET(Balance!C97,0,($A$104-1)*12)","v":297.47300000000001},{"$f":"OFFSET(Balance!D97,0,($A$104-1)*12)","v":302.44399999999996},{"$f":"OFFSET(Balance!E97,0,($A$104-1)*12)","v":279.40366999999998},{"$f":"OFFSET(Balance!F97,0,($A$104-1)*12)","v":"-"},{"$f":"OFFSET(Balance!G97,0,($A$104-1)*12)","v":"-"},{"$f":"OFFSET(Balance!H97,0,($A$104-1)*12)","v":"-"},{"$f":"OFFSET(Balance!I97,0,($A$104-1)*12)","v":"-"},{"$f":"OFFSET(Balance!J97,0,($A$104-1)*12)","v":"-"},{"$f":"OFFSET(Balance!K97,0,($A$104-1)*12)","v":"-"},{"$f":"OFFSET(Balance!L97,0,($A$104-1)*12)","v":"-"},{"$f":"OFFSET(Balance!M97,0,($A$104-1)*12)","v":"-"},{"$f":"OFFSET(Balance!N97,0,($A$104-1)*12)","v":"-"},879.32066999999984]
[null,"Cogeneración",{"$f":"OFFSET(Balance!C98,0,($A$104-1)*12)","v":2477.9189999999999},{"$f":"OFFSET(Balance!D98,0,($A$104-1)*12)","v":2246.5069999999996},{"$f":"OFFSET(Balance!E98,0,($A$104-1)*12)","v":2501.4601959999995},{"$f":"OFFSET(Balance!F98,0,($A$104-1)*12)","v":"-"},{"$f":"OFFSET(Balance!G98,0,($A$104-1)*12)","v":"-"},{"$f":"OFFSET(Balance!H98,0,($A$104-1)*12)","v":"-"},{"$f":"OFFSET(Balance!I98,0,($A$104-1)*12)","v":"-"},{"$f":"OFFSET(Balance!J98,0,($A$104-1)*12)","v":"-"},{"$f":"OFFSET(Balance!K98,0,($A$104-1)*12)","v":"-"},{"$f":"OFFSET(Balance!L98,0,($A$104-1)*12)","v":"-"},{"$f":"OFFSET(Balance!M98,0,($A$104-1)*12)","v":"-"},{"$f":"OFFSET(Balance!N98,0,($A$104-1)*12)","v":"-"},7225.8861959999995]
[null,"Residuos no renovables",{"$f":"OFFSET(Balance!C99,0,($A$104-1)*12)","v":234.57399999999998},{"$f":"OFFSET(Balance!D99,0,($A$104-1)*12)","v":206.94350000000003},{"$f":"OFFSET(Balance!E99,0,($A$104-1)*12)","v":229.77460000000002},{"$f":"OFFSET(Balance!F99,0,($A$104-1)*12)","v":"-"},{"$f":"OFFSET(Balance!G99,0,($A$104-1)*12)","v":"-"},{"$f":"OFFSET(Balance!H99,0,($A$104-1)*12)","v":"-"},{"$f":"OFFSET(Balance!I99,0,($A$104-1)*12)","v":"-"},{"$f":"OFFSET(Balance!J99,0,($A$104-1)*12)","v":"-"},{"$f":"OFFSET(Balance!K99,0,($A$104-1)*12)","v":"-"},{"$f":"OFFSET(Balance!L99,0,($A$104-1)*12)","v":"-"},{"$f":"OFFSET(Balance!M99,0,($A$104-1)*12)","v":"-"},{"$f":"OFFSET(Balance!N99,0,($A$104-1)*12)","v":"-"},671.29210000000012]
[null,"Residuos renovables",{"$f":"OFFSET(Balance!C100,0,($A$104-1)*12)","v":77.265999999999991},{"$f":"OFFSET(Balance!D100,0,($A$104-1)*12)","v":67.379500000000007},{"$f":"OFFSET(Balance!E100,0,($A$104-1)*12)","v":78.719500000000011},{"$f":"OFFSET(Balance!F100,0,($A$104-1)*12)","v":"-"},{"$f":"OFFSET(Balance!G100,0,($A$104-1)*12)","v":"-"},{"$f":"OFFSET(Balance!H100,0,($A$104-1)*12)","v":"-"},{"$f":"OFFSET(Balance!I100,0,($A$104-1)*12)","v":"-"},{"$f":"OFFSET(Balance!J100,0,($A$104-1)*12)","v":"-"},{"$f":"OFFSET(Balance!K100,0,($A$104-1)*12)","v":"-"},{"$f":"OFFSET(Balance!L100,0,($A$104-1)*12)","v":"-"},{"$f":"OFFSET(Balance!M100,0,($A$104-1)*12)","v":"-"},{"$f":"OFFSET(Balance!N100,0,($A$104-1)*12)","v":"-"},{"$f":"IF(SUM(C26:N26)=0,\"-\",SUM(C26:N26))","v":223.36500000000001}]
[null,"Régimen especial",{"$f":"OFFSET(Balance!C101,0,($A$104-1)*12)","v":"-"},{"$f":"OFFSET(Balance!D101,0,($A$104-1)*12)","v":"-"},{"$f":"OFFSET(Balance!E101,0,($A$104-1)*12)","v":"-"},{"$f":"OFFSET(Balance!F101,0,($A$104-1)*12)","v":"-"},{"$f":"OFFSET(Balance!G101,0,($A$104-1)*12)","v":"-"},{"$f":"OFFSET(Balance!H101,0,($A$104-1)*12)","v":"-"},{"$f":"OFFSET(Balance!I101,0,($A$104-1)*12)","v":"-"},{"$f":"OFFSET(Balance!J101,0,($A$104-1)*12)","v":"-"},{"$f":"OFFSET(Balance!K101,0,($A$104-1)*12)","v":"-"},{"$f":"OFFSET(Balance!L101,0,($A$104-1)*12)","v":"-"},{"$f":"OFFSET(Balance!M101,0,($A$104-1)*12)","v":"-"},{"$f":"OFFSET(Balance!N101,0,($A$104-1)*12)","v":"-"},"-"]
[null,"Generación",{"$f":"OFFSET(Balance!C102,0,($A$104-1)*12)","v":22903.287292999998},{"$f":"OFFSET(Balance!D102,0,($A$104-1)*12)","v":21859.407520999997},{"$f":"OFFSET(Balance!E102,0,($A$104-1)*12)","v":24374.195249999993},{"$f":"OFFSET(Balance!F102,0,($A$104-1)*12)","v":"-"},{"$f":"OFFSET(Balance!G102,0,($A$104-1)*12)","v":"-"},{"$f":"OFFSET(Balance!H102,0,($A$104-1)*12)","v":"-"},{"$f":"OFFSET(Balance!I102,0,($A$104-1)*12)","v":"-"},{"$f":"OFFSET(Balance!J102,0,($A$104-1)*12)","v":"-"},{"$f":"OFFSET(Balance!K102,0,($A$104-1)*12)","v":"-"},{"$f":"OFFSET(Balance!L102,0,($A$104-1)*12)","v":"-"},{"$f":"OFFSET(Balance!M102,0,($A$104-1)*12)","v":"-"},{"$f":"OFFSET(Balance!N102,0,($A$104-1)*12)","v":"-"},{"$f":"IF(SUM(C28:N28)=0,\"-\",SUM(C28:N28))","v":69136.890063999992}]
[null,"Consumos en bombeo",{"$f":"OFFSET(Balance!C103,0,($A$104-1)*12)","v":-390.73397899999998},{"$f":"OFFSET(Balance!D103,0,($A$104-1)*12)","v":-253.25366200000002},{"$f":"OFFSET(Balance!E103,0,($A$104-1)*12)","v":-728.75189999999998},{"$f":"OFFSET(Balance!F103,0,($A$104-1)*12)","v":"-"},{"$f":"OFFSET(Balance!G103,0,($A$104-1)*12)","v":"-"},{"$f":"OFFSET(Balance!H103,0,($A$104-1)*12)","v":"-"},{"$f":"OFFSET(Balance!I103,0,($A$104-1)*12)","v":"-"},{"$f":"OFFSET(Balance!J103,0,($A$104-1)*12)","v":"-"},{"$f":"OFFSET(Balance!K103,0,($A$104-1)*12)","v":"-"},{"$f":"OFFSET(Balance!L103,0,($A$104-1)*12)","v":"-"},{"$f":"OFFSET(Balance!M103,0,($A$104-1)*12)","v":"-"},{"$f":"OFFSET(Balance!N103,0,($A$104-1)*12)","v":"-"},-1372.7395409999999]
[null,"Saldo intercambios internacionales (4)",{"$f":"OFFSET(Balance!C104,0,($A$104-1)*12)","v":1340.296642},{"$f":"OFFSET(Balance!D104,0,($A$104-1)*12)","v":857.10299299999997},{"$f":"OFFSET(Balance!E104,0,($A$104-1)*12)","v":-292.80159999999995},{"$f":"OFFSET(Balance!F104,0,($A$104-1)*12)","v":"-"},{"$f":"OFFSET(Balance!G104,0,($A$104-1)*12)","v":"-"},{"$f":"OFFSET(Balance!H104,0,($A$104-1)*12)","v":"-"},{"$f":"OFFSET(Balance!I104,0,($A$104-1)*12)","v":"-"},{"$f":"OFFSET(Balance!J104,0,($A$104-1)*12)","v":"-"},{"$f":"OFFSET(Balance!K104,0,($A$104-1)*12)","v":"-"},{"$f":"OFFSET(Balance!L104,0,($A$104-1)*12)","v":"-"},{"$f":"OFFSET(Balance!M104,0,($A$104-1)*12)","v":"-"},{"$f":"OFFSET(Balance!N104,0,($A$104-1)*12)","v":"-"},1904.5980349999998]
[null,"Demanda transporte (b.c.)",{"$f":"OFFSET(Balance!C105,0,($A$104-1)*12)","v":23852.849955999998},{"$f":"OFFSET(Balance!D105,0,($A$104-1)*12)","v":22463.256851999999},{"$f":"OFFSET(Balance!E105,0,($A$104-1)*12)","v":23352.641749999995},{"$f":"OFFSET(Balance!F105,0,($A$104-1)*12)","v":"-"},{"$f":"OFFSET(Balance!G105,0,($A$104-1)*12)","v":"-"},{"$f":"OFFSET(Balance!H105,0,($A$104-1)*12)","v":"-"},{"$f":"OFFSET(Balance!I105,0,($A$104-1)*12)","v":"-"},{"$f":"OFFSET(Balance!J105,0,($A$104-1)*12)","v":"-"},{"$f":"OFFSET(Balance!K105,0,($A$104-1)*12)","v":"-"},{"$f":"OFFSET(Balance!L105,0,($A$104-1)*12)","v":"-"},{"$f":"OFFSET(Balance!M105,0,($A$104-1)*12)","v":"-"},{"$f":"OFFSET(Balance!N105,0,($A$104-1)*12)","v":"-"},{"$f":"IF(SUM(C31:N31)=0,\"-\",SUM(C31:N31))","v":69668.748557999992}]
[null,"(1) Asignación de unidades de producción según combustible principal."]
[null,"(2) Incluye funcionamiento en ciclo abierto."]
[]
[null,"(3) Incluye todas aquellas unidades menores de 50 MW que no pertenecen a ninguna unidad de gestión hidráulica (UGH)."]
[null,"(4) Valor positivo: saldo importador; valor negativo: saldo exportador."]
[null,"(5) Incluye residuos."]
[null,{"$f":"IF(MONTH('AVISO LEGAL'!J2)=1,CONCATENATE(\"Datos definitivos hasta el 31/03/2017. Datos provisionales del 01/04/2017 al \",TEXT(EOMONTH('AVISO LEGAL'!J2-60,0),\"dd/mm/aaaa\"),\". Datos programados del 01/12/\",YEAR('AVISO LEGAL'!J2)-1,\" al \",TEXT(EOMONTH('AVISO LEGAL'!J2-30,0),\"dd/mm/aaaa\"),\".\"),CONCATENATE(\"Datos definitivos hasta el 31/03/2017. Datos provisionales del 01/04/2017 al \",TEXT(EOMONTH('AVISO LEGAL'!J2-60,0),\"dd/mm/aaaa\"),\". Datos programados del 01/\",TEXT(MONTH('AVISO LEGAL'!J2)-1,\"00\"),\"/\",YEAR('AVISO LEGAL'!J2),\" al \",TEXT(EOMONTH('AVISO LEGAL'!J2-30,0),\"dd/mm/aaaa\"),\".\"))","v":"Datos definitivos hasta el 31/03/2017. Datos provisionales del 01/04/2017 al 28/02/2018. Datos programados del 01/03/2018 al 31/03/2018."}]
[]
[]
[]
[]
[]
[]
[]
[]
[]
[]
[]
[]
[]
[]
[]
[]
[]
[]
[]
[]
[]
[]
[]
[]
[]
[]
[]
[]
[]
[]
[]
[]
[]
[]
[]
[]
[]
[]
[]
[]
[]
[]
[]
[]
[]
[]
[]
[]
[]
[]
[]
[]
[]
[]
[]
[]
[]
[]
[]
[]
[]
[]
[]
[2]
[11]
[12]
[11]

{"sheet":"Balance nacional anual","index":2,"n_rows":40,"n_cols":9,"rows_kept":40,"cut":false,"hidden":false,"merged":[[37,1,37,11],[35,1,35,11],[36,1,36,14],[31,1,31,11],[32,1,32,11],[33,1,33,11],[34,1,34,11]]}
[null,null,null,null,null,null,null,null,2]
[]
[]
[null,null,null,null,null,null,null,"Sistema eléctrico"]
[null,null,null,null,null,null,null,"Horizonte temporal"]
[null,null,null,null,null,null,null,"Periodo"]
[]
[null,null,{"$f":"OFFSET(Balance!C189,0,($I$1-1)*7)","v":2014},{"$f":"OFFSET(Balance!D189,0,($I$1-1)*7)","v":2015},{"$f":"OFFSET(Balance!E189,0,($I$1-1)*7)","v":2016},{"$f":"OFFSET(Balance!F189,0,($I$1-1)*7)","v":2017},{"$f":"OFFSET(Balance!G189,0,($I$1-1)*7)","v":2018},{"$f":"OFFSET(Balance!H189,0,($I$1-1)*7)","v":2019},{"$f":"OFFSET(Balance!I189,0,($I$1-1)*7)","v":2020}]
[]
[null,"Hidráulica",{"$f":"OFFSET(Balance!C190,0,($I$1-1)*7)","v":32042.878507204001},{"$f":"OFFSET(Balance!D190,0,($I$1-1)*7)","v":28326.009484850005},{"$f":"OFFSET(Balance!E190,0,($I$1-1)*7)","v":36042.625717771996},{"$f":"OFFSET(Balance!F190,0,($I$1-1)*7)","v":18363.782145035999},{"$f":"OFFSET(Balance!G190,0,($I$1-1)*7)","v":8962.0251101360009},{"$f":"OFFSET(Balance!H190,0,($I$1-1)*7)","v":"-"},{"$f":"OFFSET(Balance!I190,0,($I$1-1)*7)","v":"-"}]
[null,"Turbinación bombeo",{"$f":"OFFSET(Balance!C191,0,($I$1-1)*7)","v":3415.9960267959996},{"$f":"OFFSET(Balance!D191,0,($I$1-1)*7)","v":2895.3657881499998},{"$f":"OFFSET(Balance!E191,0,($I$1-1)*7)","v":3134.3289102280005},{"$f":"OFFSET(Balance!F191,0,($I$1-1)*7)","v":2248.9938579640002},{"$f":"OFFSET(Balance!G191,0,($I$1-1)*7)","v":737.83555886399995},{"$f":"OFFSET(Balance!H191,0,($I$1-1)*7)","v":"-"},{"$f":"OFFSET(Balance!I191,0,($I$1-1)*7)","v":"-"}]
[null,"Nuclear",{"$f":"OFFSET(Balance!C192,0,($I$1-1)*7)","v":54870.239000000009},{"$f":"OFFSET(Balance!D192,0,($I$1-1)*7)","v":54754.839048000002},{"$f":"OFFSET(Balance!E192,0,($I$1-1)*7)","v":56098.972000000002},{"$f":"OFFSET(Balance!F192,0,($I$1-1)*7)","v":55608.922000000006},{"$f":"OFFSET(Balance!G192,0,($I$1-1)*7)","v":14179.739099999999},{"$f":"OFFSET(Balance!H192,0,($I$1-1)*7)","v":"-"},{"$f":"OFFSET(Balance!I192,0,($I$1-1)*7)","v":"-"}]
[null,"Carbón",{"$f":"OFFSET(Balance!C193,0,($I$1-1)*7)","v":43320.302804000006},{"$f":"OFFSET(Balance!D193,0,($I$1-1)*7)","v":52789.040663999993},{"$f":"OFFSET(Balance!E193,0,($I$1-1)*7)","v":37491.272301999998},{"$f":"OFFSET(Balance!F193,0,($I$1-1)*7)","v":45196.268422000008},{"$f":"OFFSET(Balance!G193,0,($I$1-1)*7)","v":8454.2392849999997},{"$f":"OFFSET(Balance!H193,0,($I$1-1)*7)","v":"-"},{"$f":"OFFSET(Balance!I193,0,($I$1-1)*7)","v":"-"}]
[null,"Fuel + Gas",{"$f":"OFFSET(Balance!C194,0,($I$1-1)*7)","v":6256.7275920000002},{"$f":"OFFSET(Balance!D194,0,($I$1-1)*7)","v":6496.6519769999995},{"$f":"OFFSET(Balance!E194,0,($I$1-1)*7)","v":6764.5484399999987},{"$f":"OFFSET(Balance!F194,0,($I$1-1)*7)","v":7011.0693250000013},{"$f":"OFFSET(Balance!G194,0,($I$1-1)*7)","v":1635.0063459999999},{"$f":"OFFSET(Balance!H194,0,($I$1-1)*7)","v":"-"},{"$f":"OFFSET(Balance!I194,0,($I$1-1)*7)","v":"-"}]
[null,"Ciclo combinado (2)",{"$f":"OFFSET(Balance!C195,0,($I$1-1)*7)","v":25075.127551000001},{"$f":"OFFSET(Balance!D195,0,($I$1-1)*7)","v":29290.74944},{"$f":"OFFSET(Balance!E195,0,($I$1-1)*7)","v":29260.401394999997},{"$f":"OFFSET(Balance!F195,0,($I$1-1)*7)","v":37296.488616999995},{"$f":"OFFSET(Balance!G195,0,($I$1-1)*7)","v":6307.0430339999994},{"$f":"OFFSET(Balance!H195,0,($I$1-1)*7)","v":"-"},{"$f":"OFFSET(Balance!I195,0,($I$1-1)*7)","v":"-"}]
[null,"Régimen ordinario",{"$f":"OFFSET(Balance!C196,0,($I$1-1)*7)","v":"-"},{"$f":"OFFSET(Balance!D196,0,($I$1-1)*7)","v":"-"},{"$f":"OFFSET(Balance!E196,0,($I$1-1)*7)","v":"-"},{"$f":"OFFSET(Balance!F196,0,($I$1-1)*7)","v":"-"},{"$f":"OFFSET(Balance!G196,0,($I$1-1)*7)","v":"-"},{"$f":"OFFSET(Balance!H196,0,($I$1-1)*7)","v":"-"},{"$f":"OFFSET(Balance!I196,0,($I$1-1)*7)","v":"-"}]
[]
[null,"Hidroeólica",{"$f":"OFFSET(Balance!C197,0,($I$1-1)*7)","v":1.071861},{"$f":"OFFSET(Balance!D197,0,($I$1-1)*7)","v":8.5570660000000007},{"$f":"OFFSET(Balance!E197,0,($I$1-1)*7)","v":18.102639},{"$f":"OFFSET(Balance!F197,0,($I$1-1)*7)","v":20.398516000000001},{"$f":"OFFSET(Balance!G197,0,($I$1-1)*7)","v":5.7159579999999997},{"$f":"OFFSET(Balance!H197,0,($I$1-1)*7)","v":"-"},{"$f":"OFFSET(Balance!I197,0,($I$1-1)*7)","v":"-"}]
[null,"Resto hidráulica (3)",{"$f":"OFFSET(Balance!C198,0,($I$1-1)*7)","v":7072.9990210000005},{"$f":"OFFSET(Balance!D198,0,($I$1-1)*7)","v":"-"},{"$f":"OFFSET(Balance!E198,0,($I$1-1)*7)","v":"-"},{"$f":"OFFSET(Balance!F198,0,($I$1-1)*7)","v":"-"},{"$f":"OFFSET(Balance!G198,0,($I$1-1)*7)","v":"-"},{"$f":"OFFSET(Balance!H198,0,($I$1-1)*7)","v":"-"},{"$f":"OFFSET(Balance!I198,0,($I$1-1)*7)","v":"-"}]
[null,"Eólica",{"$f":"OFFSET(Balance!C199,0,($I$1-1)*7)","v":51030.692999999999},{"$f":"OFFSET(Balance!D199,0,($I$1-1)*7)","v":48115.128071999992},{"$f":"OFFSET(Balance!E199,0,($I$1-1)*7)","v":47696.670640000004},{"$f":"OFFSET(Balance!F199,0,($I$1-1)*7)","v":47897.01017400001},{"$f":"OFFSET(Balance!G199,0,($I$1-1)*7)","v":17747.369035999996},{"$f":"OFFSET(Balance!H199,0,($I$1-1)*7)","v":"-"},{"$f":"OFFSET(Balance!I199,0,($I$1-1)*7)","v":"-"}]
[null,"Solar fotovoltaica",{"$f":"OFFSET(Balance!C200,0,($I$1-1)*7)","v":8207.5729999999985},{"$f":"OFFSET(Balance!D200,0,($I$1-1)*7)","v":8243.0756409999995},{"$f":"OFFSET(Balance!E200,0,($I$1-1)*7)","v":7977.5987999999988},{"$f":"OFFSET(Balance!F200,0,($I$1-1)*7)","v":8385.0359999999982},{"$f":"OFFSET(Balance!G200,0,($I$1-1)*7)","v":1537.9510700000001},{"$f":"OFFSET(Balance!H200,0,($I$1-1)*7)","v":"-"},{"$f":"OFFSET(Balance!I200,0,($I$1-1)*7)","v":"-"}]
[null,"Solar térmica",{"$f":"OFFSET(Balance!C201,0,($I$1-1)*7)","v":4958.9149999999991},{"$f":"OFFSET(Balance!D201,0,($I$1-1)*7)","v":5085.2350000000006},{"$f":"OFFSET(Balance!E201,0,($I$1-1)*7)","v":5071.2040000000006},{"$f":"OFFSET(Balance!F201,0,($I$1-1)*7)","v":5347.9489999999996},{"$f":"OFFSET(Balance!G201,0,($I$1-1)*7)","v":570.10159999999996},{"$f":"OFFSET(Balance!H201,0,($I$1-1)*7)","v":"-"},{"$f":"OFFSET(Balance!I201,0,($I$1-1)*7)","v":"-"}]
[null,"Térmica renovable(6)/Otras renovables",{"$f":"OFFSET(Balance!C202,0,($I$1-1)*7)","v":4728.7287219999998},{"$f":"OFFSET(Balance!D202,0,($I$1-1)*7)","v":3183.9767660000002},{"$f":"OFFSET(Balance!E202,0,($I$1-1)*7)","v":3424.5595199999998},{"$f":"OFFSET(Balance!F202,0,($I$1-1)*7)","v":3614.1030000000001},{"$f":"OFFSET(Balance!G202,0,($I$1-1)*7)","v":879.32067000000006},{"$f":"OFFSET(Balance!H202,0,($I$1-1)*7)","v":"-"},{"$f":"OFFSET(Balance!I202,0,($I$1-1)*7)","v":"-"}]
[null,"Cogeneración y resto(6)/Cogeneración",{"$f":"OFFSET(Balance!C203,0,($I$1-1)*7)","v":25885.824000000001},{"$f":"OFFSET(Balance!D203,0,($I$1-1)*7)","v":25449.494319999998},{"$f":"OFFSET(Balance!E203,0,($I$1-1)*7)","v":25906.610849999997},{"$f":"OFFSET(Balance!F203,0,($I$1-1)*7)","v":28170.445},{"$f":"OFFSET(Balance!G203,0,($I$1-1)*7)","v":7225.8861959999986},{"$f":"OFFSET(Balance!H203,0,($I$1-1)*7)","v":"-"},{"$f":"OFFSET(Balance!I203,0,($I$1-1)*7)","v":"-"}]
[null,"Residuos no renovables",{"$f":"OFFSET(Balance!C204,0,($I$1-1)*7)","v":"-"},{"$f":"OFFSET(Balance!D204,0,($I$1-1)*7)","v":2480.1095},{"$f":"OFFSET(Balance!E204,0,($I$1-1)*7)","v":2606.9649999999997},{"$f":"OFFSET(Balance!F204,0,($I$1-1)*7)","v":2607.6644999999999},{"$f":"OFFSET(Balance!G204,0,($I$1-1)*7)","v":671.2921},{"$f":"OFFSET(Balance!H204,0,($I$1-1)*7)","v":"-"},{"$f":"OFFSET(Balance!I204,0,($I$1-1)*7)","v":"-"}]
[null,"Residuos renovables",{"$f":"OFFSET(Balance!C205,0,($I$1-1)*7)","v":"-"},{"$f":"OFFSET(Balance!D205,0,($I$1-1)*7)","v":818.0485000000001},{"$f":"OFFSET(Balance!E205,0,($I$1-1)*7)","v":785.39699999999993},{"$f":"OFFSET(Balance!F205,0,($I$1-1)*7)","v":877.00649999999996},{"$f":"OFFSET(Balance!G205,0,($I$1-1)*7)","v":223.36499999999998},{"$f":"OFFSET(Balance!H205,0,($I$1-1)*7)","v":"-"},{"$f":"OFFSET(Balance!I205,0,($I$1-1)*7)","v":"-"}]
[null,"Régimen especial",{"$f":"OFFSET(Balance!C206,0,($I$1-1)*7)","v":"-"},{"$f":"OFFSET(Balance!D206,0,($I$1-1)*7)","v":"-"},{"$f":"OFFSET(Balance!E206,0,($I$1-1)*7)","v":"-"},{"$f":"OFFSET(Balance!F206,0,($I$1-1)*7)","v":"-"},{"$f":"OFFSET(Balance!G206,0,($I$1-1)*7)","v":"-"},{"$f":"OFFSET(Balance!H206,0,($I$1-1)*7)","v":"-"},{"$f":"OFFSET(Balance!I206,0,($I$1-1)*7)","v":"-"}]
[null,"Generación",{"$f":"OFFSET(Balance!C207,0,($I$1-1)*7)","v":266867.07608500007},{"$f":"OFFSET(Balance!D207,0,($I$1-1)*7)","v":267936.28126699995},{"$f":"OFFSET(Balance!E207,0,($I$1-1)*7)","v":262279.25721399998},{"$f":"OFFSET(Balance!F207,0,($I$1-1)*7)","v":262645.13705700001},{"$f":"OFFSET(Balance!G207,0,($I$1-1)*7)","v":69136.890064000007},{"$f":"OFFSET(Balance!H207,0,($I$1-1)*7)","v":"-"},{"$f":"OFFSET(Balance!I207,0,($I$1-1)*7)","v":"-"}]
[null,"Consumos en bombeo",{"$f":"OFFSET(Balance!C208,0,($I$1-1)*7)","v":-5329.5900510000001},{"$f":"OFFSET(Balance!D208,0,($I$1-1)*7)","v":-4520.0941789999997},{"$f":"OFFSET(Balance!E208,0,($I$1-1)*7)","v":-4819.4130750000004},{"$f":"OFFSET(Balance!F208,0,($I$1-1)*7)","v":-3675.2379039999996},{"$f":"OFFSET(Balance!G208,0,($I$1-1)*7)","v":-1372.7395409999999},{"$f":"OFFSET(Balance!H208,0,($I$1-1)*7)","v":"-"},{"$f":"OFFSET(Balance!I208,0,($I$1-1)*7)","v":"-"}]
[null,"Saldo intercambios internacionales (4)",{"$f":"OFFSET(Balance!C209,0,($I$1-1)*7)","v":-3406.1249290000001},{"$f":"OFFSET(Balance!D209,0,($I$1-1)*7)","v":-133.16322499999978},{"$f":"OFFSET(Balance!E209,0,($I$1-1)*7)","v":7667.313553},{"$f":"OFFSET(Balance!F209,0,($I$1-1)*7)","v":9170.5836430000018},{"$f":"OFFSET(Balance!G209,0,($I$1-1)*7)","v":1904.5980349999998},{"$f":"OFFSET(Balance!H209,0,($I$1-1)*7)","v":"-"},{"$f":"OFFSET(Balance!I209,0,($I$1-1)*7)","v":"-"}]
[null,"Demanda transporte (b.c.)",{"$f":"OFFSET(Balance!C210,0,($I$1-1)*7)","v":258131.36110500005},{"$f":"OFFSET(Balance!D210,0,($I$1-1)*7)","v":263283.02386299992},{"$f":"OFFSET(Balance!E210,0,($I$1-1)*7)","v":265127.15769199998},{"$f":"OFFSET(Balance!F210,0,($I$1-1)*7)","v":268140.48279600003},{"$f":"OFFSET(Balance!G210,0,($I$1-1)*7)","v":69668.748558000007},{"$f":"OFFSET(Balance!H210,0,($I$1-1)*7)","v":"-"},{"$f":"OFFSET(Balance!I210,0,($I$1-1)*7)","v":"-"}]
[null,"(1) Asignación de unidades de producción según combustible principal."]
[null,"(2) Incluye funcionamiento en ciclo abierto."]
[]
[null,"(3) Incluye todas aquellas unidades menores de 50 MW que no pertenecen a ninguna unidad de gestión hidráulica (UGH)."]
[null,"(4) Valor positivo: saldo importador; valor negativo: saldo exportador."]
[null,"(5) Incluye residuos."]
[null,"(6) Hasta 2014 e incluye residuos."]
[null,{"$f":"IF(MONTH(FACT)=1,\"\",CONCATENATE(\"Para el año \",YEAR(FACT), \" valores acumulados hasta \",TEXT(FACT-30,\"mmmm\"),\" de \",YEAR(FACT),\".\"))","v":"Para el año 2018 valores acumulados hasta marzo de 2018."}]
[null,{"$f":"'Balance nacional mensual'!B38","v":"Datos definitivos hasta el 31/03/2017. Datos provisionales del 01/04/2017 al 28/02/2018. Datos programados del 01/03/2018 al 31/03/2018."}]

{"sheet":"Balance Peninsular mensual","index":3,"n_rows":39,"n_cols":15,"rows_kept":39,"cut":false,"hidden":false,"merged":[[38,1,38,11],[37,1,37,11],[36,1,36,14],[33,1,33,14],[5,2,5,9],[31,1,31,14],[32,1,32,14],[35,1,35,12],[34,1,34,11]]}
[null,null,null,null,null,null,null,null,null,null,null,null,null,null,29]
[]
[]
[null,null,null,null,null,null,null,null,null,null,null,null,"Sistema eléctrico"]
[null,null,null,null,null,null,null,null,null,null,null,null,"Horizonte temporal"]
[null,null,null,null,null,null,null,null,null,null,null,null,"Periodo"]
[]
[null,null,"Ene.","Feb.","Mar.","Abr.","May.","Jun.","Jul.","Ago.","Sep.","Oct.","Nov.","Dic.",{"$f":"OFFSET(Año!C2,($O$1-1),0)","v":2018}]
[]
[null,"Hidráulica",{"$f":"OFFSET(Balance!C3,0,($O$1-1)*12)","v":2195.1409847860004},{"$f":"OFFSET(Balance!D3,0,($O$1-1)*12)","v":2386.6154253499999},{"$f":"OFFSET(Balance!E3,0,($O$1-1)*12)","v":4379.9547000000002},{"$f":"OFFSET(Balance!F3,0,($O$1-1)*12)","v":"-"},{"$f":"OFFSET(Balance!G3,0,($O$1-1)*12)","v":"-"},{"$f":"OFFSET(Balance!H3,0,($O$1-1)*12)","v":"-"},{"$f":"OFFSET(Balance!I3,0,($O$1-1)*12)","v":"-"},{"$f":"OFFSET(Balance!J3,0,($O$1-1)*12)","v":"-"},{"$f":"OFFSET(Balance!K3,0,($O$1-1)*12)","v":"-"},{"$f":"OFFSET(Balance!L3,0,($O$1-1)*12)","v":"-"},{"$f":"OFFSET(Balance!M3,0,($O$1-1)*12)","v":"-"},{"$f":"OFFSET(Balance!N3,0,($O$1-1)*12)","v":"-"},{"$f":"IF(SUM(C10:N10)=0,\"-\",SUM(C10:N10))","v":8961.7111101360006}]
[null,"Turbinación bombeo",{"$f":"OFFSET(Balance!C4,0,($O$1-1)*12)","v":273.43523521399999},{"$f":"OFFSET(Balance!D4,0,($O$1-1)*12)","v":180.62302364999999},{"$f":"OFFSET(Balance!E4,0,($O$1-1)*12)","v":283.77729999999997},{"$f":"OFFSET(Balance!F4,0,($O$1-1)*12)","v":"-"},{"$f":"OFFSET(Balance!G4,0,($O$1-1)*12)","v":"-"},{"$f":"OFFSET(Balance!H4,0,($O$1-1)*12)","v":"-"},{"$f":"OFFSET(Balance!I4,0,($O$1-1)*12)","v":"-"},{"$f":"OFFSET(Balance!J4,0,($O$1-1)*12)","v":"-"},{"$f":"OFFSET(Balance!K4,0,($O$1-1)*12)","v":"-"},{"$f":"OFFSET(Balance!L4,0,($O$1-1)*12)","v":"-"},{"$f":"OFFSET(Balance!M4,0,($O$1-1)*12)","v":"-"},{"$f":"OFFSET(Balance!N4,0,($O$1-1)*12)","v":"-"},{"$f":"IF(SUM(C11:N11)=0,\"-\",SUM(C11:N11))","v":737.83555886399995}]
[null,"Nuclear",{"$f":"OFFSET(Balance!C5,0,($O$1-1)*12)","v":5098.7070000000003},{"$f":"OFFSET(Balance!D5,0,($O$1-1)*12)","v":4594.5630000000001},{"$f":"OFFSET(Balance!E5,0,($O$1-1)*12)","v":4486.4690999999993},{"$f":"OFFSET(Balance!F5,0,($O$1-1)*12)","v":"-"},{"$f":"OFFSET(Balance!G5,0,($O$1-1)*12)","v":"-"},{"$f":"OFFSET(Balance!H5,0,($O$1-1)*12)","v":"-"},{"$f":"OFFSET(Balance!I5,0,($O$1-1)*12)","v":"-"},{"$f":"OFFSET(Balance!J5,0,($O$1-1)*12)","v":"-"},{"$f":"OFFSET(Balance!K5,0,($O$1-1)*12)","v":"-"},{"$f":"OFFSET(Balance!L5,0,($O$1-1)*12)","v":"-"},{"$f":"OFFSET(Balance!M5,0,($O$1-1)*12)","v":"-"},{"$f":"OFFSET(Balance!N5,0,($O$1-1)*12)","v":"-"},{"$f":"IF(SUM(C12:N12)=0,\"-\",SUM(C12:N12))","v":14179.739099999999}]
[null,"Carbón",{"$f":"OFFSET(Balance!C6,0,($O$1-1)*12)","v":3041.538},{"$f":"OFFSET(Balance!D6,0,($O$1-1)*12)","v":3500.7289999999998},{"$f":"OFFSET(Balance!E6,0,($O$1-1)*12)","v":1320.4065000000001},{"$f":"OFFSET(Balance!F6,0,($O$1-1)*12)","v":"-"},{"$f":"OFFSET(Balance!G6,0,($O$1-1)*12)","v":"-"},{"$f":"OFFSET(Balance!H6,0,($O$1-1)*12)","v":"-"},{"$f":"OFFSET(Balance!I6,0,($O$1-1)*12)","v":"-"},{"$f":"OFFSET(Balance!J6,0,($O$1-1)*12)","v":"-"},{"$f":"OFFSET(Balance!K6,0,($O$1-1)*12)","v":"-"},{"$f":"OFFSET(Balance!L6,0,($O$1-1)*12)","v":"-"},{"$f":"OFFSET(Balance!M6,0,($O$1-1)*12)","v":"-"},{"$f":"OFFSET(Balance!N6,0,($O$1-1)*12)","v":"-"},7862.6734999999999]
[null,"Fuel + Gas",{"$f":"OFFSET(Balance!C7,0,($O$1-1)*12)","v":0},{"$f":"OFFSET(Balance!D7,0,($O$1-1)*12)","v":0},{"$f":"OFFSET(Balance!E7,0,($O$1-1)*12)","v":0},{"$f":"OFFSET(Balance!F7,0,($O$1-1)*12)","v":"-"},{"$f":"OFFSET(Balance!G7,0,($O$1-1)*12)","v":"-"},{"$f":"OFFSET(Balance!H7,0,($O$1-1)*12)","v":"-"},{"$f":"OFFSET(Balance!I7,0,($O$1-1)*12)","v":"-"},{"$f":"OFFSET(Balance!J7,0,($O$1-1)*12)","v":"-"},{"$f":"OFFSET(Balance!K7,0,($O$1-1)*12)","v":"-"},{"$f":"OFFSET(Balance!L7,0,($O$1-1)*12)","v":"-"},{"$f":"OFFSET(Balance!M7,0,($O$1-1)*12)","v":"-"},{"$f":"OFFSET(Balance!N7,0,($O$1-1)*12)","v":"-"},"-"]
[null,"Ciclo combinado (2)",{"$f":"OFFSET(Balance!C8,0,($O$1-1)*12)","v":2277.6590000000001},{"$f":"OFFSET(Balance!D8,0,($O$1-1)*12)","v":1973.229},{"$f":"OFFSET(Balance!E8,0,($O$1-1)*12)","v":1219.2908},{"$f":"OFFSET(Balance!F8,0,($O$1-1)*12)","v":"-"},{"$f":"OFFSET(Balance!G8,0,($O$1-1)*12)","v":"-"},{"$f":"OFFSET(Balance!H8,0,($O$1-1)*12)","v":"-"},{"$f":"OFFSET(Balance!I8,0,($O$1-1)*12)","v":"-"},{"$f":"OFFSET(Balance!J8,0,($O$1-1)*12)","v":"-"},{"$f":"OFFSET(Balance!K8,0,($O$1-1)*12)","v":"-"},{"$f":"OFFSET(Balance!L8,0,($O$1-1)*12)","v":"-"},{"$f":"OFFSET(Balance!M8,0,($O$1-1)*12)","v":"-"},{"$f":"OFFSET(Balance!N8,0,($O$1-1)*12)","v":"-"},5470.1787999999997]
[null,"Régimen ordinario",{"$f":"OFFSET(Balance!C9,0,($O$1-1)*12)","v":"-"},{"$f":"OFFSET(Balance!D9,0,($O$1-1)*12)","v":"-"},{"$f":"OFFSET(Balance!E9,0,($O$1-1)*12)","v":"-"},{"$f":"OFFSET(Balance!F9,0,($O$1-1)*12)","v":"-"},{"$f":"OFFSET(Balance!G9,0,($O$1-1)*12)","v":"-"},{"$f":"OFFSET(Balance!H9,0,($O$1-1)*12)","v":"-"},{"$f":"OFFSET(Balance!I9,0,($O$1-1)*12)","v":"-"},{"$f":"OFFSET(Balance!J9,0,($O$1-1)*12)","v":"-"},{"$f":"OFFSET(Balance!K9,0,($O$1-1)*12)","v":"-"},{"$f":"OFFSET(Balance!L9,0,($O$1-1)*12)","v":"-"},{"$f":"OFFSET(Balance!M9,0,($O$1-1)*12)","v":"-"},{"$f":"OFFSET(Balance!N9,0,($O$1-1)*12)","v":"-"},{"$f":"SUM(O10:O15)","v":37212.138069000001}]
[]
[null,"Resto hidráulica (3)",{"$f":"OFFSET(Balance!C10,0,($O$1-1)*12)","v":"-"},{"$f":"OFFSET(Balance!D10,0,($O$1-1)*12)","v":"-"},{"$f":"OFFSET(Balance!E10,0,($O$1-1)*12)","v":"-"},{"$f":"OFFSET(Balance!F10,0,($O$1-1)*12)","v":"-"},{"$f":"OFFSET(Balance!G10,0,($O$1-1)*12)","v":"-"},{"$f":"OFFSET(Balance!H10,0,($O$1-1)*12)","v":"-"},{"$f":"OFFSET(Balance!I10,0,($O$1-1)*12)","v":"-"},{"$f":"OFFSET(Balance!J10,0,($O$1-1)*12)","v":"-"},{"$f":"OFFSET(Balance!K10,0,($O$1-1)*12)","v":"-"},{"$f":"OFFSET(Balance!L10,0,($O$1-1)*12)","v":"-"},{"$f":"OFFSET(Balance!M10,0,($O$1-1)*12)","v":"-"},{"$f":"OFFSET(Balance!N10,0,($O$1-1)*12)","v":"-"},"-"]
[null,"Eólica",{"$f":"OFFSET(Balance!C11,0,($O$1-1)*12)","v":5276.3649999999998},{"$f":"OFFSET(Balance!D11,0,($O$1-1)*12)","v":4622.9570000000003},{"$f":"OFFSET(Balance!E11,0,($O$1-1)*12)","v":7689.6802939999998},{"$f":"OFFSET(Balance!F11,0,($O$1-1)*12)","v":"-"},{"$f":"OFFSET(Balance!G11,0,($O$1-1)*12)","v":"-"},{"$f":"OFFSET(Balance!H11,0,($O$1-1)*12)","v":"-"},{"$f":"OFFSET(Balance!I11,0,($O$1-1)*12)","v":"-"},{"$f":"OFFSET(Balance!J11,0,($O$1-1)*12)","v":"-"},{"$f":"OFFSET(Balance!K11,0,($O$1-1)*12)","v":"-"},{"$f":"OFFSET(Balance!L11,0,($O$1-1)*12)","v":"-"},{"$f":"OFFSET(Balance!M11,0,($O$1-1)*12)","v":"-"},{"$f":"OFFSET(Balance!N11,0,($O$1-1)*12)","v":"-"},17589.002293999998]
[null,"Solar fotovoltaica",{"$f":"OFFSET(Balance!C12,0,($O$1-1)*12)","v":416.28800000000001},{"$f":"OFFSET(Balance!D12,0,($O$1-1)*12)","v":484.916},{"$f":"OFFSET(Balance!E12,0,($O$1-1)*12)","v":553.14400000000001},{"$f":"OFFSET(Balance!F12,0,($O$1-1)*12)","v":"-"},{"$f":"OFFSET(Balance!G12,0,($O$1-1)*12)","v":"-"},{"$f":"OFFSET(Balance!H12,0,($O$1-1)*12)","v":"-"},{"$f":"OFFSET(Balance!I12,0,($O$1-1)*12)","v":"-"},{"$f":"OFFSET(Balance!J12,0,($O$1-1)*12)","v":"-"},{"$f":"OFFSET(Balance!K12,0,($O$1-1)*12)","v":"-"},{"$f":"OFFSET(Balance!L12,0,($O$1-1)*12)","v":"-"},{"$f":"OFFSET(Balance!M12,0,($O$1-1)*12)","v":"-"},{"$f":"OFFSET(Balance!N12,0,($O$1-1)*12)","v":"-"},1454.348]
[null,"Solar térmica",{"$f":"OFFSET(Balance!C13,0,($O$1-1)*12)","v":112.38800000000001},{"$f":"OFFSET(Balance!D13,0,($O$1-1)*12)","v":229.80799999999999},{"$f":"OFFSET(Balance!E13,0,($O$1-1)*12)","v":227.90559999999999},{"$f":"OFFSET(Balance!F13,0,($O$1-1)*12)","v":"-"},{"$f":"OFFSET(Balance!G13,0,($O$1-1)*12)","v":"-"},{"$f":"OFFSET(Balance!H13,0,($O$1-1)*12)","v":"-"},{"$f":"OFFSET(Balance!I13,0,($O$1-1)*12)","v":"-"},{"$f":"OFFSET(Balance!J13,0,($O$1-1)*12)","v":"-"},{"$f":"OFFSET(Balance!K13,0,($O$1-1)*12)","v":"-"},{"$f":"OFFSET(Balance!L13,0,($O$1-1)*12)","v":"-"},{"$f":"OFFSET(Balance!M13,0,($O$1-1)*12)","v":"-"},{"$f":"OFFSET(Balance!N13,0,($O$1-1)*12)","v":"-"},570.10159999999996]
[null,"Otras renovables (4)",{"$f":"OFFSET(Balance!C14,0,($O$1-1)*12)","v":296.49200000000002},{"$f":"OFFSET(Balance!D14,0,($O$1-1)*12)","v":301.63099999999997},{"$f":"OFFSET(Balance!E14,0,($O$1-1)*12)","v":279.18259999999998},{"$f":"OFFSET(Balance!F14,0,($O$1-1)*12)","v":"-"},{"$f":"OFFSET(Balance!G14,0,($O$1-1)*12)","v":"-"},{"$f":"OFFSET(Balance!H14,0,($O$1-1)*12)","v":"-"},{"$f":"OFFSET(Balance!I14,0,($O$1-1)*12)","v":"-"},{"$f":"OFFSET(Balance!J14,0,($O$1-1)*12)","v":"-"},{"$f":"OFFSET(Balance!K14,0,($O$1-1)*12)","v":"-"},{"$f":"OFFSET(Balance!L14,0,($O$1-1)*12)","v":"-"},{"$f":"OFFSET(Balance!M14,0,($O$1-1)*12)","v":"-"},{"$f":"OFFSET(Balance!N14,0,($O$1-1)*12)","v":"-"},877.30560000000003]
[null,"Cogeneración",{"$f":"OFFSET(Balance!C15,0,($O$1-1)*12)","v":2474.7359999999999},{"$f":"OFFSET(Balance!D15,0,($O$1-1)*12)","v":2243.4229999999998},{"$f":"OFFSET(Balance!E15,0,($O$1-1)*12)","v":2499.0647059999997},{"$f":"OFFSET(Balance!F15,0,($O$1-1)*12)","v":"-"},{"$f":"OFFSET(Balance!G15,0,($O$1-1)*12)","v":"-"},{"$f":"OFFSET(Balance!H15,0,($O$1-1)*12)","v":"-"},{"$f":"OFFSET(Balance!I15,0,($O$1-1)*12)","v":"-"},{"$f":"OFFSET(Balance!J15,0,($O$1-1)*12)","v":"-"},{"$f":"OFFSET(Balance!K15,0,($O$1-1)*12)","v":"-"},{"$f":"OFFSET(Balance!L15,0,($O$1-1)*12)","v":"-"},{"$f":"OFFSET(Balance!M15,0,($O$1-1)*12)","v":"-"},{"$f":"OFFSET(Balance!N15,0,($O$1-1)*12)","v":"-"},7217.2237059999989]
[null,"Residuos no renovables",{"$f":"OFFSET(Balance!C16,0,($O$1-1)*12)","v":226.57149999999999},{"$f":"OFFSET(Balance!D16,0,($O$1-1)*12)","v":202.00300000000001},{"$f":"OFFSET(Balance!E16,0,($O$1-1)*12)","v":217.50215000000003},{"$f":"OFFSET(Balance!F16,0,($O$1-1)*12)","v":"-"},{"$f":"OFFSET(Balance!G16,0,($O$1-1)*12)","v":"-"},{"$f":"OFFSET(Balance!H16,0,($O$1-1)*12)","v":"-"},{"$f":"OFFSET(Balance!I16,0,($O$1-1)*12)","v":"-"},{"$f":"OFFSET(Balance!J16,0,($O$1-1)*12)","v":"-"},{"$f":"OFFSET(Balance!K16,0,($O$1-1)*12)","v":"-"},{"$f":"OFFSET(Balance!L16,0,($O$1-1)*12)","v":"-"},{"$f":"OFFSET(Balance!M16,0,($O$1-1)*12)","v":"-"},{"$f":"OFFSET(Balance!N16,0,($O$1-1)*12)","v":"-"},646.07664999999997]
[null,"Residuos renovables",{"$f":"OFFSET(Balance!C17,0,($O$1-1)*12)","v":69.263499999999993},{"$f":"OFFSET(Balance!D17,0,($O$1-1)*12)","v":62.439},{"$f":"OFFSET(Balance!E17,0,($O$1-1)*12)","v":66.447050000000004},{"$f":"OFFSET(Balance!F17,0,($O$1-1)*12)","v":"-"},{"$f":"OFFSET(Balance!G17,0,($O$1-1)*12)","v":"-"},{"$f":"OFFSET(Balance!H17,0,($O$1-1)*12)","v":"-"},{"$f":"OFFSET(Balance!I17,0,($O$1-1)*12)","v":"-"},{"$f":"OFFSET(Balance!J17,0,($O$1-1)*12)","v":"-"},{"$f":"OFFSET(Balance!K17,0,($O$1-1)*12)","v":"-"},{"$f":"OFFSET(Balance!L17,0,($O$1-1)*12)","v":"-"},{"$f":"OFFSET(Balance!M17,0,($O$1-1)*12)","v":"-"},{"$f":"OFFSET(Balance!N17,0,($O$1-1)*12)","v":"-"},{"$f":"IF(SUM(C25:N25)=0,\"-\",SUM(C25:N25))","v":198.14954999999998}]
[null,"Régimen especial",{"$f":"OFFSET(Balance!C18,0,($O$1-1)*12)","v":"-"},{"$f":"OFFSET(Balance!D18,0,($O$1-1)*12)","v":"-"},{"$f":"OFFSET(Balance!E18,0,($O$1-1)*12)","v":"-"},{"$f":"OFFSET(Balance!F18,0,($O$1-1)*12)","v":"-"},{"$f":"OFFSET(Balance!G18,0,($O$1-1)*12)","v":"-"},{"$f":"OFFSET(Balance!H18,0,($O$1-1)*12)","v":"-"},{"$f":"OFFSET(Balance!I18,0,($O$1-1)*12)","v":"-"},{"$f":"OFFSET(Balance!J18,0,($O$1-1)*12)","v":"-"},{"$f":"OFFSET(Balance!K18,0,($O$1-1)*12)","v":"-"},{"$f":"OFFSET(Balance!L18,0,($O$1-1)*12)","v":"-"},{"$f":"OFFSET(Balance!M18,0,($O$1-1)*12)","v":"-"},{"$f":"OFFSET(Balance!N18,0,($O$1-1)*12)","v":"-"},{"$f":"SUM(O18:O23)","v":27707.981199999995}]
[null,"Generación",{"$f":"OFFSET(Balance!C19,0,($O$1-1)*12)","v":21758.584219999997},{"$f":"OFFSET(Balance!D19,0,($O$1-1)*12)","v":20782.936449000001},{"$f":"OFFSET(Balance!E19,0,($O$1-1)*12)","v":23222.824800000002},{"$f":"OFFSET(Balance!F19,0,($O$1-1)*12)","v":"-"},{"$f":"OFFSET(Balance!G19,0,($O$1-1)*12)","v":"-"},{"$f":"OFFSET(Balance!H19,0,($O$1-1)*12)","v":"-"},{"$f":"OFFSET(Balance!I19,0,($O$1-1)*12)","v":"-"},{"$f":"OFFSET(Balance!J19,0,($O$1-1)*12)","v":"-"},{"$f":"OFFSET(Balance!K19,0,($O$1-1)*12)","v":"-"},{"$f":"OFFSET(Balance!L19,0,($O$1-1)*12)","v":"-"},{"$f":"OFFSET(Balance!M19,0,($O$1-1)*12)","v":"-"},{"$f":"OFFSET(Balance!N19,0,($O$1-1)*12)","v":"-"},{"$f":"IF(SUM(C27:N27)=0,\"-\",SUM(C27:N27))","v":65764.345468999993}]
[null,"Consumos en bombeo",{"$f":"OFFSET(Balance!C20,0,($O$1-1)*12)","v":-390.73397899999998},{"$f":"OFFSET(Balance!D20,0,($O$1-1)*12)","v":-253.25366200000002},{"$f":"OFFSET(Balance!E20,0,($O$1-1)*12)","v":-728.75189999999998},{"$f":"OFFSET(Balance!F20,0,($O$1-1)*12)","v":"-"},{"$f":"OFFSET(Balance!G20,0,($O$1-1)*12)","v":"-"},{"$f":"OFFSET(Balance!H20,0,($O$1-1)*12)","v":"-"},{"$f":"OFFSET(Balance!I20,0,($O$1-1)*12)","v":"-"},{"$f":"OFFSET(Balance!J20,0,($O$1-1)*12)","v":"-"},{"$f":"OFFSET(Balance!K20,0,($O$1-1)*12)","v":"-"},{"$f":"OFFSET(Balance!L20,0,($O$1-1)*12)","v":"-"},{"$f":"OFFSET(Balance!M20,0,($O$1-1)*12)","v":"-"},{"$f":"OFFSET(Balance!N20,0,($O$1-1)*12)","v":"-"},-1372.7395409999999]
[null,"Enlace Península-Baleares (6)",{"$f":"OFFSET(Balance!C21,0,($O$1-1)*12)","v":-86.203828999999999},{"$f":"OFFSET(Balance!D21,0,($O$1-1)*12)","v":-99.993399000000011},{"$f":"OFFSET(Balance!E21,0,($O$1-1)*12)","v":-90.106700000000004},{"$f":"OFFSET(Balance!F21,0,($O$1-1)*12)","v":"-"},{"$f":"OFFSET(Balance!G21,0,($O$1-1)*12)","v":"-"},{"$f":"OFFSET(Balance!H21,0,($O$1-1)*12)","v":"-"},{"$f":"OFFSET(Balance!I21,0,($O$1-1)*12)","v":"-"},{"$f":"OFFSET(Balance!J21,0,($O$1-1)*12)","v":"-"},{"$f":"OFFSET(Balance!K21,0,($O$1-1)*12)","v":"-"},{"$f":"OFFSET(Balance!L21,0,($O$1-1)*12)","v":"-"},{"$f":"OFFSET(Balance!M21,0,($O$1-1)*12)","v":"-"},{"$f":"OFFSET(Balance!N21,0,($O$1-1)*12)","v":"-"},{"$f":"IF(SUM(C29:N29)=0,\"-\",SUM(C29:N29))","v":-276.30392799999998}]
[null,"Saldo intercambios internacionales (7)",{"$f":"OFFSET(Balance!C22,0,($O$1-1)*12)","v":1340.296642},{"$f":"OFFSET(Balance!D22,0,($O$1-1)*12)","v":857.10299299999997},{"$f":"OFFSET(Balance!E22,0,($O$1-1)*12)","v":-292.80159999999995},{"$f":"OFFSET(Balance!F22,0,($O$1-1)*12)","v":"-"},{"$f":"OFFSET(Balance!G22,0,($O$1-1)*12)","v":"-"},{"$f":"OFFSET(Balance!H22,0,($O$1-1)*12)","v":"-"},{"$f":"OFFSET(Balance!I22,0,($O$1-1)*12)","v":"-"},{"$f":"OFFSET(Balance!J22,0,($O$1-1)*12)","v":"-"},{"$f":"OFFSET(Balance!K22,0,($O$1-1)*12)","v":"-"},{"$f":"OFFSET(Balance!L22,0,($O$1-1)*12)","v":"-"},{"$f":"OFFSET(Balance!M22,0,($O$1-1)*12)","v":"-"},{"$f":"OFFSET(Balance!N22,0,($O$1-1)*12)","v":"-"},1904.5980349999998]
[null,"Demanda transporte (b.c.)",{"$f":"OFFSET(Balance!C23,0,($O$1-1)*12)","v":22621.943054000003},{"$f":"OFFSET(Balance!D23,0,($O$1-1)*12)","v":21286.792380999999},{"$f":"OFFSET(Balance!E23,0,($O$1-1)*12)","v":22111.1646},{"$f":"OFFSET(Balance!F23,0,($O$1-1)*12)","v":"-"},{"$f":"OFFSET(Balance!G23,0,($O$1-1)*12)","v":"-"},{"$f":"OFFSET(Balance!H23,0,($O$1-1)*12)","v":"-"},{"$f":"OFFSET(Balance!I23,0,($O$1-1)*12)","v":"-"},{"$f":"OFFSET(Balance!J23,0,($O$1-1)*12)","v":"-"},{"$f":"OFFSET(Balance!K23,0,($O$1-1)*12)","v":"-"},{"$f":"OFFSET(Balance!L23,0,($O$1-1)*12)","v":"-"},{"$f":"OFFSET(Balance!M23,0,($O$1-1)*12)","v":"-"},{"$f":"OFFSET(Balance!N23,0,($O$1-1)*12)","v":"-"},{"$f":"IF(SUM(C31:N31)=0,\"-\",SUM(C31:N31))","v":66019.900034999999}]
[null,"(1) Asignación de unidades de producción según combustible principal."]
[null,"(2) Incluye funcionamiento en ciclo abierto."]
[null,"(3) Incluye todas aquellas unidades menores de 50 MW que no pertenecen a ninguna unidad de gestión hidráulica (UGH)."]
[null,"(4) Otras renovables incluyen biogás, biomasa, hidráulica marina y geotérmica. Los valores incluyen residuos hasta el 31/12/2014."]
[null,"(5) Incluye residuos."]
[null,"(6) Valor positivo: entrada de energía en el sistema; valor negativo: salida de energía del sistema. Enlace funcionando al mínimo técnico de seguridad hasta el 13/08/2012. "]
[null,"(7) Valor positivo: saldo importador; valor negativo: saldo exportador."]
[null,{"$f":"'Balance nacional mensual'!B38","v":"Datos definitivos hasta el 31/03/2017. Datos provisionales del 01/04/2017 al 28/02/2018. Datos programados del 01/03/2018 al 31/03/2018."}]

{"sheet":"Balance Peninsular anual","index":4,"n_rows":40,"n_cols":12,"rows_kept":40,"cut":false,"hidden":false,"merged":[[37,1,37,9],[35,1,35,9],[31,1,31,9],[32,1,32,9],[33,1,33,9],[34,1,34,9],[36,1,36,9]]}
[null,null,null,null,null,null,null,null,null,4,null,1]
[]
[]
[null,null,null,null,null,null,null,"  Sistema eléctrico"]
[null,null,null,null,null,null,null,"  Horizonte temporal"]
[null,null,null,null,null,null,null,"  Periodo"]
[]
[null,null,{"$f":"OFFSET(Balance!C107,0,($J$1-1)*8)","v":2014},{"$f":"OFFSET(Balance!D107,0,($J$1-1)*8)","v":2015},{"$f":"OFFSET(Balance!E107,0,($J$1-1)*8)","v":2016},{"$f":"OFFSET(Balance!F107,0,($J$1-1)*8)","v":2017},{"$f":"OFFSET(Balance!G107,0,($J$1-1)*8)","v":2018},{"$f":"OFFSET(Balance!H107,0,($J$1-1)*8)","v":2019},{"$f":"OFFSET(Balance!I107,0,($J$1-1)*8)","v":2020},{"$f":"OFFSET(Balance!J107,0,($J$1-1)*8)","v":2021}]
[]
[null,"Hidráulica",{"$f":"OFFSET(Balance!C108,0,($J$1-1)*8)","v":32042.878507204001},{"$f":"OFFSET(Balance!D108,0,($J$1-1)*8)","v":28322.424284850003},{"$f":"OFFSET(Balance!E108,0,($J$1-1)*8)","v":36039.153717771995},{"$f":"OFFSET(Balance!F108,0,($J$1-1)*8)","v":18360.500145036},{"$f":"OFFSET(Balance!G108,0,($J$1-1)*8)","v":8961.7111101360006},{"$f":"OFFSET(Balance!H108,0,($J$1-1)*8)","v":"-"},{"$f":"OFFSET(Balance!I108,0,($J$1-1)*8)","v":"-"},{"$f":"OFFSET(Balance!J108,0,($J$1-1)*8)","v":"-"}]
[null,"Turbinación bombeo",{"$f":"OFFSET(Balance!C109,0,($J$1-1)*8)","v":3415.9960267959996},{"$f":"OFFSET(Balance!D109,0,($J$1-1)*8)","v":2895.3657881499998},{"$f":"OFFSET(Balance!E109,0,($J$1-1)*8)","v":3134.3289102280005},{"$f":"OFFSET(Balance!F109,0,($J$1-1)*8)","v":2248.9938579640002},{"$f":"OFFSET(Balance!G109,0,($J$1-1)*8)","v":737.83555886399995},{"$f":"OFFSET(Balance!H109,0,($J$1-1)*8)","v":"-"},{"$f":"OFFSET(Balance!I109,0,($J$1-1)*8)","v":"-"},{"$f":"OFFSET(Balance!J109,0,($J$1-1)*8)","v":"-"}]
[null,"Nuclear",{"$f":"OFFSET(Balance!C110,0,($J$1-1)*8)","v":54870.239000000009},{"$f":"OFFSET(Balance!D110,0,($J$1-1)*8)","v":54754.839048000002},{"$f":"OFFSET(Balance!E110,0,($J$1-1)*8)","v":56098.972000000002},{"$f":"OFFSET(Balance!F110,0,($J$1-1)*8)","v":55608.922000000006},{"$f":"OFFSET(Balance!G110,0,($J$1-1)*8)","v":14179.739099999999},{"$f":"OFFSET(Balance!H110,0,($J$1-1)*8)","v":"-"},{"$f":"OFFSET(Balance!I110,0,($J$1-1)*8)","v":"-"},{"$f":"OFFSET(Balance!J110,0,($J$1-1)*8)","v":"-"}]
[null,"Carbón",{"$f":"OFFSET(Balance!C111,0,($J$1-1)*8)","v":41132.677000000003},{"$f":"OFFSET(Balance!D111,0,($J$1-1)*8)","v":50923.77236699999},{"$f":"OFFSET(Balance!E111,0,($J$1-1)*8)","v":35187.504000000001},{"$f":"OFFSET(Balance!F111,0,($J$1-1)*8)","v":42592.924458000009},{"$f":"OFFSET(Balance!G111,0,($J$1-1)*8)","v":7862.6734999999999},{"$f":"OFFSET(Balance!H111,0,($J$1-1)*8)","v":"-"},{"$f":"OFFSET(Balance!I111,0,($J$1-1)*8)","v":"-"},{"$f":"OFFSET(Balance!J111,0,($J$1-1)*8)","v":"-"}]
[null,"Fuel + Gas",{"$f":"OFFSET(Balance!C112,0,($J$1-1)*8)","v":0},{"$f":"OFFSET(Balance!D112,0,($J$1-1)*8)","v":0},{"$f":"OFFSET(Balance!E112,0,($J$1-1)*8)","v":0},{"$f":"OFFSET(Balance!F112,0,($J$1-1)*8)","v":0},{"$f":"OFFSET(Balance!G112,0,($J$1-1)*8)","v":0},{"$f":"OFFSET(Balance!H112,0,($J$1-1)*8)","v":"-"},{"$f":"OFFSET(Balance!I112,0,($J$1-1)*8)","v":"-"},{"$f":"OFFSET(Balance!J112,0,($J$1-1)*8)","v":"-"}]
[null,"Ciclo combinado (2)",{"$f":"OFFSET(Balance!C113,0,($J$1-1)*8)","v":21336.753903000001},{"$f":"OFFSET(Balance!D113,0,($J$1-1)*8)","v":25268.468001999998},{"$f":"OFFSET(Balance!E113,0,($J$1-1)*8)","v":25686.148787999999},{"$f":"OFFSET(Balance!F113,0,($J$1-1)*8)","v":33854.527929999997},{"$f":"OFFSET(Balance!G113,0,($J$1-1)*8)","v":5470.1787999999997},{"$f":"OFFSET(Balance!H113,0,($J$1-1)*8)","v":"-"},{"$f":"OFFSET(Balance!I113,0,($J$1-1)*8)","v":"-"},{"$f":"OFFSET(Balance!J113,0,($J$1-1)*8)","v":"-"}]
[null,"Régimen ordinario",{"$f":"OFFSET(Balance!C114,0,($L$1-1)*8)","v":134378.67300000001},{"$f":"OFFSET(Balance!D114,0,($L$1-1)*8)","v":138739.239},{"$f":"OFFSET(Balance!E114,0,($L$1-1)*8)","v":139159.899},{"$f":"OFFSET(Balance!F114,0,($L$1-1)*8)","v":136129.52899999998},{"$f":"OFFSET(Balance!G114,0,($L$1-1)*8)","v":137533.13500000001},{"$f":"OFFSET(Balance!H114,0,($L$1-1)*8)","v":139730.269},{"$f":"OFFSET(Balance!I114,0,($L$1-1)*8)","v":143015.33499999999},{"$f":"OFFSET(Balance!J114,0,($L$1-1)*8)","v":151034.57399999999}]
[]
[null,"Resto hidráulica (3)",{"$f":"OFFSET(Balance!C115,0,($J$1-1)*8)","v":7069.52},{"$f":"OFFSET(Balance!D115,0,($J$1-1)*8)","v":"-"},{"$f":"OFFSET(Balance!E115,0,($J$1-1)*8)","v":"-"},{"$f":"OFFSET(Balance!F115,0,($J$1-1)*8)","v":"-"},{"$f":"OFFSET(Balance!G115,0,($J$1-1)*8)","v":"-"},{"$f":"OFFSET(Balance!H115,0,($J$1-1)*8)","v":"-"},{"$f":"OFFSET(Balance!I115,0,($J$1-1)*8)","v":"-"},{"$f":"OFFSET(Balance!J115,0,($J$1-1)*8)","v":"-"}]
[null,"Eólica",{"$f":"OFFSET(Balance!C116,0,($J$1-1)*8)","v":50634.89},{"$f":"OFFSET(Balance!D116,0,($J$1-1)*8)","v":47713.149999999994},{"$f":"OFFSET(Balance!E116,0,($J$1-1)*8)","v":47298.170000000006},{"$f":"OFFSET(Balance!F116,0,($J$1-1)*8)","v":47498.142000000007},{"$f":"OFFSET(Balance!G116,0,($J$1-1)*8)","v":17589.002293999998},{"$f":"OFFSET(Balance!H116,0,($J$1-1)*8)","v":"-"},{"$f":"OFFSET(Balance!I116,0,($J$1-1)*8)","v":"-"},{"$f":"OFFSET(Balance!J116,0,($J$1-1)*8)","v":"-"}]
[null,"Solar fotovoltaica",{"$f":"OFFSET(Balance!C117,0,($J$1-1)*8)","v":7802.4239999999991},{"$f":"OFFSET(Balance!D117,0,($J$1-1)*8)","v":7844.7979999999998},{"$f":"OFFSET(Balance!E117,0,($J$1-1)*8)","v":7579.3129999999992},{"$f":"OFFSET(Balance!F117,0,($J$1-1)*8)","v":7988.2159999999985},{"$f":"OFFSET(Balance!G117,0,($J$1-1)*8)","v":1454.348},{"$f":"OFFSET(Balance!H117,0,($J$1-1)*8)","v":"-"},{"$f":"OFFSET(Balance!I117,0,($J$1-1)*8)","v":"-"},{"$f":"OFFSET(Balance!J117,0,($J$1-1)*8)","v":"-"}]
[null,"Solar térmica",{"$f":"OFFSET(Balance!C118,0,($J$1-1)*8)","v":4958.9149999999991},{"$f":"OFFSET(Balance!D118,0,($J$1-1)*8)","v":5085.2350000000006},{"$f":"OFFSET(Balance!E118,0,($J$1-1)*8)","v":5071.2040000000006},{"$f":"OFFSET(Balance!F118,0,($J$1-1)*8)","v":5347.9489999999996},{"$f":"OFFSET(Balance!G118,0,($J$1-1)*8)","v":570.10159999999996},{"$f":"OFFSET(Balance!H118,0,($J$1-1)*8)","v":"-"},{"$f":"OFFSET(Balance!I118,0,($J$1-1)*8)","v":"-"},{"$f":"OFFSET(Balance!J118,0,($J$1-1)*8)","v":"-"}]
[null,"Térmica renovable(4)/Otras renovables",{"$f":"OFFSET(Balance!C119,0,($J$1-1)*8)","v":4717.9780000000001},{"$f":"OFFSET(Balance!D119,0,($J$1-1)*8)","v":3173.951},{"$f":"OFFSET(Balance!E119,0,($J$1-1)*8)","v":3413.9139999999998},{"$f":"OFFSET(Balance!F119,0,($J$1-1)*8)","v":3602.913},{"$f":"OFFSET(Balance!G119,0,($J$1-1)*8)","v":877.30560000000003},{"$f":"OFFSET(Balance!H119,0,($J$1-1)*8)","v":"-"},{"$f":"OFFSET(Balance!I119,0,($J$1-1)*8)","v":"-"},{"$f":"OFFSET(Balance!J119,0,($J$1-1)*8)","v":"-"}]
[null,"Cogeneración y resto(4)/Cogeneración",{"$f":"OFFSET(Balance!C120,0,($J$1-1)*8)","v":25595.536},{"$f":"OFFSET(Balance!D120,0,($J$1-1)*8)","v":25417.974999999999},{"$f":"OFFSET(Balance!E120,0,($J$1-1)*8)","v":25871.911999999997},{"$f":"OFFSET(Balance!F120,0,($J$1-1)*8)","v":28134.275999999998},{"$f":"OFFSET(Balance!G120,0,($J$1-1)*8)","v":7217.2237059999989},{"$f":"OFFSET(Balance!H120,0,($J$1-1)*8)","v":"-"},{"$f":"OFFSET(Balance!I120,0,($J$1-1)*8)","v":"-"},{"$f":"OFFSET(Balance!J120,0,($J$1-1)*8)","v":"-"}]
[null,"Residuos no renovables",{"$f":"OFFSET(Balance!C121,0,($J$1-1)*8)","v":"-"},{"$f":"OFFSET(Balance!D121,0,($J$1-1)*8)","v":2324.7159999999999},{"$f":"OFFSET(Balance!E121,0,($J$1-1)*8)","v":2471.3094999999998},{"$f":"OFFSET(Balance!F121,0,($J$1-1)*8)","v":2458.8085000000001},{"$f":"OFFSET(Balance!G121,0,($J$1-1)*8)","v":646.07664999999997},{"$f":"OFFSET(Balance!H121,0,($J$1-1)*8)","v":"-"},{"$f":"OFFSET(Balance!I121,0,($J$1-1)*8)","v":"-"},{"$f":"OFFSET(Balance!J121,0,($J$1-1)*8)","v":"-"}]
[null,"Residuos renovables",{"$f":"OFFSET(Balance!C122,0,($J$1-1)*8)","v":"-"},{"$f":"OFFSET(Balance!D122,0,($J$1-1)*8)","v":662.65500000000009},{"$f":"OFFSET(Balance!E122,0,($J$1-1)*8)","v":649.74149999999997},{"$f":"OFFSET(Balance!F122,0,($J$1-1)*8)","v":728.15049999999997},{"$f":"OFFSET(Balance!G122,0,($J$1-1)*8)","v":198.14954999999998},{"$f":"OFFSET(Balance!H122,0,($J$1-1)*8)","v":"-"},{"$f":"OFFSET(Balance!I122,0,($J$1-1)*8)","v":"-"},{"$f":"OFFSET(Balance!J122,0,($J$1-1)*8)","v":"-"}]
[null,"Régimen especial",{"$f":"OFFSET(Balance!C123,0,($L$1-1)*8)","v":1639.6760000000002},{"$f":"OFFSET(Balance!D123,0,($L$1-1)*8)","v":3144.4839999999999},{"$f":"OFFSET(Balance!E123,0,($L$1-1)*8)","v":4030.6210000000001},{"$f":"OFFSET(Balance!F123,0,($L$1-1)*8)","v":5697.3220000000001},{"$f":"OFFSET(Balance!G123,0,($L$1-1)*8)","v":8197.8649999999998},{"$f":"OFFSET(Balance!H123,0,($L$1-1)*8)","v":9595.8150000000005},{"$f":"OFFSET(Balance!I123,0,($L$1-1)*8)","v":13655.767},{"$f":"OFFSET(Balance!J123,0,($L$1-1)*8)","v":16160.997999999998}]
[null,"Generación",{"$f":"OFFSET(Balance!C124,0,($J$1-1)*8)","v":253577.80743699998},{"$f":"OFFSET(Balance!D124,0,($J$1-1)*8)","v":254387.34949000002},{"$f":"OFFSET(Balance!E124,0,($J$1-1)*8)","v":248501.67141600003},{"$f":"OFFSET(Balance!F124,0,($J$1-1)*8)","v":248424.32339100001},{"$f":"OFFSET(Balance!G124,0,($J$1-1)*8)","v":65764.345468999993},{"$f":"OFFSET(Balance!H124,0,($J$1-1)*8)","v":"-"},{"$f":"OFFSET(Balance!I124,0,($J$1-1)*8)","v":"-"},{"$f":"OFFSET(Balance!J124,0,($J$1-1)*8)","v":"-"}]
[null,"Consumos en bombeo",{"$f":"OFFSET(Balance!C125,0,($J$1-1)*8)","v":-5329.5900510000001},{"$f":"OFFSET(Balance!D125,0,($J$1-1)*8)","v":-4520.0941789999997},{"$f":"OFFSET(Balance!E125,0,($J$1-1)*8)","v":-4819.4130750000004},{"$f":"OFFSET(Balance!F125,0,($J$1-1)*8)","v":-3675.2379039999996},{"$f":"OFFSET(Balance!G125,0,($J$1-1)*8)","v":-1372.7395409999999},{"$f":"OFFSET(Balance!H125,0,($J$1-1)*8)","v":"-"},{"$f":"OFFSET(Balance!I125,0,($J$1-1)*8)","v":"-"},{"$f":"OFFSET(Balance!J125,0,($J$1-1)*8)","v":"-"}]
[null,"Enlace Península-Baleares (6)",{"$f":"OFFSET(Balance!C126,0,($J$1-1)*8)","v":-1298.2644039999998},{"$f":"OFFSET(Balance!D126,0,($J$1-1)*8)","v":-1335.7828019999999},{"$f":"OFFSET(Balance!E126,0,($J$1-1)*8)","v":-1250.5825009999999},{"$f":"OFFSET(Balance!F126,0,($J$1-1)*8)","v":-1179.300653},{"$f":"OFFSET(Balance!G126,0,($J$1-1)*8)","v":-276.30392799999998},{"$f":"OFFSET(Balance!H126,0,($J$1-1)*8)","v":"-"},{"$f":"OFFSET(Balance!I126,0,($J$1-1)*8)","v":"-"},{"$f":"OFFSET(Balance!J126,0,($J$1-1)*8)","v":"-"}]
[null,"Saldo intercambios internacionales (7)",{"$f":"OFFSET(Balance!C127,0,($J$1-1)*8)","v":-3406.1249290000001},{"$f":"OFFSET(Balance!D127,0,($J$1-1)*8)","v":-133.16322499999978},{"$f":"OFFSET(Balance!E127,0,($J$1-1)*8)","v":7667.313553},{"$f":"OFFSET(Balance!F127,0,($J$1-1)*8)","v":9170.5836430000018},{"$f":"OFFSET(Balance!G127,0,($J$1-1)*8)","v":1904.5980349999998},{"$f":"OFFSET(Balance!H127,0,($J$1-1)*8)","v":"-"},{"$f":"OFFSET(Balance!I127,0,($J$1-1)*8)","v":"-"},{"$f":"OFFSET(Balance!J127,0,($J$1-1)*8)","v":"-"}]
[null,"Demanda transporte (b.c.)",{"$f":"OFFSET(Balance!C128,0,($J$1-1)*8)","v":243543.82805299998},{"$f":"OFFSET(Balance!D128,0,($J$1-1)*8)","v":248398.30928400002},{"$f":"OFFSET(Balance!E128,0,($J$1-1)*8)","v":250098.98939300003},{"$f":"OFFSET(Balance!F128,0,($J$1-1)*8)","v":252740.36847699998},{"$f":"OFFSET(Balance!G128,0,($J$1-1)*8)","v":66019.900034999984},{"$f":"OFFSET(Balance!H128,0,($J$1-1)*8)","v":"-"},{"$f":"OFFSET(Balance!I128,0,($J$1-1)*8)","v":"-"},{"$f":"OFFSET(Balance!J128,0,($J$1-1)*8)","v":"-"}]
[null,"(1) Asignación de unidades de producción según combustible principal."]
[null,"(2) Incluye funcionamiento en ciclo abierto."]
[null,"(3) Incluye todas aquellas unidades menores de 50 MW que no pertenecen a ninguna unidad de gestión hidráulica (UGH)."]
[null,"(4) Incluye residuos hasta el 31/12/2014."]
[null,"(5) Incluye biogás, biomasa, hidráulica marina y geotérmica."]
[null,"(6) Valor positivo: entrada de energía en el sistema; valor negativo: salida de energía del sistema. Enlace funcionando al mínimo técnico de seguridad hasta el 13/08/2012. "]
[null,"(7) Valor positivo: saldo importador; valor negativo: saldo exportador."]
[null,{"$f":"IF(MONTH(FACT)=1,\"\",CONCATENATE(\"Para el año \",YEAR(FACT), \" valores acumulados hasta \",TEXT(FACT-30,\"mmmm\"),\" de \",YEAR(FACT),\".\"))","v":"Para el año 2018 valores acumulados hasta marzo de 2018."}]
[null,{"$f":"'Balance nacional mensual'!B38","v":"Datos definitivos hasta el 31/03/2017. Datos provisionales del 01/04/2017 al 28/02/2018. Datos programados del 01/03/2018 al 31/03/2018."}]

{"sheet":"Balance Baleares mensual","index":5,"n_rows":33,"n_cols":15,"rows_kept":33,"cut":false,"hidden":false,"merged":[[32,1,32,8],[31,1,31,14],[27,1,27,14],[28,1,28,14],[29,1,29,14],[30,1,30,12]]}
[null,null,null,null,null,null,null,null,null,null,null,null,null,null,13]
[]
[]
[null,null,null,null,null,null,null,null,null,null,null,null,"Sistema eléctrico"]
[null,null,null,null,null,null,null,null,null,null,null,null,"Horizonte temporal"]
[null,null,null,null,null,null,null,null,null,null,null,null,"Periodo"]
[]
[null,null,"Ene.","Feb.","Mar.","Abr.","May.","Jun.","Jul.","Ago.","Sep.","Oct.","Nov.","Dic.",{"$f":"OFFSET(Año!C18,($O$1-1),0)","v":2018}]
[]
[null,"Carbón",{"$f":"OFFSET(Balance!C26,0,($O$1-1)*12)","v":198554.986},{"$f":"OFFSET(Balance!D26,0,($O$1-1)*12)","v":192794.891},{"$f":"OFFSET(Balance!E26,0,($O$1-1)*12)","v":200215.908},{"$f":"OFFSET(Balance!F26,0,($O$1-1)*12)","v":"-"},{"$f":"OFFSET(Balance!G26,0,($O$1-1)*12)","v":"-"},{"$f":"OFFSET(Balance!H26,0,($O$1-1)*12)","v":"-"},{"$f":"OFFSET(Balance!I26,0,($O$1-1)*12)","v":"-"},{"$f":"OFFSET(Balance!J26,0,($O$1-1)*12)","v":"-"},{"$f":"OFFSET(Balance!K26,0,($O$1-1)*12)","v":"-"},{"$f":"OFFSET(Balance!L26,0,($O$1-1)*12)","v":"-"},{"$f":"OFFSET(Balance!M26,0,($O$1-1)*12)","v":"-"},{"$f":"OFFSET(Balance!N26,0,($O$1-1)*12)","v":"-"},{"$f":"IF(SUM(C10:N10)=0,\"-\",SUM(C10:N10))","v":591565.78499999992}]
[null,"Motores diesel",{"$f":"OFFSET(Balance!C27,0,($O$1-1)*12)","v":35374.103000000003},{"$f":"OFFSET(Balance!D27,0,($O$1-1)*12)","v":39245.296999999999},{"$f":"OFFSET(Balance!E27,0,($O$1-1)*12)","v":40276.341},{"$f":"OFFSET(Balance!F27,0,($O$1-1)*12)","v":"-"},{"$f":"OFFSET(Balance!G27,0,($O$1-1)*12)","v":"-"},{"$f":"OFFSET(Balance!H27,0,($O$1-1)*12)","v":"-"},{"$f":"OFFSET(Balance!I27,0,($O$1-1)*12)","v":"-"},{"$f":"OFFSET(Balance!J27,0,($O$1-1)*12)","v":"-"},{"$f":"OFFSET(Balance!K27,0,($O$1-1)*12)","v":"-"},{"$f":"OFFSET(Balance!L27,0,($O$1-1)*12)","v":"-"},{"$f":"OFFSET(Balance!M27,0,($O$1-1)*12)","v":"-"},{"$f":"OFFSET(Balance!N27,0,($O$1-1)*12)","v":"-"},114895.74099999999]
[null,"Turbina de gas",{"$f":"OFFSET(Balance!C28,0,($O$1-1)*12)","v":59556.201999999997},{"$f":"OFFSET(Balance!D28,0,($O$1-1)*12)","v":59632.27},{"$f":"OFFSET(Balance!E28,0,($O$1-1)*12)","v":61588.868000000002},{"$f":"OFFSET(Balance!F28,0,($O$1-1)*12)","v":"-"},{"$f":"OFFSET(Balance!G28,0,($O$1-1)*12)","v":"-"},{"$f":"OFFSET(Balance!H28,0,($O$1-1)*12)","v":"-"},{"$f":"OFFSET(Balance!I28,0,($O$1-1)*12)","v":"-"},{"$f":"OFFSET(Balance!J28,0,($O$1-1)*12)","v":"-"},{"$f":"OFFSET(Balance!K28,0,($O$1-1)*12)","v":"-"},{"$f":"OFFSET(Balance!L28,0,($O$1-1)*12)","v":"-"},{"$f":"OFFSET(Balance!M28,0,($O$1-1)*12)","v":"-"},{"$f":"OFFSET(Balance!N28,0,($O$1-1)*12)","v":"-"},180777.34]
[null,"Fuel + Gas",{"$f":"OFFSET(Balance!C29,0,($O$1-1)*12)","v":94930.304999999993},{"$f":"OFFSET(Balance!D29,0,($O$1-1)*12)","v":98877.566999999995},{"$f":"OFFSET(Balance!E29,0,($O$1-1)*12)","v":101865.209},{"$f":"OFFSET(Balance!F29,0,($O$1-1)*12)","v":"-"},{"$f":"OFFSET(Balance!G29,0,($O$1-1)*12)","v":"-"},{"$f":"OFFSET(Balance!H29,0,($O$1-1)*12)","v":"-"},{"$f":"OFFSET(Balance!I29,0,($O$1-1)*12)","v":"-"},{"$f":"OFFSET(Balance!J29,0,($O$1-1)*12)","v":"-"},{"$f":"OFFSET(Balance!K29,0,($O$1-1)*12)","v":"-"},{"$f":"OFFSET(Balance!L29,0,($O$1-1)*12)","v":"-"},{"$f":"OFFSET(Balance!M29,0,($O$1-1)*12)","v":"-"},{"$f":"OFFSET(Balance!N29,0,($O$1-1)*12)","v":"-"},{"$f":"SUM(O11:O12)","v":295673.08100000001}]
[null,"Ciclo combinado (2)",{"$f":"OFFSET(Balance!C30,0,($O$1-1)*12)","v":31199.050999999999},{"$f":"OFFSET(Balance!D30,0,($O$1-1)*12)","v":48598.584000000003},{"$f":"OFFSET(Balance!E30,0,($O$1-1)*12)","v":38884.349000000002},{"$f":"OFFSET(Balance!F30,0,($O$1-1)*12)","v":"-"},{"$f":"OFFSET(Balance!G30,0,($O$1-1)*12)","v":"-"},{"$f":"OFFSET(Balance!H30,0,($O$1-1)*12)","v":"-"},{"$f":"OFFSET(Balance!I30,0,($O$1-1)*12)","v":"-"},{"$f":"OFFSET(Balance!J30,0,($O$1-1)*12)","v":"-"},{"$f":"OFFSET(Balance!K30,0,($O$1-1)*12)","v":"-"},{"$f":"OFFSET(Balance!L30,0,($O$1-1)*12)","v":"-"},{"$f":"OFFSET(Balance!M30,0,($O$1-1)*12)","v":"-"},{"$f":"OFFSET(Balance!N30,0,($O$1-1)*12)","v":"-"},{"$f":"IF(SUM(C14:N14)=0,\"-\",SUM(C14:N14))","v":118681.98400000001}]
[null,"Generación auxiliar (3)",{"$f":"OFFSET(Balance!C31,0,($O$1-1)*12)","v":0},{"$f":"OFFSET(Balance!D31,0,($O$1-1)*12)","v":0},{"$f":"OFFSET(Balance!E31,0,($O$1-1)*12)","v":0},{"$f":"OFFSET(Balance!F31,0,($O$1-1)*12)","v":"-"},{"$f":"OFFSET(Balance!G31,0,($O$1-1)*12)","v":"-"},{"$f":"OFFSET(Balance!H31,0,($O$1-1)*12)","v":"-"},{"$f":"OFFSET(Balance!I31,0,($O$1-1)*12)","v":"-"},{"$f":"OFFSET(Balance!J31,0,($O$1-1)*12)","v":"-"},{"$f":"OFFSET(Balance!K31,0,($O$1-1)*12)","v":"-"},{"$f":"OFFSET(Balance!L31,0,($O$1-1)*12)","v":"-"},{"$f":"OFFSET(Balance!M31,0,($O$1-1)*12)","v":"-"},{"$f":"OFFSET(Balance!N31,0,($O$1-1)*12)","v":"-"},{"$f":"IF(SUM(C15:N15)=0,\"-\",SUM(C15:N15))","v":"-"}]
[null,"Régimen ordinario",{"$f":"OFFSET(Balance!C32,0,($O$1-1)*12)","v":"-"},{"$f":"OFFSET(Balance!D32,0,($O$1-1)*12)","v":"-"},{"$f":"OFFSET(Balance!E32,0,($O$1-1)*12)","v":"-"},{"$f":"OFFSET(Balance!F32,0,($O$1-1)*12)","v":"-"},{"$f":"OFFSET(Balance!G32,0,($O$1-1)*12)","v":"-"},{"$f":"OFFSET(Balance!H32,0,($O$1-1)*12)","v":"-"},{"$f":"OFFSET(Balance!I32,0,($O$1-1)*12)","v":"-"},{"$f":"OFFSET(Balance!J32,0,($O$1-1)*12)","v":"-"},{"$f":"OFFSET(Balance!K32,0,($O$1-1)*12)","v":"-"},{"$f":"OFFSET(Balance!L32,0,($O$1-1)*12)","v":"-"},{"$f":"OFFSET(Balance!M32,0,($O$1-1)*12)","v":"-"},{"$f":"OFFSET(Balance!N32,0,($O$1-1)*12)","v":"-"},{"$f":"SUM(O10,O13:O15)","v":1005920.85}]
[]
[null,"Eólica",{"$f":"OFFSET(Balance!C33,0,($O$1-1)*12)","v":253},{"$f":"OFFSET(Balance!D33,0,($O$1-1)*12)","v":324},{"$f":"OFFSET(Balance!E33,0,($O$1-1)*12)","v":368.49},{"$f":"OFFSET(Balance!F33,0,($O$1-1)*12)","v":"-"},{"$f":"OFFSET(Balance!G33,0,($O$1-1)*12)","v":"-"},{"$f":"OFFSET(Balance!H33,0,($O$1-1)*12)","v":"-"},{"$f":"OFFSET(Balance!I33,0,($O$1-1)*12)","v":"-"},{"$f":"OFFSET(Balance!J33,0,($O$1-1)*12)","v":"-"},{"$f":"OFFSET(Balance!K33,0,($O$1-1)*12)","v":"-"},{"$f":"OFFSET(Balance!L33,0,($O$1-1)*12)","v":"-"},{"$f":"OFFSET(Balance!M33,0,($O$1-1)*12)","v":"-"},{"$f":"OFFSET(Balance!N33,0,($O$1-1)*12)","v":"-"},945.49]
[null,"Solar fotovoltaica",{"$f":"OFFSET(Balance!C34,0,($O$1-1)*12)","v":7015},{"$f":"OFFSET(Balance!D34,0,($O$1-1)*12)","v":5358},{"$f":"OFFSET(Balance!E34,0,($O$1-1)*12)","v":9721},{"$f":"OFFSET(Balance!F34,0,($O$1-1)*12)","v":"-"},{"$f":"OFFSET(Balance!G34,0,($O$1-1)*12)","v":"-"},{"$f":"OFFSET(Balance!H34,0,($O$1-1)*12)","v":"-"},{"$f":"OFFSET(Balance!I34,0,($O$1-1)*12)","v":"-"},{"$f":"OFFSET(Balance!J34,0,($O$1-1)*12)","v":"-"},{"$f":"OFFSET(Balance!K34,0,($O$1-1)*12)","v":"-"},{"$f":"OFFSET(Balance!L34,0,($O$1-1)*12)","v":"-"},{"$f":"OFFSET(Balance!M34,0,($O$1-1)*12)","v":"-"},{"$f":"OFFSET(Balance!N34,0,($O$1-1)*12)","v":"-"},22094]
[null,"Otras renovables ",{"$f":"OFFSET(Balance!C35,0,($O$1-1)*12)","v":219},{"$f":"OFFSET(Balance!D35,0,($O$1-1)*12)","v":166},{"$f":"OFFSET(Balance!E35,0,($O$1-1)*12)","v":221.07},{"$f":"OFFSET(Balance!F35,0,($O$1-1)*12)","v":"-"},{"$f":"OFFSET(Balance!G35,0,($O$1-1)*12)","v":"-"},{"$f":"OFFSET(Balance!H35,0,($O$1-1)*12)","v":"-"},{"$f":"OFFSET(Balance!I35,0,($O$1-1)*12)","v":"-"},{"$f":"OFFSET(Balance!J35,0,($O$1-1)*12)","v":"-"},{"$f":"OFFSET(Balance!K35,0,($O$1-1)*12)","v":"-"},{"$f":"OFFSET(Balance!L35,0,($O$1-1)*12)","v":"-"},{"$f":"OFFSET(Balance!M35,0,($O$1-1)*12)","v":"-"},{"$f":"OFFSET(Balance!N35,0,($O$1-1)*12)","v":"-"},606.06999999999994]
[null,"Cogeneración",{"$f":"OFFSET(Balance!C36,0,($O$1-1)*12)","v":3183},{"$f":"OFFSET(Balance!D36,0,($O$1-1)*12)","v":3084},{"$f":"OFFSET(Balance!E36,0,($O$1-1)*12)","v":2395.4899999999998},{"$f":"OFFSET(Balance!F36,0,($O$1-1)*12)","v":"-"},{"$f":"OFFSET(Balance!G36,0,($O$1-1)*12)","v":"-"},{"$f":"OFFSET(Balance!H36,0,($O$1-1)*12)","v":"-"},{"$f":"OFFSET(Balance!I36,0,($O$1-1)*12)","v":"-"},{"$f":"OFFSET(Balance!J36,0,($O$1-1)*12)","v":"-"},{"$f":"OFFSET(Balance!K36,0,($O$1-1)*12)","v":"-"},{"$f":"OFFSET(Balance!L36,0,($O$1-1)*12)","v":"-"},{"$f":"OFFSET(Balance!M36,0,($O$1-1)*12)","v":"-"},{"$f":"OFFSET(Balance!N36,0,($O$1-1)*12)","v":"-"},8662.49]
[null,"Residuos no renovables",{"$f":"OFFSET(Balance!C37,0,($O$1-1)*12)","v":7481.5},{"$f":"OFFSET(Balance!D37,0,($O$1-1)*12)","v":4456},{"$f":"OFFSET(Balance!E37,0,($O$1-1)*12)","v":11877},{"$f":"OFFSET(Balance!F37,0,($O$1-1)*12)","v":"-"},{"$f":"OFFSET(Balance!G37,0,($O$1-1)*12)","v":"-"},{"$f":"OFFSET(Balance!H37,0,($O$1-1)*12)","v":"-"},{"$f":"OFFSET(Balance!I37,0,($O$1-1)*12)","v":"-"},{"$f":"OFFSET(Balance!J37,0,($O$1-1)*12)","v":"-"},{"$f":"OFFSET(Balance!K37,0,($O$1-1)*12)","v":"-"},{"$f":"OFFSET(Balance!L37,0,($O$1-1)*12)","v":"-"},{"$f":"OFFSET(Balance!M37,0,($O$1-1)*12)","v":"-"},{"$f":"OFFSET(Balance!N37,0,($O$1-1)*12)","v":"-"},{"$f":"IF(SUM(C22:N22)=0,\"-\",SUM(C22:N22))","v":23814.5}]
[null,"Residuos renovables",{"$f":"OFFSET(Balance!C38,0,($O$1-1)*12)","v":7481.5},{"$f":"OFFSET(Balance!D38,0,($O$1-1)*12)","v":4456},{"$f":"OFFSET(Balance!E38,0,($O$1-1)*12)","v":11877},{"$f":"OFFSET(Balance!F38,0,($O$1-1)*12)","v":"-"},{"$f":"OFFSET(Balance!G38,0,($O$1-1)*12)","v":"-"},{"$f":"OFFSET(Balance!H38,0,($O$1-1)*12)","v":"-"},{"$f":"OFFSET(Balance!I38,0,($O$1-1)*12)","v":"-"},{"$f":"OFFSET(Balance!J38,0,($O$1-1)*12)","v":"-"},{"$f":"OFFSET(Balance!K38,0,($O$1-1)*12)","v":"-"},{"$f":"OFFSET(Balance!L38,0,($O$1-1)*12)","v":"-"},{"$f":"OFFSET(Balance!M38,0,($O$1-1)*12)","v":"-"},{"$f":"OFFSET(Balance!N38,0,($O$1-1)*12)","v":"-"},{"$f":"IF(SUM(C23:N23)=0,\"-\",SUM(C23:N23))","v":23814.5}]
[null,"Régimen especial",{"$f":"OFFSET(Balance!C39,0,($O$1-1)*12)","v":"-"},{"$f":"OFFSET(Balance!D39,0,($O$1-1)*12)","v":"-"},{"$f":"OFFSET(Balance!E39,0,($O$1-1)*12)","v":"-"},{"$f":"OFFSET(Balance!F39,0,($O$1-1)*12)","v":"-"},{"$f":"OFFSET(Balance!G39,0,($O$1-1)*12)","v":"-"},{"$f":"OFFSET(Balance!H39,0,($O$1-1)*12)","v":"-"},{"$f":"OFFSET(Balance!I39,0,($O$1-1)*12)","v":"-"},{"$f":"OFFSET(Balance!J39,0,($O$1-1)*12)","v":"-"},{"$f":"OFFSET(Balance!K39,0,($O$1-1)*12)","v":"-"},{"$f":"OFFSET(Balance!L39,0,($O$1-1)*12)","v":"-"},{"$f":"OFFSET(Balance!M39,0,($O$1-1)*12)","v":"-"},{"$f":"OFFSET(Balance!N39,0,($O$1-1)*12)","v":"-"},{"$f":"SUM(O18:O23)","v":79937.05}]
[null,"Generación",{"$f":"OFFSET(Balance!C40,0,($O$1-1)*12)","v":350317.342},{"$f":"OFFSET(Balance!D40,0,($O$1-1)*12)","v":358115.04200000002},{"$f":"OFFSET(Balance!E40,0,($O$1-1)*12)","v":377425.516},{"$f":"OFFSET(Balance!F40,0,($O$1-1)*12)","v":"-"},{"$f":"OFFSET(Balance!G40,0,($O$1-1)*12)","v":"-"},{"$f":"OFFSET(Balance!H40,0,($O$1-1)*12)","v":"-"},{"$f":"OFFSET(Balance!I40,0,($O$1-1)*12)","v":"-"},{"$f":"OFFSET(Balance!J40,0,($O$1-1)*12)","v":"-"},{"$f":"OFFSET(Balance!K40,0,($O$1-1)*12)","v":"-"},{"$f":"OFFSET(Balance!L40,0,($O$1-1)*12)","v":"-"},{"$f":"OFFSET(Balance!M40,0,($O$1-1)*12)","v":"-"},{"$f":"OFFSET(Balance!N40,0,($O$1-1)*12)","v":"-"},{"$f":"SUM(O16:O17,O24)","v":1085857.8999999999}]
[null,"Enlace Península-Baleares (5)",{"$f":"OFFSET(Balance!C41,0,($O$1-1)*12)","v":86203.828999999998},{"$f":"OFFSET(Balance!D41,0,($O$1-1)*12)","v":99993.399000000005},{"$f":"OFFSET(Balance!E41,0,($O$1-1)*12)","v":90106.7},{"$f":"OFFSET(Balance!F41,0,($O$1-1)*12)","v":"-"},{"$f":"OFFSET(Balance!G41,0,($O$1-1)*12)","v":"-"},{"$f":"OFFSET(Balance!H41,0,($O$1-1)*12)","v":"-"},{"$f":"OFFSET(Balance!I41,0,($O$1-1)*12)","v":"-"},{"$f":"OFFSET(Balance!J41,0,($O$1-1)*12)","v":"-"},{"$f":"OFFSET(Balance!K41,0,($O$1-1)*12)","v":"-"},{"$f":"OFFSET(Balance!L41,0,($O$1-1)*12)","v":"-"},{"$f":"OFFSET(Balance!M41,0,($O$1-1)*12)","v":"-"},{"$f":"OFFSET(Balance!N41,0,($O$1-1)*12)","v":"-"},276303.92800000001]
[null,"Demanda transporte (b.c.)",{"$f":"OFFSET(Balance!C42,0,($O$1-1)*12)","v":436521.17099999997},{"$f":"OFFSET(Balance!D42,0,($O$1-1)*12)","v":458108.44099999999},{"$f":"OFFSET(Balance!E42,0,($O$1-1)*12)","v":467532.21600000001},{"$f":"OFFSET(Balance!F42,0,($O$1-1)*12)","v":"-"},{"$f":"OFFSET(Balance!G42,0,($O$1-1)*12)","v":"-"},{"$f":"OFFSET(Balance!H42,0,($O$1-1)*12)","v":"-"},{"$f":"OFFSET(Balance!I42,0,($O$1-1)*12)","v":"-"},{"$f":"OFFSET(Balance!J42,0,($O$1-1)*12)","v":"-"},{"$f":"OFFSET(Balance!K42,0,($O$1-1)*12)","v":"-"},{"$f":"OFFSET(Balance!L42,0,($O$1-1)*12)","v":"-"},{"$f":"OFFSET(Balance!M42,0,($O$1-1)*12)","v":"-"},{"$f":"OFFSET(Balance!N42,0,($O$1-1)*12)","v":"-"},{"$f":"SUM(O25:O26)","v":1362161.828}]
[null,"(1) Asignación de unidades de producción según combustible principal."]
[null,"(2) Incluye funcionamiento en ciclo abierto."]
[null,"(3) Grupos de emergencia que se instalan de forma transitoria en determinadas zonas para cubrir un déficit de generación."]
[null,"(4) Incluye residuos."]
[null,"(5) Valor positivo: entrada de energía en el sistema; valor negativo: salida de energía del sistema. Enlace funcionando al mínimo técnico de seguridad hasta el 13/08/2012. "]
[null,{"$f":"'Balance nacional mensual'!B38","v":"Datos definitivos hasta el 31/03/2017. Datos provisionales del 01/04/2017 al 28/02/2018. Datos programados del 01/03/2018 al 31/03/2018."}]

{"sheet":"Balance Baleares anual","index":6,"n_rows":35,"n_cols":10,"rows_kept":35,"cut":false,"hidden":false,"merged":[[27,1,27,11],[28,1,28,11],[29,1,29,11],[32,1,32,11],[30,1,30,14],[31,1,31,14]]}
[null,null,null,null,null,null,null,null,null,2]
[]
[]
[null,null,null,null,null,null,null,null,"Sistema eléctrico"]
[null,null,null,null,null,null,null,null,"Horizonte temporal"]
[null,null,null,null,null,null,null,null,"Periodo"]
[]
[null,null,{"$f":"OFFSET(Balance!C130,0,($J$1-1)*8)","v":2014},{"$f":"OFFSET(Balance!D130,0,($J$1-1)*8)","v":2015},{"$f":"OFFSET(Balance!E130,0,($J$1-1)*8)","v":2016},{"$f":"OFFSET(Balance!F130,0,($J$1-1)*8)","v":2017},{"$f":"OFFSET(Balance!G130,0,($J$1-1)*8)","v":2018},{"$f":"OFFSET(Balance!H130,0,($J$1-1)*8)","v":2019},{"$f":"OFFSET(Balance!I130,0,($J$1-1)*8)","v":2020},{"$f":"OFFSET(Balance!J130,0,($J$1-1)*8)","v":2021}]
[]
[null,"Carbón",{"$f":"OFFSET(Balance!C131,0,($J$1-1)*8)","v":2187625.804},{"$f":"OFFSET(Balance!D131,0,($J$1-1)*8)","v":1865268.2970000003},{"$f":"OFFSET(Balance!E131,0,($J$1-1)*8)","v":2303768.3020000001},{"$f":"OFFSET(Balance!F131,0,($J$1-1)*8)","v":2603343.9639999997},{"$f":"OFFSET(Balance!G131,0,($J$1-1)*8)","v":591565.78499999992},{"$f":"OFFSET(Balance!H131,0,($J$1-1)*8)","v":"-"},{"$f":"OFFSET(Balance!I131,0,($J$1-1)*8)","v":"-"},{"$f":"OFFSET(Balance!J131,0,($J$1-1)*8)","v":"-"}]
[null,"Motores diesel",{"$f":"OFFSET(Balance!C132,0,($J$1-1)*8)","v":671248.32699999993},{"$f":"OFFSET(Balance!D132,0,($J$1-1)*8)","v":729765.87399999995},{"$f":"OFFSET(Balance!E132,0,($J$1-1)*8)","v":963404.14399999997},{"$f":"OFFSET(Balance!F132,0,($J$1-1)*8)","v":798894.04299999995},{"$f":"OFFSET(Balance!G132,0,($J$1-1)*8)","v":114895.74099999999},{"$f":"OFFSET(Balance!H132,0,($J$1-1)*8)","v":"-"},{"$f":"OFFSET(Balance!I132,0,($J$1-1)*8)","v":"-"},{"$f":"OFFSET(Balance!J132,0,($J$1-1)*8)","v":"-"}]
[null,"Turbina de gas",{"$f":"OFFSET(Balance!C133,0,($J$1-1)*8)","v":581727.70699999994},{"$f":"OFFSET(Balance!D133,0,($J$1-1)*8)","v":582137.98199999996},{"$f":"OFFSET(Balance!E133,0,($J$1-1)*8)","v":338287.83099999995},{"$f":"OFFSET(Balance!F133,0,($J$1-1)*8)","v":554119.88},{"$f":"OFFSET(Balance!G133,0,($J$1-1)*8)","v":180777.34},{"$f":"OFFSET(Balance!H133,0,($J$1-1)*8)","v":"-"},{"$f":"OFFSET(Balance!I133,0,($J$1-1)*8)","v":"-"},{"$f":"OFFSET(Balance!J133,0,($J$1-1)*8)","v":"-"}]
[null,"Fuel + Gas",{"$f":"OFFSET(Balance!C134,0,($J$1-1)*8)","v":1252976.034},{"$f":"OFFSET(Balance!D134,0,($J$1-1)*8)","v":1311903.8559999999},{"$f":"OFFSET(Balance!E134,0,($J$1-1)*8)","v":1301691.9750000001},{"$f":"OFFSET(Balance!F134,0,($J$1-1)*8)","v":1353013.9230000002},{"$f":"OFFSET(Balance!G134,0,($J$1-1)*8)","v":295673.08100000001},{"$f":"OFFSET(Balance!H134,0,($J$1-1)*8)","v":"-"},{"$f":"OFFSET(Balance!I134,0,($J$1-1)*8)","v":"-"},{"$f":"OFFSET(Balance!J134,0,($J$1-1)*8)","v":"-"}]
[null,"Ciclo combinado (2)",{"$f":"OFFSET(Balance!C135,0,($J$1-1)*8)","v":426924.70399999997},{"$f":"OFFSET(Balance!D135,0,($J$1-1)*8)","v":809239.36800000013},{"$f":"OFFSET(Balance!E135,0,($J$1-1)*8)","v":542553.09600000002},{"$f":"OFFSET(Balance!F135,0,($J$1-1)*8)","v":426188.67100000003},{"$f":"OFFSET(Balance!G135,0,($J$1-1)*8)","v":118681.98400000001},{"$f":"OFFSET(Balance!H135,0,($J$1-1)*8)","v":"-"},{"$f":"OFFSET(Balance!I135,0,($J$1-1)*8)","v":"-"},{"$f":"OFFSET(Balance!J135,0,($J$1-1)*8)","v":"-"}]
[null,"Generación auxiliar (3)",{"$f":"OFFSET(Balance!C136,0,($J$1-1)*8)","v":7695.201},{"$f":"OFFSET(Balance!D136,0,($J$1-1)*8)","v":10581.855},{"$f":"OFFSET(Balance!E136,0,($J$1-1)*8)","v":10091.754999999999},{"$f":"OFFSET(Balance!F136,0,($J$1-1)*8)","v":14745.847},{"$f":"OFFSET(Balance!G136,0,($J$1-1)*8)","v":0},{"$f":"OFFSET(Balance!H136,0,($J$1-1)*8)","v":"-"},{"$f":"OFFSET(Balance!I136,0,($J$1-1)*8)","v":"-"},{"$f":"OFFSET(Balance!J136,0,($J$1-1)*8)","v":"-"}]
[null,"Régimen ordinario",{"$f":"OFFSET(Balance!C137,0,($J$1-1)*8)","v":"-"},{"$f":"OFFSET(Balance!D137,0,($J$1-1)*8)","v":"-"},{"$f":"OFFSET(Balance!E137,0,($J$1-1)*8)","v":"-"},{"$f":"OFFSET(Balance!F137,0,($J$1-1)*8)","v":"-"},{"$f":"OFFSET(Balance!G137,0,($J$1-1)*8)","v":"-"},{"$f":"OFFSET(Balance!H137,0,($J$1-1)*8)","v":"-"},{"$f":"OFFSET(Balance!I137,0,($J$1-1)*8)","v":"-"},{"$f":"OFFSET(Balance!J137,0,($J$1-1)*8)","v":"-"}]
[]
[null,"Eólica",{"$f":"OFFSET(Balance!C138,0,($J$1-1)*8)","v":5839},{"$f":"OFFSET(Balance!D138,0,($J$1-1)*8)","v":5317.02},{"$f":"OFFSET(Balance!E138,0,($J$1-1)*8)","v":5414.6399999999994},{"$f":"OFFSET(Balance!F138,0,($J$1-1)*8)","v":2925},{"$f":"OFFSET(Balance!G138,0,($J$1-1)*8)","v":945.49},{"$f":"OFFSET(Balance!H138,0,($J$1-1)*8)","v":"-"},{"$f":"OFFSET(Balance!I138,0,($J$1-1)*8)","v":"-"},{"$f":"OFFSET(Balance!J138,0,($J$1-1)*8)","v":"-"}]
[null,"Solar fotovoltaica",{"$f":"OFFSET(Balance!C139,0,($J$1-1)*8)","v":122773},{"$f":"OFFSET(Balance!D139,0,($J$1-1)*8)","v":122645.48},{"$f":"OFFSET(Balance!E139,0,($J$1-1)*8)","v":120533.8},{"$f":"OFFSET(Balance!F139,0,($J$1-1)*8)","v":123205},{"$f":"OFFSET(Balance!G139,0,($J$1-1)*8)","v":22094},{"$f":"OFFSET(Balance!H139,0,($J$1-1)*8)","v":"-"},{"$f":"OFFSET(Balance!I139,0,($J$1-1)*8)","v":"-"},{"$f":"OFFSET(Balance!J139,0,($J$1-1)*8)","v":"-"}]
[null,"Térmica renovable(4)/Otras renovables",{"$f":"OFFSET(Balance!C140,0,($J$1-1)*8)","v":1944},{"$f":"OFFSET(Balance!D140,0,($J$1-1)*8)","v":1972.55},{"$f":"OFFSET(Balance!E140,0,($J$1-1)*8)","v":1309.52},{"$f":"OFFSET(Balance!F140,0,($J$1-1)*8)","v":1625},{"$f":"OFFSET(Balance!G140,0,($J$1-1)*8)","v":606.06999999999994},{"$f":"OFFSET(Balance!H140,0,($J$1-1)*8)","v":"-"},{"$f":"OFFSET(Balance!I140,0,($J$1-1)*8)","v":"-"},{"$f":"OFFSET(Balance!J140,0,($J$1-1)*8)","v":"-"}]
[null,"Cogeneración y resto(4)/Cogeneración",{"$f":"OFFSET(Balance!C141,0,($J$1-1)*8)","v":281390},{"$f":"OFFSET(Balance!D141,0,($J$1-1)*8)","v":31519.32},{"$f":"OFFSET(Balance!E141,0,($J$1-1)*8)","v":34698.850000000006},{"$f":"OFFSET(Balance!F141,0,($J$1-1)*8)","v":36169},{"$f":"OFFSET(Balance!G141,0,($J$1-1)*8)","v":8662.49},{"$f":"OFFSET(Balance!H141,0,($J$1-1)*8)","v":"-"},{"$f":"OFFSET(Balance!I141,0,($J$1-1)*8)","v":"-"},{"$f":"OFFSET(Balance!J141,0,($J$1-1)*8)","v":"-"}]
[null,"Residuos no renovables",{"$f":"OFFSET(Balance!C142,0,($J$1-1)*8)","v":"-"},{"$f":"OFFSET(Balance!D142,0,($J$1-1)*8)","v":151098},{"$f":"OFFSET(Balance!E142,0,($J$1-1)*8)","v":130805.5},{"$f":"OFFSET(Balance!F142,0,($J$1-1)*8)","v":143878.5},{"$f":"OFFSET(Balance!G142,0,($J$1-1)*8)","v":23814.5},{"$f":"OFFSET(Balance!H142,0,($J$1-1)*8)","v":"-"},{"$f":"OFFSET(Balance!I142,0,($J$1-1)*8)","v":"-"},{"$f":"OFFSET(Balance!J142,0,($J$1-1)*8)","v":"-"}]
[null,"Residuos renovables",{"$f":"OFFSET(Balance!C143,0,($J$1-1)*8)","v":"-"},{"$f":"OFFSET(Balance!D143,0,($J$1-1)*8)","v":151098},{"$f":"OFFSET(Balance!E143,0,($J$1-1)*8)","v":130805.5},{"$f":"OFFSET(Balance!F143,0,($J$1-1)*8)","v":143878.5},{"$f":"OFFSET(Balance!G143,0,($J$1-1)*8)","v":23814.5},{"$f":"OFFSET(Balance!H143,0,($J$1-1)*8)","v":"-"},{"$f":"OFFSET(Balance!I143,0,($J$1-1)*8)","v":"-"},{"$f":"OFFSET(Balance!J143,0,($J$1-1)*8)","v":"-"}]
[null,"Régimen especial",{"$f":"OFFSET(Balance!C144,0,($J$1-1)*8)","v":"-"},{"$f":"OFFSET(Balance!D144,0,($J$1-1)*8)","v":"-"},{"$f":"OFFSET(Balance!E144,0,($J$1-1)*8)","v":"-"},{"$f":"OFFSET(Balance!F144,0,($J$1-1)*8)","v":"-"},{"$f":"OFFSET(Balance!G144,0,($J$1-1)*8)","v":"-"},{"$f":"OFFSET(Balance!H144,0,($J$1-1)*8)","v":"-"},{"$f":"OFFSET(Balance!I144,0,($J$1-1)*8)","v":"-"},{"$f":"OFFSET(Balance!J144,0,($J$1-1)*8)","v":"-"}]
[null,"Generación",{"$f":"OFFSET(Balance!C145,0,($J$1-1)*8)","v":4287167.7429999998},{"$f":"OFFSET(Balance!D145,0,($J$1-1)*8)","v":4460643.7459999993},{"$f":"OFFSET(Balance!E145,0,($J$1-1)*8)","v":4581672.9379999992},{"$f":"OFFSET(Balance!F145,0,($J$1-1)*8)","v":4848973.4050000003},{"$f":"OFFSET(Balance!G145,0,($J$1-1)*8)","v":1085857.8999999999},{"$f":"OFFSET(Balance!H145,0,($J$1-1)*8)","v":"-"},{"$f":"OFFSET(Balance!I145,0,($J$1-1)*8)","v":"-"},{"$f":"OFFSET(Balance!J145,0,($J$1-1)*8)","v":"-"}]
[null,"Enlace Península-Baleares (5)",{"$f":"OFFSET(Balance!C146,0,($J$1-1)*8)","v":1298257.4659999998},{"$f":"OFFSET(Balance!D146,0,($J$1-1)*8)","v":1335791.8019999999},{"$f":"OFFSET(Balance!E146,0,($J$1-1)*8)","v":1250582.5009999999},{"$f":"OFFSET(Balance!F146,0,($J$1-1)*8)","v":1179300.6529999999},{"$f":"OFFSET(Balance!G146,0,($J$1-1)*8)","v":276303.92800000001},{"$f":"OFFSET(Balance!H146,0,($J$1-1)*8)","v":"-"},{"$f":"OFFSET(Balance!I146,0,($J$1-1)*8)","v":"-"},{"$f":"OFFSET(Balance!J146,0,($J$1-1)*8)","v":"-"}]
[null,"Demanda transporte (b.c.)",{"$f":"OFFSET(Balance!C147,0,($J$1-1)*8)","v":5585425.2089999998},{"$f":"OFFSET(Balance!D147,0,($J$1-1)*8)","v":5796435.5479999995},{"$f":"OFFSET(Balance!E147,0,($J$1-1)*8)","v":5832255.4389999993},{"$f":"OFFSET(Balance!F147,0,($J$1-1)*8)","v":6028274.0580000002},{"$f":"OFFSET(Balance!G147,0,($J$1-1)*8)","v":1362161.828},{"$f":"OFFSET(Balance!H147,0,($J$1-1)*8)","v":"-"},{"$f":"OFFSET(Balance!I147,0,($J$1-1)*8)","v":"-"},{"$f":"OFFSET(Balance!J147,0,($J$1-1)*8)","v":"-"}]
[null,"(1) Asignación de unidades de producción según combustible principal."]
[null,"(2) Incluye funcionamiento en ciclo abierto."]
[null,"(3) Grupos de emergencia que se instalan de forma transitoria en determinadas zonas para cubrir un déficit de generación."]
[null,"(4) Hasta 2014 e incluye residuos."]
[null,"(4) Incluye residuos."]
[null,"(5) Valor positivo: entrada de energía en el sistema; valor negativo: salida de energía del sistema. Enlace funcionando al mínimo técnico de seguridad hasta el 13/08/2012. "]
[null,{"$f":"IF(MONTH(FACT)=1,\"\",CONCATENATE(\"Para el año \",YEAR(FACT), \" valores acumulados hasta \",TEXT(FACT-30,\"mmmm\"),\" de \",YEAR(FACT),\".\"))","v":"Para el año 2018 valores acumulados hasta marzo de 2018."}]
[null,{"$f":"'Balance nacional mensual'!B38","v":"Datos definitivos hasta el 31/03/2017. Datos provisionales del 01/04/2017 al 28/02/2018. Datos programados del 01/03/2018 al 31/03/2018."}]

{"sheet":"Balance Canarias mensual","index":7,"n_rows":32,"n_cols":15,"rows_kept":32,"cut":false,"hidden":false,"merged":[[28,1,28,14],[29,1,29,14],[30,1,30,14],[27,1,27,14],[31,1,31,10]]}
[null,null,null,null,null,null,null,null,null,null,null,null,null,null,13]
[]
[]
[null,null,null,null,null,null,null,null,null,null,null,null,"Sistema eléctrico"]
[null,null,null,null,null,null,null,null,null,null,null,null,"Horizonte temporal"]
[null,null,null,null,null,null,null,null,null,null,null,null,"Periodo"]
[]
[null,null,"Ene.","Feb.","Mar.","Abr.","May.","Jun.","Jul.","Ago.","Sep.","Oct.","Nov.","Dic.",{"$f":"OFFSET(Año!C18,($O$1-1),0)","v":2018}]
[]
[null,"Hidráulica",{"$f":"OFFSET(Balance!C45,0,($O$1-1)*12)","v":279},{"$f":"OFFSET(Balance!D45,0,($O$1-1)*12)","v":35},{"$f":"OFFSET(Balance!E45,0,($O$1-1)*12)","v":0},{"$f":"OFFSET(Balance!F45,0,($O$1-1)*12)","v":"-"},{"$f":"OFFSET(Balance!G45,0,($O$1-1)*12)","v":"-"},{"$f":"OFFSET(Balance!H45,0,($O$1-1)*12)","v":"-"},{"$f":"OFFSET(Balance!I45,0,($O$1-1)*12)","v":"-"},{"$f":"OFFSET(Balance!J45,0,($O$1-1)*12)","v":"-"},{"$f":"OFFSET(Balance!K45,0,($O$1-1)*12)","v":"-"},{"$f":"OFFSET(Balance!L45,0,($O$1-1)*12)","v":"-"},{"$f":"OFFSET(Balance!M45,0,($O$1-1)*12)","v":"-"},{"$f":"OFFSET(Balance!N45,0,($O$1-1)*12)","v":"-"},{"$f":"IF(SUM(C10:N10)=0,\"-\",SUM(C10:N10))","v":314}]
[null,"Motores diesel",{"$f":"OFFSET(Balance!C46,0,($O$1-1)*12)","v":213634.49900000001},{"$f":"OFFSET(Balance!D46,0,($O$1-1)*12)","v":192487.90700000001},{"$f":"OFFSET(Balance!E46,0,($O$1-1)*12)","v":181035.595},{"$f":"OFFSET(Balance!F46,0,($O$1-1)*12)","v":"-"},{"$f":"OFFSET(Balance!G46,0,($O$1-1)*12)","v":"-"},{"$f":"OFFSET(Balance!H46,0,($O$1-1)*12)","v":"-"},{"$f":"OFFSET(Balance!I46,0,($O$1-1)*12)","v":"-"},{"$f":"OFFSET(Balance!J46,0,($O$1-1)*12)","v":"-"},{"$f":"OFFSET(Balance!K46,0,($O$1-1)*12)","v":"-"},{"$f":"OFFSET(Balance!L46,0,($O$1-1)*12)","v":"-"},{"$f":"OFFSET(Balance!M46,0,($O$1-1)*12)","v":"-"},{"$f":"OFFSET(Balance!N46,0,($O$1-1)*12)","v":"-"},{"$f":"IF(SUM(C11:N11)=0,\"-\",SUM(C11:N11))","v":587158.00100000005}]
[null,"Turbina de gas",{"$f":"OFFSET(Balance!C47,0,($O$1-1)*12)","v":16383.045},{"$f":"OFFSET(Balance!D47,0,($O$1-1)*12)","v":17868.261999999999},{"$f":"OFFSET(Balance!E47,0,($O$1-1)*12)","v":16518.832999999999},{"$f":"OFFSET(Balance!F47,0,($O$1-1)*12)","v":"-"},{"$f":"OFFSET(Balance!G47,0,($O$1-1)*12)","v":"-"},{"$f":"OFFSET(Balance!H47,0,($O$1-1)*12)","v":"-"},{"$f":"OFFSET(Balance!I47,0,($O$1-1)*12)","v":"-"},{"$f":"OFFSET(Balance!J47,0,($O$1-1)*12)","v":"-"},{"$f":"OFFSET(Balance!K47,0,($O$1-1)*12)","v":"-"},{"$f":"OFFSET(Balance!L47,0,($O$1-1)*12)","v":"-"},{"$f":"OFFSET(Balance!M47,0,($O$1-1)*12)","v":"-"},{"$f":"OFFSET(Balance!N47,0,($O$1-1)*12)","v":"-"},{"$f":"IF(SUM(C12:N12)=0,\"-\",SUM(C12:N12))","v":50770.14}]
[null,"Turbina de vapor",{"$f":"OFFSET(Balance!C48,0,($O$1-1)*12)","v":212818.00399999999},{"$f":"OFFSET(Balance!D48,0,($O$1-1)*12)","v":190979.33799999999},{"$f":"OFFSET(Balance!E48,0,($O$1-1)*12)","v":193576.76699999999},{"$f":"OFFSET(Balance!F48,0,($O$1-1)*12)","v":"-"},{"$f":"OFFSET(Balance!G48,0,($O$1-1)*12)","v":"-"},{"$f":"OFFSET(Balance!H48,0,($O$1-1)*12)","v":"-"},{"$f":"OFFSET(Balance!I48,0,($O$1-1)*12)","v":"-"},{"$f":"OFFSET(Balance!J48,0,($O$1-1)*12)","v":"-"},{"$f":"OFFSET(Balance!K48,0,($O$1-1)*12)","v":"-"},{"$f":"OFFSET(Balance!L48,0,($O$1-1)*12)","v":"-"},{"$f":"OFFSET(Balance!M48,0,($O$1-1)*12)","v":"-"},{"$f":"OFFSET(Balance!N48,0,($O$1-1)*12)","v":"-"},{"$f":"IF(SUM(C13:N13)=0,\"-\",SUM(C13:N13))","v":597374.10899999994}]
[null,"Fuel + Gas",{"$f":"OFFSET(Balance!C49,0,($O$1-1)*12)","v":442835.54800000001},{"$f":"OFFSET(Balance!D49,0,($O$1-1)*12)","v":401335.50699999998},{"$f":"OFFSET(Balance!E49,0,($O$1-1)*12)","v":391131.19500000001},{"$f":"OFFSET(Balance!F49,0,($O$1-1)*12)","v":"-"},{"$f":"OFFSET(Balance!G49,0,($O$1-1)*12)","v":"-"},{"$f":"OFFSET(Balance!H49,0,($O$1-1)*12)","v":"-"},{"$f":"OFFSET(Balance!I49,0,($O$1-1)*12)","v":"-"},{"$f":"OFFSET(Balance!J49,0,($O$1-1)*12)","v":"-"},{"$f":"OFFSET(Balance!K49,0,($O$1-1)*12)","v":"-"},{"$f":"OFFSET(Balance!L49,0,($O$1-1)*12)","v":"-"},{"$f":"OFFSET(Balance!M49,0,($O$1-1)*12)","v":"-"},{"$f":"OFFSET(Balance!N49,0,($O$1-1)*12)","v":"-"},{"$f":"IF(SUM(C14:N14)=0,\"-\",SUM(C14:N14))","v":1235302.25}]
[null,"Ciclo combinado (2)",{"$f":"OFFSET(Balance!C50,0,($O$1-1)*12)","v":235479.92300000001},{"$f":"OFFSET(Balance!D50,0,($O$1-1)*12)","v":216348.33600000001},{"$f":"OFFSET(Balance!E50,0,($O$1-1)*12)","v":266353.99099999998},{"$f":"OFFSET(Balance!F50,0,($O$1-1)*12)","v":"-"},{"$f":"OFFSET(Balance!G50,0,($O$1-1)*12)","v":"-"},{"$f":"OFFSET(Balance!H50,0,($O$1-1)*12)","v":"-"},{"$f":"OFFSET(Balance!I50,0,($O$1-1)*12)","v":"-"},{"$f":"OFFSET(Balance!J50,0,($O$1-1)*12)","v":"-"},{"$f":"OFFSET(Balance!K50,0,($O$1-1)*12)","v":"-"},{"$f":"OFFSET(Balance!L50,0,($O$1-1)*12)","v":"-"},{"$f":"OFFSET(Balance!M50,0,($O$1-1)*12)","v":"-"},{"$f":"OFFSET(Balance!N50,0,($O$1-1)*12)","v":"-"},718182.25]
[null,"Generación auxiliar (3)",{"$f":"OFFSET(Balance!C51,0,($O$1-1)*12)","v":0},{"$f":"OFFSET(Balance!D51,0,($O$1-1)*12)","v":0},{"$f":"OFFSET(Balance!E51,0,($O$1-1)*12)","v":0},{"$f":"OFFSET(Balance!F51,0,($O$1-1)*12)","v":"-"},{"$f":"OFFSET(Balance!G51,0,($O$1-1)*12)","v":"-"},{"$f":"OFFSET(Balance!H51,0,($O$1-1)*12)","v":"-"},{"$f":"OFFSET(Balance!I51,0,($O$1-1)*12)","v":"-"},{"$f":"OFFSET(Balance!J51,0,($O$1-1)*12)","v":"-"},{"$f":"OFFSET(Balance!K51,0,($O$1-1)*12)","v":"-"},{"$f":"OFFSET(Balance!L51,0,($O$1-1)*12)","v":"-"},{"$f":"OFFSET(Balance!M51,0,($O$1-1)*12)","v":"-"},{"$f":"OFFSET(Balance!N51,0,($O$1-1)*12)","v":"-"},"-"]
[null,"Régimen ordinario",{"$f":"OFFSET(Balance!C52,0,($O$1-1)*12)","v":"-"},{"$f":"OFFSET(Balance!D52,0,($O$1-1)*12)","v":"-"},{"$f":"OFFSET(Balance!E52,0,($O$1-1)*12)","v":"-"},{"$f":"OFFSET(Balance!F52,0,($O$1-1)*12)","v":"-"},{"$f":"OFFSET(Balance!G52,0,($O$1-1)*12)","v":"-"},{"$f":"OFFSET(Balance!H52,0,($O$1-1)*12)","v":"-"},{"$f":"OFFSET(Balance!I52,0,($O$1-1)*12)","v":"-"},{"$f":"OFFSET(Balance!J52,0,($O$1-1)*12)","v":"-"},{"$f":"OFFSET(Balance!K52,0,($O$1-1)*12)","v":"-"},{"$f":"OFFSET(Balance!L52,0,($O$1-1)*12)","v":"-"},{"$f":"OFFSET(Balance!M52,0,($O$1-1)*12)","v":"-"},{"$f":"OFFSET(Balance!N52,0,($O$1-1)*12)","v":"-"},{"$f":"IF(SUM(C17:N17)=0,\"-\",SUM(C17:N17))","v":"-"}]
[]
[null,"Hidroeólica",{"$f":"OFFSET(Balance!C53,0,($O$1-1)*12)","v":2262.8510000000001},{"$f":"OFFSET(Balance!D53,0,($O$1-1)*12)","v":1768.028},{"$f":"OFFSET(Balance!E53,0,($O$1-1)*12)","v":1685.079},{"$f":"OFFSET(Balance!F53,0,($O$1-1)*12)","v":"-"},{"$f":"OFFSET(Balance!G53,0,($O$1-1)*12)","v":"-"},{"$f":"OFFSET(Balance!H53,0,($O$1-1)*12)","v":"-"},{"$f":"OFFSET(Balance!I53,0,($O$1-1)*12)","v":"-"},{"$f":"OFFSET(Balance!J53,0,($O$1-1)*12)","v":"-"},{"$f":"OFFSET(Balance!K53,0,($O$1-1)*12)","v":"-"},{"$f":"OFFSET(Balance!L53,0,($O$1-1)*12)","v":"-"},{"$f":"OFFSET(Balance!M53,0,($O$1-1)*12)","v":"-"},{"$f":"OFFSET(Balance!N53,0,($O$1-1)*12)","v":"-"},{"$f":"IF(SUM(C19:N19)=0,\"-\",SUM(C19:N19))","v":5715.9579999999996}]
[null,"Hidráulica",{"$f":"OFFSET(Balance!C54,0,($O$1-1)*12)","v":"-"},{"$f":"OFFSET(Balance!D54,0,($O$1-1)*12)","v":"-"},{"$f":"OFFSET(Balance!E54,0,($O$1-1)*12)","v":"-"},{"$f":"OFFSET(Balance!F54,0,($O$1-1)*12)","v":"-"},{"$f":"OFFSET(Balance!G54,0,($O$1-1)*12)","v":"-"},{"$f":"OFFSET(Balance!H54,0,($O$1-1)*12)","v":"-"},{"$f":"OFFSET(Balance!I54,0,($O$1-1)*12)","v":"-"},{"$f":"OFFSET(Balance!J54,0,($O$1-1)*12)","v":"-"},{"$f":"OFFSET(Balance!K54,0,($O$1-1)*12)","v":"-"},{"$f":"OFFSET(Balance!L54,0,($O$1-1)*12)","v":"-"},{"$f":"OFFSET(Balance!M54,0,($O$1-1)*12)","v":"-"},{"$f":"OFFSET(Balance!N54,0,($O$1-1)*12)","v":"-"},{"$f":"IF(SUM(C20:N20)=0,\"-\",SUM(C20:N20))","v":"-"}]
[null,"Eólica",{"$f":"OFFSET(Balance!C55,0,($O$1-1)*12)","v":57039},{"$f":"OFFSET(Balance!D55,0,($O$1-1)*12)","v":46216},{"$f":"OFFSET(Balance!E55,0,($O$1-1)*12)","v":54166.252},{"$f":"OFFSET(Balance!F55,0,($O$1-1)*12)","v":"-"},{"$f":"OFFSET(Balance!G55,0,($O$1-1)*12)","v":"-"},{"$f":"OFFSET(Balance!H55,0,($O$1-1)*12)","v":"-"},{"$f":"OFFSET(Balance!I55,0,($O$1-1)*12)","v":"-"},{"$f":"OFFSET(Balance!J55,0,($O$1-1)*12)","v":"-"},{"$f":"OFFSET(Balance!K55,0,($O$1-1)*12)","v":"-"},{"$f":"OFFSET(Balance!L55,0,($O$1-1)*12)","v":"-"},{"$f":"OFFSET(Balance!M55,0,($O$1-1)*12)","v":"-"},{"$f":"OFFSET(Balance!N55,0,($O$1-1)*12)","v":"-"},157421.25200000001]
[null,"Solar fotovoltaica",{"$f":"OFFSET(Balance!C56,0,($O$1-1)*12)","v":18989},{"$f":"OFFSET(Balance!D56,0,($O$1-1)*12)","v":17868},{"$f":"OFFSET(Balance!E56,0,($O$1-1)*12)","v":24642.07},{"$f":"OFFSET(Balance!F56,0,($O$1-1)*12)","v":"-"},{"$f":"OFFSET(Balance!G56,0,($O$1-1)*12)","v":"-"},{"$f":"OFFSET(Balance!H56,0,($O$1-1)*12)","v":"-"},{"$f":"OFFSET(Balance!I56,0,($O$1-1)*12)","v":"-"},{"$f":"OFFSET(Balance!J56,0,($O$1-1)*12)","v":"-"},{"$f":"OFFSET(Balance!K56,0,($O$1-1)*12)","v":"-"},{"$f":"OFFSET(Balance!L56,0,($O$1-1)*12)","v":"-"},{"$f":"OFFSET(Balance!M56,0,($O$1-1)*12)","v":"-"},{"$f":"OFFSET(Balance!N56,0,($O$1-1)*12)","v":"-"},61499.07]
[null,"Otras renovables",{"$f":"OFFSET(Balance!C57,0,($O$1-1)*12)","v":762},{"$f":"OFFSET(Balance!D57,0,($O$1-1)*12)","v":647},{"$f":"OFFSET(Balance!E57,0,($O$1-1)*12)","v":0},{"$f":"OFFSET(Balance!F57,0,($O$1-1)*12)","v":"-"},{"$f":"OFFSET(Balance!G57,0,($O$1-1)*12)","v":"-"},{"$f":"OFFSET(Balance!H57,0,($O$1-1)*12)","v":"-"},{"$f":"OFFSET(Balance!I57,0,($O$1-1)*12)","v":"-"},{"$f":"OFFSET(Balance!J57,0,($O$1-1)*12)","v":"-"},{"$f":"OFFSET(Balance!K57,0,($O$1-1)*12)","v":"-"},{"$f":"OFFSET(Balance!L57,0,($O$1-1)*12)","v":"-"},{"$f":"OFFSET(Balance!M57,0,($O$1-1)*12)","v":"-"},{"$f":"OFFSET(Balance!N57,0,($O$1-1)*12)","v":"-"},1409]
[null,"Cogeneración",{"$f":"OFFSET(Balance!C58,0,($O$1-1)*12)","v":0},{"$f":"OFFSET(Balance!D58,0,($O$1-1)*12)","v":0},{"$f":"OFFSET(Balance!E58,0,($O$1-1)*12)","v":0},{"$f":"OFFSET(Balance!F58,0,($O$1-1)*12)","v":"-"},{"$f":"OFFSET(Balance!G58,0,($O$1-1)*12)","v":"-"},{"$f":"OFFSET(Balance!H58,0,($O$1-1)*12)","v":"-"},{"$f":"OFFSET(Balance!I58,0,($O$1-1)*12)","v":"-"},{"$f":"OFFSET(Balance!J58,0,($O$1-1)*12)","v":"-"},{"$f":"OFFSET(Balance!K58,0,($O$1-1)*12)","v":"-"},{"$f":"OFFSET(Balance!L58,0,($O$1-1)*12)","v":"-"},{"$f":"OFFSET(Balance!M58,0,($O$1-1)*12)","v":"-"},{"$f":"OFFSET(Balance!N58,0,($O$1-1)*12)","v":"-"},"-"]
[null,"Régimen especial",{"$f":"OFFSET(Balance!C59,0,($O$1-1)*12)","v":"-"},{"$f":"OFFSET(Balance!D59,0,($O$1-1)*12)","v":"-"},{"$f":"OFFSET(Balance!E59,0,($O$1-1)*12)","v":"-"},{"$f":"OFFSET(Balance!F59,0,($O$1-1)*12)","v":"-"},{"$f":"OFFSET(Balance!G59,0,($O$1-1)*12)","v":"-"},{"$f":"OFFSET(Balance!H59,0,($O$1-1)*12)","v":"-"},{"$f":"OFFSET(Balance!I59,0,($O$1-1)*12)","v":"-"},{"$f":"OFFSET(Balance!J59,0,($O$1-1)*12)","v":"-"},{"$f":"OFFSET(Balance!K59,0,($O$1-1)*12)","v":"-"},{"$f":"OFFSET(Balance!L59,0,($O$1-1)*12)","v":"-"},{"$f":"OFFSET(Balance!M59,0,($O$1-1)*12)","v":"-"},{"$f":"OFFSET(Balance!N59,0,($O$1-1)*12)","v":"-"},{"$f":"SUM(O20:O24)","v":220329.32200000001}]
[null,"Generación",{"$f":"OFFSET(Balance!C60,0,($O$1-1)*12)","v":757647.32200000004},{"$f":"OFFSET(Balance!D60,0,($O$1-1)*12)","v":684217.87100000004},{"$f":"OFFSET(Balance!E60,0,($O$1-1)*12)","v":737978.58700000006},{"$f":"OFFSET(Balance!F60,0,($O$1-1)*12)","v":"-"},{"$f":"OFFSET(Balance!G60,0,($O$1-1)*12)","v":"-"},{"$f":"OFFSET(Balance!H60,0,($O$1-1)*12)","v":"-"},{"$f":"OFFSET(Balance!I60,0,($O$1-1)*12)","v":"-"},{"$f":"OFFSET(Balance!J60,0,($O$1-1)*12)","v":"-"},{"$f":"OFFSET(Balance!K60,0,($O$1-1)*12)","v":"-"},{"$f":"OFFSET(Balance!L60,0,($O$1-1)*12)","v":"-"},{"$f":"OFFSET(Balance!M60,0,($O$1-1)*12)","v":"-"},{"$f":"OFFSET(Balance!N60,0,($O$1-1)*12)","v":"-"},2179843.7800000003]
[null,"Demanda transporte (b.c.)",{"$f":"OFFSET(Balance!C61,0,($O$1-1)*12)","v":757647.32200000004},{"$f":"OFFSET(Balance!D61,0,($O$1-1)*12)","v":684217.87100000004},{"$f":"OFFSET(Balance!E61,0,($O$1-1)*12)","v":737978.58700000006},{"$f":"OFFSET(Balance!F61,0,($O$1-1)*12)","v":"-"},{"$f":"OFFSET(Balance!G61,0,($O$1-1)*12)","v":"-"},{"$f":"OFFSET(Balance!H61,0,($O$1-1)*12)","v":"-"},{"$f":"OFFSET(Balance!I61,0,($O$1-1)*12)","v":"-"},{"$f":"OFFSET(Balance!J61,0,($O$1-1)*12)","v":"-"},{"$f":"OFFSET(Balance!K61,0,($O$1-1)*12)","v":"-"},{"$f":"OFFSET(Balance!L61,0,($O$1-1)*12)","v":"-"},{"$f":"OFFSET(Balance!M61,0,($O$1-1)*12)","v":"-"},{"$f":"OFFSET(Balance!N61,0,($O$1-1)*12)","v":"-"},2179843.7800000003]
[null,"(1) Asignación de unidades de producción según combustible principal."]
[null,"(2) Utiliza fue y gasoil como combustible principal. Incluye funcionamiento en ciclo abierto."]
[null,"(3) Grupos de emergencia que se instalan de forma transitoria en determinadas zonas para cubrir un déficit de generación."]
[null,"(4) Incluye todas aquellas unidades menores de 50 MW que no pertenecen a ninguna unidad de gestión hidráulica (UGH)."]
[null,{"$f":"'Balance nacional mensual'!B38","v":"Datos definitivos hasta el 31/03/2017. Datos provisionales del 01/04/2017 al 28/02/2018. Datos programados del 01/03/2018 al 31/03/2018."}]

{"sheet":"Balance Canarias anual","index":8,"n_rows":33,"n_cols":10,"rows_kept":33,"cut":false,"hidden":false,"merged":[[27,1,27,11],[28,1,28,11],[29,1,29,11],[30,1,30,11]]}
[null,null,null,null,null,null,null,null,null,2]
[]
[]
[null,null,null,null,null,null,null,null,"Sistema eléctrico"]
[null,null,null,null,null,null,null,null,"Horizonte temporal"]
[null,null,null,null,null,null,null,null,"Periodo"]
[]
[null,null,{"$f":"OFFSET(Balance!C149,0,($J$1-1)*8)","v":2014},{"$f":"OFFSET(Balance!D149,0,($J$1-1)*8)","v":2015},{"$f":"OFFSET(Balance!E149,0,($J$1-1)*8)","v":2016},{"$f":"OFFSET(Balance!F149,0,($J$1-1)*8)","v":2017},{"$f":"OFFSET(Balance!G149,0,($J$1-1)*8)","v":2018},{"$f":"OFFSET(Balance!H149,0,($J$1-1)*8)","v":2019},{"$f":"OFFSET(Balance!I149,0,($J$1-1)*8)","v":2020},{"$f":"OFFSET(Balance!J149,0,($J$1-1)*8)","v":2021}]
[]
[null,"Hidráulica",{"$f":"OFFSET(Balance!C150,0,($J$1-1)*8)","v":0},{"$f":"OFFSET(Balance!D150,0,($J$1-1)*8)","v":3585.2},{"$f":"OFFSET(Balance!E150,0,($J$1-1)*8)","v":3472},{"$f":"OFFSET(Balance!F150,0,($J$1-1)*8)","v":3282},{"$f":"OFFSET(Balance!G150,0,($J$1-1)*8)","v":314},{"$f":"OFFSET(Balance!H150,0,($J$1-1)*8)","v":"-"},{"$f":"OFFSET(Balance!I150,0,($J$1-1)*8)","v":"-"},{"$f":"OFFSET(Balance!J150,0,($J$1-1)*8)","v":"-"}]
[null,"Motores diesel",{"$f":"OFFSET(Balance!C151,0,($J$1-1)*8)","v":2145111.9040000001},{"$f":"OFFSET(Balance!D151,0,($J$1-1)*8)","v":2207692.36},{"$f":"OFFSET(Balance!E151,0,($J$1-1)*8)","v":2227665.5260000001},{"$f":"OFFSET(Balance!F151,0,($J$1-1)*8)","v":2468714.2339999997},{"$f":"OFFSET(Balance!G151,0,($J$1-1)*8)","v":587158.00100000005},{"$f":"OFFSET(Balance!H151,0,($J$1-1)*8)","v":"-"},{"$f":"OFFSET(Balance!I151,0,($J$1-1)*8)","v":"-"},{"$f":"OFFSET(Balance!J151,0,($J$1-1)*8)","v":"-"}]
[null,"Turbina de gas",{"$f":"OFFSET(Balance!C152,0,($J$1-1)*8)","v":363766.8459999999},{"$f":"OFFSET(Balance!D152,0,($J$1-1)*8)","v":330903.78599999991},{"$f":"OFFSET(Balance!E152,0,($J$1-1)*8)","v":279139.54399999999},{"$f":"OFFSET(Balance!F152,0,($J$1-1)*8)","v":247327.67500000005},{"$f":"OFFSET(Balance!G152,0,($J$1-1)*8)","v":50770.14},{"$f":"OFFSET(Balance!H152,0,($J$1-1)*8)","v":"-"},{"$f":"OFFSET(Balance!I152,0,($J$1-1)*8)","v":"-"},{"$f":"OFFSET(Balance!J152,0,($J$1-1)*8)","v":"-"}]
[null,"Turbina de vapor",{"$f":"OFFSET(Balance!C153,0,($J$1-1)*8)","v":2074036.0720000002},{"$f":"OFFSET(Balance!D153,0,($J$1-1)*8)","v":2225313.5290000001},{"$f":"OFFSET(Balance!E153,0,($J$1-1)*8)","v":2536663.6469999999},{"$f":"OFFSET(Balance!F153,0,($J$1-1)*8)","v":2523836.9070000001},{"$f":"OFFSET(Balance!G153,0,($J$1-1)*8)","v":597374.10899999994},{"$f":"OFFSET(Balance!H153,0,($J$1-1)*8)","v":"-"},{"$f":"OFFSET(Balance!I153,0,($J$1-1)*8)","v":"-"},{"$f":"OFFSET(Balance!J153,0,($J$1-1)*8)","v":"-"}]
[null,"Fuel + Gas",{"$f":"OFFSET(Balance!C154,0,($J$1-1)*8)","v":4582914.8220000006},{"$f":"OFFSET(Balance!D154,0,($J$1-1)*8)","v":4763910.6749999998},{"$f":"OFFSET(Balance!E154,0,($J$1-1)*8)","v":5043468.7169999992},{"$f":"OFFSET(Balance!F154,0,($J$1-1)*8)","v":5239878.8160000006},{"$f":"OFFSET(Balance!G154,0,($J$1-1)*8)","v":1235302.25},{"$f":"OFFSET(Balance!H154,0,($J$1-1)*8)","v":"-"},{"$f":"OFFSET(Balance!I154,0,($J$1-1)*8)","v":"-"},{"$f":"OFFSET(Balance!J154,0,($J$1-1)*8)","v":"-"}]
[null,"Ciclo combinado (2)",{"$f":"OFFSET(Balance!C155,0,($J$1-1)*8)","v":3311448.9440000001},{"$f":"OFFSET(Balance!D155,0,($J$1-1)*8)","v":3213042.0700000003},{"$f":"OFFSET(Balance!E155,0,($J$1-1)*8)","v":3031699.5109999995},{"$f":"OFFSET(Balance!F155,0,($J$1-1)*8)","v":3015772.0159999998},{"$f":"OFFSET(Balance!G155,0,($J$1-1)*8)","v":718182.25},{"$f":"OFFSET(Balance!H155,0,($J$1-1)*8)","v":"-"},{"$f":"OFFSET(Balance!I155,0,($J$1-1)*8)","v":"-"},{"$f":"OFFSET(Balance!J155,0,($J$1-1)*8)","v":"-"}]
[null,"Generación auxiliar (3)",{"$f":"OFFSET(Balance!C156,0,($J$1-1)*8)","v":0},{"$f":"OFFSET(Balance!D156,0,($J$1-1)*8)","v":0},{"$f":"OFFSET(Balance!E156,0,($J$1-1)*8)","v":0},{"$f":"OFFSET(Balance!F156,0,($J$1-1)*8)","v":0},{"$f":"OFFSET(Balance!G156,0,($J$1-1)*8)","v":0},{"$f":"OFFSET(Balance!H156,0,($J$1-1)*8)","v":"-"},{"$f":"OFFSET(Balance!I156,0,($J$1-1)*8)","v":"-"},{"$f":"OFFSET(Balance!J156,0,($J$1-1)*8)","v":"-"}]
[null,"Régimen ordinario",{"$f":"OFFSET(Balance!C157,0,($J$1-1)*8)","v":"-"},{"$f":"OFFSET(Balance!D157,0,($J$1-1)*8)","v":"-"},{"$f":"OFFSET(Balance!E157,0,($J$1-1)*8)","v":"-"},{"$f":"OFFSET(Balance!F157,0,($J$1-1)*8)","v":"-"},{"$f":"OFFSET(Balance!G157,0,($J$1-1)*8)","v":"-"},{"$f":"OFFSET(Balance!H157,0,($J$1-1)*8)","v":"-"},{"$f":"OFFSET(Balance!I157,0,($J$1-1)*8)","v":"-"},{"$f":"OFFSET(Balance!J157,0,($J$1-1)*8)","v":"-"}]
[]
[null,"Hidroeólica",{"$f":"OFFSET(Balance!C158,0,($J$1-1)*8)","v":1071.8609999999999},{"$f":"OFFSET(Balance!D158,0,($J$1-1)*8)","v":8557.0660000000007},{"$f":"OFFSET(Balance!E158,0,($J$1-1)*8)","v":18102.638999999999},{"$f":"OFFSET(Balance!F158,0,($J$1-1)*8)","v":20398.516},{"$f":"OFFSET(Balance!G158,0,($J$1-1)*8)","v":5715.9579999999996},{"$f":"OFFSET(Balance!H158,0,($J$1-1)*8)","v":"-"},{"$f":"OFFSET(Balance!I158,0,($J$1-1)*8)","v":"-"},{"$f":"OFFSET(Balance!J158,0,($J$1-1)*8)","v":"-"}]
[null,"Resto hidráulica (4)",{"$f":"OFFSET(Balance!C159,0,($J$1-1)*8)","v":3479.0210000000002},{"$f":"OFFSET(Balance!D159,0,($J$1-1)*8)","v":"-"},{"$f":"OFFSET(Balance!E159,0,($J$1-1)*8)","v":"-"},{"$f":"OFFSET(Balance!F159,0,($J$1-1)*8)","v":"-"},{"$f":"OFFSET(Balance!G159,0,($J$1-1)*8)","v":"-"},{"$f":"OFFSET(Balance!H159,0,($J$1-1)*8)","v":"-"},{"$f":"OFFSET(Balance!I159,0,($J$1-1)*8)","v":"-"},{"$f":"OFFSET(Balance!J159,0,($J$1-1)*8)","v":"-"}]
[null,"Eólica",{"$f":"OFFSET(Balance!C160,0,($J$1-1)*8)","v":389964},{"$f":"OFFSET(Balance!D160,0,($J$1-1)*8)","v":396661.05200000003},{"$f":"OFFSET(Balance!E160,0,($J$1-1)*8)","v":393086},{"$f":"OFFSET(Balance!F160,0,($J$1-1)*8)","v":395943.174},{"$f":"OFFSET(Balance!G160,0,($J$1-1)*8)","v":157421.25200000001},{"$f":"OFFSET(Balance!H160,0,($J$1-1)*8)","v":"-"},{"$f":"OFFSET(Balance!I160,0,($J$1-1)*8)","v":"-"},{"$f":"OFFSET(Balance!J160,0,($J$1-1)*8)","v":"-"}]
[null,"Solar fotovoltaica",{"$f":"OFFSET(Balance!C161,0,($J$1-1)*8)","v":282291},{"$f":"OFFSET(Balance!D161,0,($J$1-1)*8)","v":275554.16099999996},{"$f":"OFFSET(Balance!E161,0,($J$1-1)*8)","v":277674},{"$f":"OFFSET(Balance!F161,0,($J$1-1)*8)","v":273539},{"$f":"OFFSET(Balance!G161,0,($J$1-1)*8)","v":61499.07},{"$f":"OFFSET(Balance!H161,0,($J$1-1)*8)","v":"-"},{"$f":"OFFSET(Balance!I161,0,($J$1-1)*8)","v":"-"},{"$f":"OFFSET(Balance!J161,0,($J$1-1)*8)","v":"-"}]
[null,"Térmica renovable/Otras renovables",{"$f":"OFFSET(Balance!C162,0,($J$1-1)*8)","v":8806.7219999999998},{"$f":"OFFSET(Balance!D162,0,($J$1-1)*8)","v":8053.2160000000003},{"$f":"OFFSET(Balance!E162,0,($J$1-1)*8)","v":9336},{"$f":"OFFSET(Balance!F162,0,($J$1-1)*8)","v":9565},{"$f":"OFFSET(Balance!G162,0,($J$1-1)*8)","v":1409},{"$f":"OFFSET(Balance!H162,0,($J$1-1)*8)","v":"-"},{"$f":"OFFSET(Balance!I162,0,($J$1-1)*8)","v":"-"},{"$f":"OFFSET(Balance!J162,0,($J$1-1)*8)","v":"-"}]
[null,"Cogeneración",{"$f":"OFFSET(Balance!C163,0,($J$1-1)*8)","v":0},{"$f":"OFFSET(Balance!D163,0,($J$1-1)*8)","v":0},{"$f":"OFFSET(Balance!E163,0,($J$1-1)*8)","v":0},{"$f":"OFFSET(Balance!F163,0,($J$1-1)*8)","v":0},{"$f":"OFFSET(Balance!G163,0,($J$1-1)*8)","v":0},{"$f":"OFFSET(Balance!H163,0,($J$1-1)*8)","v":"-"},{"$f":"OFFSET(Balance!I163,0,($J$1-1)*8)","v":"-"},{"$f":"OFFSET(Balance!J163,0,($J$1-1)*8)","v":"-"}]
[null,"Régimen especial",{"$f":"OFFSET(Balance!C164,0,($J$1-1)*8)","v":"-"},{"$f":"OFFSET(Balance!D164,0,($J$1-1)*8)","v":"-"},{"$f":"OFFSET(Balance!E164,0,($J$1-1)*8)","v":"-"},{"$f":"OFFSET(Balance!F164,0,($J$1-1)*8)","v":"-"},{"$f":"OFFSET(Balance!G164,0,($J$1-1)*8)","v":"-"},{"$f":"OFFSET(Balance!H164,0,($J$1-1)*8)","v":"-"},{"$f":"OFFSET(Balance!I164,0,($J$1-1)*8)","v":"-"},{"$f":"OFFSET(Balance!J164,0,($J$1-1)*8)","v":"-"}]
[null,"Generación",{"$f":"OFFSET(Balance!C165,0,($J$1-1)*8)","v":8579976.370000001},{"$f":"OFFSET(Balance!D165,0,($J$1-1)*8)","v":8669362.4399999995},{"$f":"OFFSET(Balance!E165,0,($J$1-1)*8)","v":8776838.8670000006},{"$f":"OFFSET(Balance!F165,0,($J$1-1)*8)","v":8958378.5219999999},{"$f":"OFFSET(Balance!G165,0,($J$1-1)*8)","v":2179843.7800000003},{"$f":"OFFSET(Balance!H165,0,($J$1-1)*8)","v":"-"},{"$f":"OFFSET(Balance!I165,0,($J$1-1)*8)","v":"-"},{"$f":"OFFSET(Balance!J165,0,($J$1-1)*8)","v":"-"}]
[null,"Demanda transporte (b.c.)",{"$f":"OFFSET(Balance!C166,0,($J$1-1)*8)","v":8579976.370000001},{"$f":"OFFSET(Balance!D166,0,($J$1-1)*8)","v":8669362.4399999995},{"$f":"OFFSET(Balance!E166,0,($J$1-1)*8)","v":8776838.8670000006},{"$f":"OFFSET(Balance!F166,0,($J$1-1)*8)","v":8958378.5219999999},{"$f":"OFFSET(Balance!G166,0,($J$1-1)*8)","v":2179843.7800000003},{"$f":"OFFSET(Balance!H166,0,($J$1-1)*8)","v":"-"},{"$f":"OFFSET(Balance!I166,0,($J$1-1)*8)","v":"-"},{"$f":"OFFSET(Balance!J166,0,($J$1-1)*8)","v":"-"}]
[null,"(1) Asignación de unidades de producción según combustible principal."]
[null,"(2) Utiliza fue y gasoil como combustible principal. Incluye funcionamiento en ciclo abierto."]
[null,"(3) Grupos de emergencia que se instalan de forma transitoria en determinadas zonas para cubrir un déficit de generación."]
[null,"(4) Incluye todas aquellas unidades menores de 50 MW que no pertenecen a ninguna unidad de gestión hidráulica (UGH)."]
[null,{"$f":"IF(MONTH(FACT)=1,\"\",CONCATENATE(\"Para el año \",YEAR(FACT), \" valores acumulados hasta \",TEXT(FACT-30,\"mmmm\"),\" de \",YEAR(FACT),\".\"))","v":"Para el año 2018 valores acumulados hasta marzo de 2018."}]
[null,{"$f":"'Balance nacional mensual'!B38","v":"Datos definitivos hasta el 31/03/2017. Datos provisionales del 01/04/2017 al 28/02/2018. Datos programados del 01/03/2018 al 31/03/2018."}]

{"sheet":"Balance Ceuta mensual","index":9,"n_rows":18,"n_cols":15,"rows_kept":18,"cut":false,"hidden":false,"merged":[[16,1,16,14],[17,1,17,14]]}
[null,null,null,null,null,null,null,null,null,null,null,null,null,null,12]
[]
[]
[null,null,null,null,null,null,null,null,null,null,null,null,"Sistema eléctrico"]
[null,null,null,null,null,null,null,null,null,null,null,null,"Horizonte temporal"]
[null,null,null,null,null,null,null,null,null,null,null,null,"Periodo"]
[]
[null,null,"Ene.","Feb.","Mar.","Abr.","May.","Jun.","Jul.","Ago.","Sep.","Oct.","Nov.","Dic.",{"$f":"OFFSET(Año!C19,($O$1-1),0)","v":2018}]
[]
[null,"Motores diesel",{"$f":"OFFSET(Balance!C64,0,($O$1-1)*12)","v":18543},{"$f":"OFFSET(Balance!D64,0,($O$1-1)*12)","v":17094.365000000002},{"$f":"OFFSET(Balance!E64,0,($O$1-1)*12)","v":18159.037},{"$f":"OFFSET(Balance!F64,0,($O$1-1)*12)","v":"-"},{"$f":"OFFSET(Balance!G64,0,($O$1-1)*12)","v":"-"},{"$f":"OFFSET(Balance!H64,0,($O$1-1)*12)","v":"-"},{"$f":"OFFSET(Balance!I64,0,($O$1-1)*12)","v":"-"},{"$f":"OFFSET(Balance!J64,0,($O$1-1)*12)","v":"-"},{"$f":"OFFSET(Balance!K64,0,($O$1-1)*12)","v":"-"},{"$f":"OFFSET(Balance!L64,0,($O$1-1)*12)","v":"-"},{"$f":"OFFSET(Balance!M64,0,($O$1-1)*12)","v":"-"},{"$f":"OFFSET(Balance!N64,0,($O$1-1)*12)","v":"-"},{"$f":"IF(SUM(C10:N10)=0,\"-\",SUM(C10:N10))","v":53796.402000000002}]
[null,"Turbina de gas",{"$f":"OFFSET(Balance!C65,0,($O$1-1)*12)","v":0.52300000000000002},{"$f":"OFFSET(Balance!D65,0,($O$1-1)*12)","v":5.0030000000000001},{"$f":"OFFSET(Balance!E65,0,($O$1-1)*12)","v":1.367},{"$f":"OFFSET(Balance!F65,0,($O$1-1)*12)","v":"-"},{"$f":"OFFSET(Balance!G65,0,($O$1-1)*12)","v":"-"},{"$f":"OFFSET(Balance!H65,0,($O$1-1)*12)","v":"-"},{"$f":"OFFSET(Balance!I65,0,($O$1-1)*12)","v":"-"},{"$f":"OFFSET(Balance!J65,0,($O$1-1)*12)","v":"-"},{"$f":"OFFSET(Balance!K65,0,($O$1-1)*12)","v":"-"},{"$f":"OFFSET(Balance!L65,0,($O$1-1)*12)","v":"-"},{"$f":"OFFSET(Balance!M65,0,($O$1-1)*12)","v":"-"},{"$f":"OFFSET(Balance!N65,0,($O$1-1)*12)","v":"-"},6.8929999999999998]
[null,"Fuel + Gas",{"$f":"OFFSET(Balance!C66,0,($O$1-1)*12)","v":18543.523000000001},{"$f":"OFFSET(Balance!D66,0,($O$1-1)*12)","v":17099.368000000002},{"$f":"OFFSET(Balance!E66,0,($O$1-1)*12)","v":18160.403999999999},{"$f":"OFFSET(Balance!F66,0,($O$1-1)*12)","v":"-"},{"$f":"OFFSET(Balance!G66,0,($O$1-1)*12)","v":"-"},{"$f":"OFFSET(Balance!H66,0,($O$1-1)*12)","v":"-"},{"$f":"OFFSET(Balance!I66,0,($O$1-1)*12)","v":"-"},{"$f":"OFFSET(Balance!J66,0,($O$1-1)*12)","v":"-"},{"$f":"OFFSET(Balance!K66,0,($O$1-1)*12)","v":"-"},{"$f":"OFFSET(Balance!L66,0,($O$1-1)*12)","v":"-"},{"$f":"OFFSET(Balance!M66,0,($O$1-1)*12)","v":"-"},{"$f":"OFFSET(Balance!N66,0,($O$1-1)*12)","v":"-"},{"$f":"SUM(O10:O11)","v":53803.294999999998}]
[null,"Régimen ordinario",{"$f":"OFFSET(Balance!C67,0,($O$1-1)*12)","v":"-"},{"$f":"OFFSET(Balance!D67,0,($O$1-1)*12)","v":"-"},{"$f":"OFFSET(Balance!E67,0,($O$1-1)*12)","v":"-"},{"$f":"OFFSET(Balance!F67,0,($O$1-1)*12)","v":"-"},{"$f":"OFFSET(Balance!G67,0,($O$1-1)*12)","v":"-"},{"$f":"OFFSET(Balance!H67,0,($O$1-1)*12)","v":"-"},{"$f":"OFFSET(Balance!I67,0,($O$1-1)*12)","v":"-"},{"$f":"OFFSET(Balance!J67,0,($O$1-1)*12)","v":"-"},{"$f":"OFFSET(Balance!K67,0,($O$1-1)*12)","v":"-"},{"$f":"OFFSET(Balance!L67,0,($O$1-1)*12)","v":"-"},{"$f":"OFFSET(Balance!M67,0,($O$1-1)*12)","v":"-"},{"$f":"OFFSET(Balance!N67,0,($O$1-1)*12)","v":"-"},{"$f":"SUM(O12)","v":53803.294999999998}]
[]
[null,"Generación",{"$f":"OFFSET(Balance!C68,0,($O$1-1)*12)","v":18543.523000000001},{"$f":"OFFSET(Balance!D68,0,($O$1-1)*12)","v":17099.368000000002},{"$f":"OFFSET(Balance!E68,0,($O$1-1)*12)","v":18160.403999999999},{"$f":"OFFSET(Balance!F68,0,($O$1-1)*12)","v":"-"},{"$f":"OFFSET(Balance!G68,0,($O$1-1)*12)","v":"-"},{"$f":"OFFSET(Balance!H68,0,($O$1-1)*12)","v":"-"},{"$f":"OFFSET(Balance!I68,0,($O$1-1)*12)","v":"-"},{"$f":"OFFSET(Balance!J68,0,($O$1-1)*12)","v":"-"},{"$f":"OFFSET(Balance!K68,0,($O$1-1)*12)","v":"-"},{"$f":"OFFSET(Balance!L68,0,($O$1-1)*12)","v":"-"},{"$f":"OFFSET(Balance!M68,0,($O$1-1)*12)","v":"-"},{"$f":"OFFSET(Balance!N68,0,($O$1-1)*12)","v":"-"},{"$f":"SUM(O13:O14)","v":53803.294999999998}]
[null,"Demanda transporte (b.c.)",{"$f":"OFFSET(Balance!C69,0,($O$1-1)*12)","v":18543.523000000001},{"$f":"OFFSET(Balance!D69,0,($O$1-1)*12)","v":17099.368000000002},{"$f":"OFFSET(Balance!E69,0,($O$1-1)*12)","v":18160.403999999999},{"$f":"OFFSET(Balance!F69,0,($O$1-1)*12)","v":"-"},{"$f":"OFFSET(Balance!G69,0,($O$1-1)*12)","v":"-"},{"$f":"OFFSET(Balance!H69,0,($O$1-1)*12)","v":"-"},{"$f":"OFFSET(Balance!I69,0,($O$1-1)*12)","v":"-"},{"$f":"OFFSET(Balance!J69,0,($O$1-1)*12)","v":"-"},{"$f":"OFFSET(Balance!K69,0,($O$1-1)*12)","v":"-"},{"$f":"OFFSET(Balance!L69,0,($O$1-1)*12)","v":"-"},{"$f":"OFFSET(Balance!M69,0,($O$1-1)*12)","v":"-"},{"$f":"OFFSET(Balance!N69,0,($O$1-1)*12)","v":"-"},{"$f":"O15","v":53803.294999999998}]
[null,"(1) Asignación de unidades de producción según combustible principal."]
[null,{"$f":"CONCATENATE(\"Datos definitivos hasta el \",RIGHT('Balance nacional mensual'!B38,59))","v":"Datos definitivos hasta el 28/02/2018. Datos programados del 01/03/2018 al 31/03/2018."}]

{"sheet":"Balance Ceuta anual","index":10,"n_rows":19,"n_cols":9,"rows_kept":19,"cut":false,"hidden":false,"merged":[[16,1,16,11],[28,1,28,14]]}
[null,null,null,null,null,null,null,null,2]
[]
[]
[null,null,null,null,null,null,null,"Sistema eléctrico"]
[null,null,null,null,null,null,null,"Horizonte temporal"]
[null,null,null,null,null,null,null,"Periodo"]
[]
[null,null,{"$f":"OFFSET(Balance!C168,0,($I$1-1)*7)","v":2014},{"$f":"OFFSET(Balance!D168,0,($I$1-1)*7)","v":2015},{"$f":"OFFSET(Balance!E168,0,($I$1-1)*7)","v":2016},{"$f":"OFFSET(Balance!F168,0,($I$1-1)*7)","v":2017},{"$f":"OFFSET(Balance!G168,0,($I$1-1)*7)","v":2018},{"$f":"OFFSET(Balance!H168,0,($I$1-1)*7)","v":2019},{"$f":"OFFSET(Balance!I168,0,($I$1-1)*7)","v":2020}]
[]
[null,"Motores diesel",{"$f":"OFFSET(Balance!C169,0,($I$1-1)*7)","v":212164.56700000004},{"$f":"OFFSET(Balance!D169,0,($I$1-1)*7)","v":204715.61900000001},{"$f":"OFFSET(Balance!E169,0,($I$1-1)*7)","v":210611.989},{"$f":"OFFSET(Balance!F169,0,($I$1-1)*7)","v":202665.00700000001},{"$f":"OFFSET(Balance!G169,0,($I$1-1)*7)","v":53796.402000000002},{"$f":"OFFSET(Balance!H169,0,($I$1-1)*7)","v":"-"},{"$f":"OFFSET(Balance!I169,0,($I$1-1)*7)","v":"-"}]
[null,"Turbina de gas",{"$f":"OFFSET(Balance!C170,0,($I$1-1)*7)","v":89.154999999999973},{"$f":"OFFSET(Balance!D170,0,($I$1-1)*7)","v":723.98099999999999},{"$f":"OFFSET(Balance!E170,0,($I$1-1)*7)","v":116.15799999999999},{"$f":"OFFSET(Balance!F170,0,($I$1-1)*7)","v":200.56},{"$f":"OFFSET(Balance!G170,0,($I$1-1)*7)","v":6.8929999999999998},{"$f":"OFFSET(Balance!H170,0,($I$1-1)*7)","v":"-"},{"$f":"OFFSET(Balance!I170,0,($I$1-1)*7)","v":"-"}]
[null,"Fuel + Gas",{"$f":"OFFSET(Balance!C171,0,($I$1-1)*7)","v":212253.72200000004},{"$f":"OFFSET(Balance!D171,0,($I$1-1)*7)","v":205439.6},{"$f":"OFFSET(Balance!E171,0,($I$1-1)*7)","v":210728.147},{"$f":"OFFSET(Balance!F171,0,($I$1-1)*7)","v":202865.56699999998},{"$f":"OFFSET(Balance!G171,0,($I$1-1)*7)","v":53803.294999999998},{"$f":"OFFSET(Balance!H171,0,($I$1-1)*7)","v":"-"},{"$f":"OFFSET(Balance!I171,0,($I$1-1)*7)","v":"-"}]
[null,"Régimen ordinario",{"$f":"OFFSET(Balance!C172,0,($I$1-1)*7)","v":212253.72200000004},{"$f":"OFFSET(Balance!D172,0,($I$1-1)*7)","v":"-"},{"$f":"OFFSET(Balance!E172,0,($I$1-1)*7)","v":"-"},{"$f":"OFFSET(Balance!F172,0,($I$1-1)*7)","v":"-"},{"$f":"OFFSET(Balance!G172,0,($I$1-1)*7)","v":"-"},{"$f":"OFFSET(Balance!H172,0,($I$1-1)*7)","v":"-"},{"$f":"OFFSET(Balance!I172,0,($I$1-1)*7)","v":"-"}]
[]
[null,"Generación",{"$f":"OFFSET(Balance!C173,0,($I$1-1)*7)","v":212253.72200000004},{"$f":"OFFSET(Balance!D173,0,($I$1-1)*7)","v":205439.6},{"$f":"OFFSET(Balance!E173,0,($I$1-1)*7)","v":210728.147},{"$f":"OFFSET(Balance!F173,0,($I$1-1)*7)","v":202865.56699999998},{"$f":"OFFSET(Balance!G173,0,($I$1-1)*7)","v":53803.294999999998},{"$f":"OFFSET(Balance!H173,0,($I$1-1)*7)","v":"-"},{"$f":"OFFSET(Balance!I173,0,($I$1-1)*7)","v":"-"}]
[null,"Demanda transporte (b.c.)",{"$f":"OFFSET(Balance!C174,0,($I$1-1)*7)","v":212253.72200000004},{"$f":"OFFSET(Balance!D174,0,($I$1-1)*7)","v":205439.6},{"$f":"OFFSET(Balance!E174,0,($I$1-1)*7)","v":210728.147},{"$f":"OFFSET(Balance!F174,0,($I$1-1)*7)","v":202865.56699999998},{"$f":"OFFSET(Balance!G174,0,($I$1-1)*7)","v":53803.294999999998},{"$f":"OFFSET(Balance!H174,0,($I$1-1)*7)","v":"-"},{"$f":"OFFSET(Balance!I174,0,($I$1-1)*7)","v":"-"}]
[null,"(1) Asignación de unidades de producción según combustible principal."]
[null,{"$f":"IF(MONTH(FACT)=1,\"\",CONCATENATE(\"Para el año \",YEAR(FACT), \" valores acumulados hasta \",TEXT(FACT-30,\"mmmm\"),\" de \",YEAR(FACT),\".\"))","v":"Para el año 2018 valores acumulados hasta marzo de 2018."}]
[null,{"$f":"'Balance Ceuta mensual'!B18:O18","v":"Datos definitivos hasta el 28/02/2018. Datos programados del 01/03/2018 al 31/03/2018."}]

{"sheet":"Balance Melilla mensual","index":11,"n_rows":23,"n_cols":15,"rows_kept":23,"cut":false,"hidden":false,"merged":[[21,1,21,14],[22,1,22,14]]}
[null,null,null,null,null,null,null,null,null,null,null,null,null,null,12]
[]
[]
[null,null,null,null,null,null,null,null,null,null,null,null,"Sistema eléctrico"]
[null,null,null,null,null,null,null,null,null,null,null,null,"Horizonte temporal"]
[null,null,null,null,null,null,null,null,null,null,null,null,"Periodo"]
[]
[null,null,"Ene.","Feb.","Mar.","Abr.","May.","Jun.","Jul.","Ago.","Sep.","Oct.","Nov.","Dic.",{"$f":"OFFSET(Año!C19,($O$1-1),0)","v":2018}]
[]
[null,"Motores diesel",{"$f":"OFFSET(Balance!C72,0,($O$1-1)*12)","v":17107.228999999999},{"$f":"OFFSET(Balance!D72,0,($O$1-1)*12)","v":16055.701999999999},{"$f":"OFFSET(Balance!E72,0,($O$1-1)*12)","v":17014.526000000002},{"$f":"OFFSET(Balance!F72,0,($O$1-1)*12)","v":"-"},{"$f":"OFFSET(Balance!G72,0,($O$1-1)*12)","v":"-"},{"$f":"OFFSET(Balance!H72,0,($O$1-1)*12)","v":"-"},{"$f":"OFFSET(Balance!I72,0,($O$1-1)*12)","v":"-"},{"$f":"OFFSET(Balance!J72,0,($O$1-1)*12)","v":"-"},{"$f":"OFFSET(Balance!K72,0,($O$1-1)*12)","v":"-"},{"$f":"OFFSET(Balance!L72,0,($O$1-1)*12)","v":"-"},{"$f":"OFFSET(Balance!M72,0,($O$1-1)*12)","v":"-"},{"$f":"OFFSET(Balance!N72,0,($O$1-1)*12)","v":"-"},{"$f":"IF(SUM(C10:N10)=0,\"-\",SUM(C10:N10))","v":50177.456999999995}]
[null,"Turbina de gas",{"$f":"OFFSET(Balance!C73,0,($O$1-1)*12)","v":41.656999999999996},{"$f":"OFFSET(Balance!D73,0,($O$1-1)*12)","v":8.0890000000000004},{"$f":"OFFSET(Balance!E73,0,($O$1-1)*12)","v":0.51700000000000002},{"$f":"OFFSET(Balance!F73,0,($O$1-1)*12)","v":"-"},{"$f":"OFFSET(Balance!G73,0,($O$1-1)*12)","v":"-"},{"$f":"OFFSET(Balance!H73,0,($O$1-1)*12)","v":"-"},{"$f":"OFFSET(Balance!I73,0,($O$1-1)*12)","v":"-"},{"$f":"OFFSET(Balance!J73,0,($O$1-1)*12)","v":"-"},{"$f":"OFFSET(Balance!K73,0,($O$1-1)*12)","v":"-"},{"$f":"OFFSET(Balance!L73,0,($O$1-1)*12)","v":"-"},{"$f":"OFFSET(Balance!M73,0,($O$1-1)*12)","v":"-"},{"$f":"OFFSET(Balance!N73,0,($O$1-1)*12)","v":"-"},{"$f":"IF(SUM(C11:N11)=0,\"-\",SUM(C11:N11))","v":50.262999999999998}]
[null,"Fuel + Gas",{"$f":"OFFSET(Balance!C74,0,($O$1-1)*12)","v":17148.885999999999},{"$f":"OFFSET(Balance!D74,0,($O$1-1)*12)","v":16063.790999999999},{"$f":"OFFSET(Balance!E74,0,($O$1-1)*12)","v":17015.043000000001},{"$f":"OFFSET(Balance!F74,0,($O$1-1)*12)","v":"-"},{"$f":"OFFSET(Balance!G74,0,($O$1-1)*12)","v":"-"},{"$f":"OFFSET(Balance!H74,0,($O$1-1)*12)","v":"-"},{"$f":"OFFSET(Balance!I74,0,($O$1-1)*12)","v":"-"},{"$f":"OFFSET(Balance!J74,0,($O$1-1)*12)","v":"-"},{"$f":"OFFSET(Balance!K74,0,($O$1-1)*12)","v":"-"},{"$f":"OFFSET(Balance!L74,0,($O$1-1)*12)","v":"-"},{"$f":"OFFSET(Balance!M74,0,($O$1-1)*12)","v":"-"},{"$f":"OFFSET(Balance!N74,0,($O$1-1)*12)","v":"-"},{"$f":"SUM(O10:O11)","v":50227.719999999994}]
[null,"Régimen ordinario",{"$f":"OFFSET(Balance!C75,0,($O$1-1)*12)","v":"-"},{"$f":"OFFSET(Balance!D75,0,($O$1-1)*12)","v":"-"},{"$f":"OFFSET(Balance!E75,0,($O$1-1)*12)","v":"-"},{"$f":"OFFSET(Balance!F75,0,($O$1-1)*12)","v":"-"},{"$f":"OFFSET(Balance!G75,0,($O$1-1)*12)","v":"-"},{"$f":"OFFSET(Balance!H75,0,($O$1-1)*12)","v":"-"},{"$f":"OFFSET(Balance!I75,0,($O$1-1)*12)","v":"-"},{"$f":"OFFSET(Balance!J75,0,($O$1-1)*12)","v":"-"},{"$f":"OFFSET(Balance!K75,0,($O$1-1)*12)","v":"-"},{"$f":"OFFSET(Balance!L75,0,($O$1-1)*12)","v":"-"},{"$f":"OFFSET(Balance!M75,0,($O$1-1)*12)","v":"-"},{"$f":"OFFSET(Balance!N75,0,($O$1-1)*12)","v":"-"},{"$f":"SUM(O12)","v":50227.719999999994}]
[]
[null,"Solar fotovoltaica",{"$f":"OFFSET(Balance!C76,0,($O$1-1)*12)","v":4},{"$f":"OFFSET(Balance!D76,0,($O$1-1)*12)","v":6},{"$f":"OFFSET(Balance!E76,0,($O$1-1)*12)","v":0},{"$f":"OFFSET(Balance!F76,0,($O$1-1)*12)","v":"-"},{"$f":"OFFSET(Balance!G76,0,($O$1-1)*12)","v":"-"},{"$f":"OFFSET(Balance!H76,0,($O$1-1)*12)","v":"-"},{"$f":"OFFSET(Balance!I76,0,($O$1-1)*12)","v":"-"},{"$f":"OFFSET(Balance!J76,0,($O$1-1)*12)","v":"-"},{"$f":"OFFSET(Balance!K76,0,($O$1-1)*12)","v":"-"},{"$f":"OFFSET(Balance!L76,0,($O$1-1)*12)","v":"-"},{"$f":"OFFSET(Balance!M76,0,($O$1-1)*12)","v":"-"},{"$f":"OFFSET(Balance!N76,0,($O$1-1)*12)","v":"-"},{"$f":"IF(SUM(C15:N15)=0,\"-\",SUM(C15:N15))","v":10}]
[null,"Cogeneración y resto",{"$f":"OFFSET(Balance!C77,0,($O$1-1)*12)","v":0},{"$f":"OFFSET(Balance!D77,0,($O$1-1)*12)","v":0},{"$f":"OFFSET(Balance!E77,0,($O$1-1)*12)","v":0},{"$f":"OFFSET(Balance!F77,0,($O$1-1)*12)","v":"-"},{"$f":"OFFSET(Balance!G77,0,($O$1-1)*12)","v":"-"},{"$f":"OFFSET(Balance!H77,0,($O$1-1)*12)","v":"-"},{"$f":"OFFSET(Balance!I77,0,($O$1-1)*12)","v":"-"},{"$f":"OFFSET(Balance!J77,0,($O$1-1)*12)","v":"-"},{"$f":"OFFSET(Balance!K77,0,($O$1-1)*12)","v":"-"},{"$f":"OFFSET(Balance!L77,0,($O$1-1)*12)","v":"-"},{"$f":"OFFSET(Balance!M77,0,($O$1-1)*12)","v":"-"},{"$f":"OFFSET(Balance!N77,0,($O$1-1)*12)","v":"-"},{"$f":"IF(SUM(C16:N16)=0,\"-\",SUM(C16:N16))","v":"-"}]
[null,"Residuos no renovables",{"$f":"OFFSET(Balance!C78,0,($O$1-1)*12)","v":521},{"$f":"OFFSET(Balance!D78,0,($O$1-1)*12)","v":484.5},{"$f":"OFFSET(Balance!E78,0,($O$1-1)*12)","v":395.45},{"$f":"OFFSET(Balance!F78,0,($O$1-1)*12)","v":"-"},{"$f":"OFFSET(Balance!G78,0,($O$1-1)*12)","v":"-"},{"$f":"OFFSET(Balance!H78,0,($O$1-1)*12)","v":"-"},{"$f":"OFFSET(Balance!I78,0,($O$1-1)*12)","v":"-"},{"$f":"OFFSET(Balance!J78,0,($O$1-1)*12)","v":"-"},{"$f":"OFFSET(Balance!K78,0,($O$1-1)*12)","v":"-"},{"$f":"OFFSET(Balance!L78,0,($O$1-1)*12)","v":"-"},{"$f":"OFFSET(Balance!M78,0,($O$1-1)*12)","v":"-"},{"$f":"OFFSET(Balance!N78,0,($O$1-1)*12)","v":"-"},{"$f":"IF(SUM(C17:N17)=0,\"-\",SUM(C17:N17))","v":1400.95}]
[null,"Residuos renovables",{"$f":"OFFSET(Balance!C79,0,($O$1-1)*12)","v":521},{"$f":"OFFSET(Balance!D79,0,($O$1-1)*12)","v":484.5},{"$f":"OFFSET(Balance!E79,0,($O$1-1)*12)","v":395.45},{"$f":"OFFSET(Balance!F79,0,($O$1-1)*12)","v":"-"},{"$f":"OFFSET(Balance!G79,0,($O$1-1)*12)","v":"-"},{"$f":"OFFSET(Balance!H79,0,($O$1-1)*12)","v":"-"},{"$f":"OFFSET(Balance!I79,0,($O$1-1)*12)","v":"-"},{"$f":"OFFSET(Balance!J79,0,($O$1-1)*12)","v":"-"},{"$f":"OFFSET(Balance!K79,0,($O$1-1)*12)","v":"-"},{"$f":"OFFSET(Balance!L79,0,($O$1-1)*12)","v":"-"},{"$f":"OFFSET(Balance!M79,0,($O$1-1)*12)","v":"-"},{"$f":"OFFSET(Balance!N79,0,($O$1-1)*12)","v":"-"},{"$f":"IF(SUM(C18:N18)=0,\"-\",SUM(C18:N18))","v":1400.95}]
[null,"Régimen especial",{"$f":"OFFSET(Balance!C80,0,($O$1-1)*12)","v":"-"},{"$f":"OFFSET(Balance!D80,0,($O$1-1)*12)","v":"-"},{"$f":"OFFSET(Balance!E80,0,($O$1-1)*12)","v":"-"},{"$f":"OFFSET(Balance!F80,0,($O$1-1)*12)","v":"-"},{"$f":"OFFSET(Balance!G80,0,($O$1-1)*12)","v":"-"},{"$f":"OFFSET(Balance!H80,0,($O$1-1)*12)","v":"-"},{"$f":"OFFSET(Balance!I80,0,($O$1-1)*12)","v":"-"},{"$f":"OFFSET(Balance!J80,0,($O$1-1)*12)","v":"-"},{"$f":"OFFSET(Balance!K80,0,($O$1-1)*12)","v":"-"},{"$f":"OFFSET(Balance!L80,0,($O$1-1)*12)","v":"-"},{"$f":"OFFSET(Balance!M80,0,($O$1-1)*12)","v":"-"},{"$f":"OFFSET(Balance!N80,0,($O$1-1)*12)","v":"-"},{"$f":"SUM(O15:O18)","v":2811.9}]
[null,"Generación",{"$f":"OFFSET(Balance!C81,0,($O$1-1)*12)","v":18194.885999999999},{"$f":"OFFSET(Balance!D81,0,($O$1-1)*12)","v":17038.791000000001},{"$f":"OFFSET(Balance!E81,0,($O$1-1)*12)","v":17805.942999999999},{"$f":"OFFSET(Balance!F81,0,($O$1-1)*12)","v":"-"},{"$f":"OFFSET(Balance!G81,0,($O$1-1)*12)","v":"-"},{"$f":"OFFSET(Balance!H81,0,($O$1-1)*12)","v":"-"},{"$f":"OFFSET(Balance!I81,0,($O$1-1)*12)","v":"-"},{"$f":"OFFSET(Balance!J81,0,($O$1-1)*12)","v":"-"},{"$f":"OFFSET(Balance!K81,0,($O$1-1)*12)","v":"-"},{"$f":"OFFSET(Balance!L81,0,($O$1-1)*12)","v":"-"},{"$f":"OFFSET(Balance!M81,0,($O$1-1)*12)","v":"-"},{"$f":"OFFSET(Balance!N81,0,($O$1-1)*12)","v":"-"},{"$f":"SUM(O13:O14,O19)","v":53039.619999999995}]
[null,"Demanda transporte (b.c.)",{"$f":"OFFSET(Balance!C82,0,($O$1-1)*12)","v":18194.885999999999},{"$f":"OFFSET(Balance!D82,0,($O$1-1)*12)","v":17038.791000000001},{"$f":"OFFSET(Balance!E82,0,($O$1-1)*12)","v":17805.942999999999},{"$f":"OFFSET(Balance!F82,0,($O$1-1)*12)","v":"-"},{"$f":"OFFSET(Balance!G82,0,($O$1-1)*12)","v":"-"},{"$f":"OFFSET(Balance!H82,0,($O$1-1)*12)","v":"-"},{"$f":"OFFSET(Balance!I82,0,($O$1-1)*12)","v":"-"},{"$f":"OFFSET(Balance!J82,0,($O$1-1)*12)","v":"-"},{"$f":"OFFSET(Balance!K82,0,($O$1-1)*12)","v":"-"},{"$f":"OFFSET(Balance!L82,0,($O$1-1)*12)","v":"-"},{"$f":"OFFSET(Balance!M82,0,($O$1-1)*12)","v":"-"},{"$f":"OFFSET(Balance!N82,0,($O$1-1)*12)","v":"-"},{"$f":"O20","v":53039.619999999995}]
[null,"(1) Asignación de unidades de producción según combustible principal."]
[null,{"$f":"'Balance nacional mensual'!B38","v":"Datos definitivos hasta el 31/03/2017. Datos provisionales del 01/04/2017 al 28/02/2018. Datos programados del 01/03/2018 al 31/03/2018."}]

{"sheet":"Balance Melilla anual","index":12,"n_rows":25,"n_cols":9,"rows_kept":25,"cut":false,"hidden":false,"merged":[[21,1,21,11],[22,1,22,11]]}
[null,null,null,null,null,null,null,null,2]
[]
[]
[null,null,null,null,null,null,null,"Sistema eléctrico"]
[null,null,null,null,null,null,null,"Horizonte temporal"]
[null,null,null,null,null,null,null,"Periodo"]
[]
[null,null,{"$f":"OFFSET(Balance!C176,0,($I$1-1)*7)","v":2014},{"$f":"OFFSET(Balance!D176,0,($I$1-1)*7)","v":2015},{"$f":"OFFSET(Balance!E176,0,($I$1-1)*7)","v":2016},{"$f":"OFFSET(Balance!F176,0,($I$1-1)*7)","v":2017},{"$f":"OFFSET(Balance!G176,0,($I$1-1)*7)","v":2018},{"$f":"OFFSET(Balance!H176,0,($I$1-1)*7)","v":2019},{"$f":"OFFSET(Balance!I176,0,($I$1-1)*7)","v":2020}]
[]
[null,"Motores diesel",{"$f":"OFFSET(Balance!C177,0,($I$1-1)*7)","v":200163.61000000002},{"$f":"OFFSET(Balance!D177,0,($I$1-1)*7)","v":204228.133},{"$f":"OFFSET(Balance!E177,0,($I$1-1)*7)","v":198326.31299999997},{"$f":"OFFSET(Balance!F177,0,($I$1-1)*7)","v":200491.94299999997},{"$f":"OFFSET(Balance!G177,0,($I$1-1)*7)","v":50177.456999999995},{"$f":"OFFSET(Balance!H177,0,($I$1-1)*7)","v":"-"},{"$f":"OFFSET(Balance!I177,0,($I$1-1)*7)","v":"-"}]
[null,"Turbina de gas",{"$f":"OFFSET(Balance!C178,0,($I$1-1)*7)","v":724.20299999999997},{"$f":"OFFSET(Balance!D178,0,($I$1-1)*7)","v":587.85799999999995},{"$f":"OFFSET(Balance!E178,0,($I$1-1)*7)","v":241.53300000000002},{"$f":"OFFSET(Balance!F178,0,($I$1-1)*7)","v":73.228999999999999},{"$f":"OFFSET(Balance!G178,0,($I$1-1)*7)","v":50.262999999999998},{"$f":"OFFSET(Balance!H178,0,($I$1-1)*7)","v":"-"},{"$f":"OFFSET(Balance!I178,0,($I$1-1)*7)","v":"-"}]
[null,"Fuel + Gas",{"$f":"OFFSET(Balance!C179,0,($I$1-1)*7)","v":200887.81300000002},{"$f":"OFFSET(Balance!D179,0,($I$1-1)*7)","v":204815.99100000004},{"$f":"OFFSET(Balance!E179,0,($I$1-1)*7)","v":198567.84600000002},{"$f":"OFFSET(Balance!F179,0,($I$1-1)*7)","v":200565.17200000002},{"$f":"OFFSET(Balance!G179,0,($I$1-1)*7)","v":50227.72},{"$f":"OFFSET(Balance!H179,0,($I$1-1)*7)","v":"-"},{"$f":"OFFSET(Balance!I179,0,($I$1-1)*7)","v":"-"}]
[null,"Régimen ordinario",{"$f":"OFFSET(Balance!C180,0,($I$1-1)*7)","v":"-"},{"$f":"OFFSET(Balance!D180,0,($I$1-1)*7)","v":"-"},{"$f":"OFFSET(Balance!E180,0,($I$1-1)*7)","v":"-"},{"$f":"OFFSET(Balance!F180,0,($I$1-1)*7)","v":"-"},{"$f":"OFFSET(Balance!G180,0,($I$1-1)*7)","v":"-"},{"$f":"OFFSET(Balance!H180,0,($I$1-1)*7)","v":"-"},{"$f":"OFFSET(Balance!I180,0,($I$1-1)*7)","v":"-"}]
[]
[null,"Solar fotovoltaica",{"$f":"OFFSET(Balance!C181,0,($I$1-1)*7)","v":85},{"$f":"OFFSET(Balance!D181,0,($I$1-1)*7)","v":78},{"$f":"OFFSET(Balance!E181,0,($I$1-1)*7)","v":78},{"$f":"OFFSET(Balance!F181,0,($I$1-1)*7)","v":76},{"$f":"OFFSET(Balance!G181,0,($I$1-1)*7)","v":10},{"$f":"OFFSET(Balance!H181,0,($I$1-1)*7)","v":"-"},{"$f":"OFFSET(Balance!I181,0,($I$1-1)*7)","v":"-"}]
[null,"Cogeneración y resto (2)",{"$f":"OFFSET(Balance!C182,0,($I$1-1)*7)","v":8898},{"$f":"OFFSET(Balance!D182,0,($I$1-1)*7)","v":"-"},{"$f":"OFFSET(Balance!E182,0,($I$1-1)*7)","v":"-"},{"$f":"OFFSET(Balance!F182,0,($I$1-1)*7)","v":"-"},{"$f":"OFFSET(Balance!G182,0,($I$1-1)*7)","v":"-"},{"$f":"OFFSET(Balance!H182,0,($I$1-1)*7)","v":"-"},{"$f":"OFFSET(Balance!I182,0,($I$1-1)*7)","v":"-"}]
[null,"Residuos no renovables",{"$f":"OFFSET(Balance!C183,0,($I$1-1)*7)","v":"-"},{"$f":"OFFSET(Balance!D183,0,($I$1-1)*7)","v":4295.5},{"$f":"OFFSET(Balance!E183,0,($I$1-1)*7)","v":4850},{"$f":"OFFSET(Balance!F183,0,($I$1-1)*7)","v":4977.5},{"$f":"OFFSET(Balance!G183,0,($I$1-1)*7)","v":1400.95},{"$f":"OFFSET(Balance!H183,0,($I$1-1)*7)","v":"-"},{"$f":"OFFSET(Balance!I183,0,($I$1-1)*7)","v":"-"}]
[null,"Residuos renovables",{"$f":"OFFSET(Balance!C184,0,($I$1-1)*7)","v":"-"},{"$f":"OFFSET(Balance!D184,0,($I$1-1)*7)","v":4295.5},{"$f":"OFFSET(Balance!E184,0,($I$1-1)*7)","v":4850},{"$f":"OFFSET(Balance!F184,0,($I$1-1)*7)","v":4977.5},{"$f":"OFFSET(Balance!G184,0,($I$1-1)*7)","v":1400.95},{"$f":"OFFSET(Balance!H184,0,($I$1-1)*7)","v":"-"},{"$f":"OFFSET(Balance!I184,0,($I$1-1)*7)","v":"-"}]
[null,"Régimen especial",{"$f":"OFFSET(Balance!C185,0,($I$1-1)*7)","v":"-"},{"$f":"OFFSET(Balance!D185,0,($I$1-1)*7)","v":"-"},{"$f":"OFFSET(Balance!E185,0,($I$1-1)*7)","v":"-"},{"$f":"OFFSET(Balance!F185,0,($I$1-1)*7)","v":"-"},{"$f":"OFFSET(Balance!G185,0,($I$1-1)*7)","v":"-"},{"$f":"OFFSET(Balance!H185,0,($I$1-1)*7)","v":"-"},{"$f":"OFFSET(Balance!I185,0,($I$1-1)*7)","v":"-"}]
[null,"Generación",{"$f":"OFFSET(Balance!C186,0,($I$1-1)*7)","v":209870.81300000002},{"$f":"OFFSET(Balance!D186,0,($I$1-1)*7)","v":213484.99100000004},{"$f":"OFFSET(Balance!E186,0,($I$1-1)*7)","v":208345.84600000002},{"$f":"OFFSET(Balance!F186,0,($I$1-1)*7)","v":210596.17200000002},{"$f":"OFFSET(Balance!G186,0,($I$1-1)*7)","v":53039.619999999995},{"$f":"OFFSET(Balance!H186,0,($I$1-1)*7)","v":"-"},{"$f":"OFFSET(Balance!I186,0,($I$1-1)*7)","v":"-"}]
[null,"Demanda transporte (b.c.)",{"$f":"OFFSET(Balance!C187,0,($I$1-1)*7)","v":209870.81300000002},{"$f":"OFFSET(Balance!D187,0,($I$1-1)*7)","v":213484.99100000004},{"$f":"OFFSET(Balance!E187,0,($I$1-1)*7)","v":208345.84600000002},{"$f":"OFFSET(Balance!F187,0,($I$1-1)*7)","v":210596.17200000002},{"$f":"OFFSET(Balance!G187,0,($I$1-1)*7)","v":53039.619999999995},{"$f":"OFFSET(Balance!H187,0,($I$1-1)*7)","v":"-"},{"$f":"OFFSET(Balance!I187,0,($I$1-1)*7)","v":"-"}]
[null,"(1) Asignación de unidades de producción según combustible principal."]
[null,"(2) Incluye residuos."]
[null,{"$f":"IF(MONTH(FACT)=1,\"\",CONCATENATE(\"Para el año \",YEAR(FACT), \" valores acumulados hasta \",TEXT(FACT-30,\"mmmm\"),\" de \",YEAR(FACT),\".\"))","v":"Para el año 2018 valores acumulados hasta marzo de 2018."}]
[null,{"$f":"'Balance nacional mensual'!B38","v":"Datos definitivos hasta el 31/03/2017. Datos provisionales del 01/04/2017 al 28/02/2018. Datos programados del 01/03/2018 al 31/03/2018."}]

{"sheet":"Balance","index":13,"n_rows":210,"n_cols":350,"rows_kept":210,"cut":false,"hidden":true,"merged":[]}
[]
[null,"Balance eléctrico mensual peninsular (GWh)","1990-01-01","1990-02-01","1990-03-01","1990-04-01","1990-05-01","1990-06-01","1990-07-01","1990-08-01","1990-09-01","1990-10-01","1990-11-01","1990-12-01","1991-01-01","1991-02-01","1991-03-01","1991-04-01","1991-05-01","1991-06-01","1991-07-01","1991-08-01","1991-09-01","1991-10-01","1991-11-01","1991-12-01","1992-01-01","1992-02-01","1992-03-01","1992-04-01","1992-05-01","1992-06-01","1992-07-01","1992-08-01","1992-09-01","1992-10-01","1992-11-01","1992-12-01","1993-01-01","1993-02-01","1993-03-01","1993-04-01","1993-05-01","1993-06-01","1993-07-01","1993-08-01","1993-09-01","1993-10-01","1993-11-01","1993-12-01","1994-01-01","1994-02-01","1994-03-01","1994-04-01","1994-05-01","1994-06-01","1994-07-01","1994-08-01","1994-09-01","1994-10-01","1994-11-01","1994-12-01","1995-01-01","1995-02-01","1995-03-01","1995-04-01","1995-05-01","1995-06-01","1995-07-01","1995-08-01","1995-09-01","1995-10-01","1995-11-01","1995-12-01","1996-01-01","1996-02-01","1996-03-01","1996-04-01","1996-05-01","1996-06-01","1996-07-01","1996-08-01","1996-09-01","1996-10-01","1996-11-01","1996-12-01","1997-01-01","1997-02-01","1997-03-01","1997-04-01","1997-05-01","1997-06-01","1997-07-01","1997-08-01","1997-09-01","1997-10-01","1997-11-01","1997-12-01","1998-01-01","1998-02-01","1998-03-01","1998-04-01","1998-05-01","1998-06-01","1998-07-01","1998-08-01","1998-09-01","1998-10-01","1998-11-01","1998-12-01","1999-01-01","1999-02-01","1999-03-01","1999-04-01","1999-05-01","1999-06-01","1999-07-01","1999-08-01","1999-09-01","1999-10-01","1999-11-01","1999-12-01","2000-01-01","2000-02-01","2000-03-01","2000-04-01","2000-05-01","2000-06-01","2000-07-01","2000-08-01","2000-09-01","2000-10-01","2000-11-01","2000-12-01","2001-01-01","2001-02-01","2001-03-01","2001-04-01","2001-05-01","2001-06-01","2001-07-01","2001-08-01","2001-09-01","2001-10-01","2001-11-01","2001-12-01","2002-01-01","2002-02-01","2002-03-01","2002-04-01","2002-05-01","2002-06-01","2002-07-01","2002-08-01","2002-09-01","2002-10-01","2002-11-01","2002-12-01","2003-01-01","2003-02-01","2003-03-01","2003-04-01","2003-05-01","2003-06-01","2003-07-01","2003-08-01","2003-09-01","2003-10-01","2003-11-01","2003-12-01","2004-01-01","2004-02-01","2004-03-01","2004-04-01","2004-05-01","2004-06-01","2004-07-01","2004-08-01","2004-09-01","2004-10-01","2004-11-01","2004-12-01","2005-01-01","2005-02-01","2005-03-01","2005-04-01","2005-05-01","2005-06-01","2005-07-01","2005-08-01","2005-09-01","2005-10-01","2005-11-01","2005-12-01","2006-01-01","2006-02-01","2006-03-01","2006-04-01","2006-05-01","2006-06-01","2006-07-01","2006-08-01","2006-09-01","2006-10-01","2006-11-01","2006-12-01","2007-01-01","2007-02-01","2007-03-01","2007-04-01","2007-05-01","2007-06-01","2007-07-01","2007-08-01","2007-09-01","2007-10-01","2007-11-01","2007-12-01","2008-01-01","2008-02-01","2008-03-01","2008-04-01","2008-05-01","2008-06-01","2008-07-01","2008-08-01","2008-09-01","2008-10-01","2008-11-01","2008-12-01","2009-01-01","2009-02-01","2009-03-01","2009-04-01","2009-05-01","2009-06-01","2009-07-01","2009-08-01","2009-09-01","2009-10-01","2009-11-01","2009-12-01","2010-01-01","2010-02-01","2010-03-01","2010-04-01","2010-05-01","2010-06-01","2010-07-01","2010-08-01","2010-09-01","2010-10-01","2010-11-01","2010-12-01","2011-01-01","2011-02-01","2011-03-01","2011-04-01","2011-05-01","2011-06-01","2011-07-01","2011-08-01","2011-09-01","2011-10-01","2011-11-01","2011-12-01","2012-01-01","2012-02-01","2012-03-01","2012-04-01","2012-05-01","2012-06-01","2012-07-01","2012-08-01","2012-09-01","2012-10-01","2012-11-01","2012-12-01","2013-01-01","2013-02-01","2013-03-01","2013-04-01","2013-05-01","2013-06-01","2013-07-01","2013-08-01","2013-09-01","2013-10-01","2013-11-01","2013-12-01","2014-01-01","2014-02-01","2014-03-01","2014-04-01","2014-05-01","2014-06-01","2014-07-01","2014-08-01","2014-09-01","2014-10-01","2014-11-01","2014-12-01","2015-01-01","2015-02-01","2015-03-01","2015-04-01","2015-05-01","2015-06-01","2015-07-01","2015-08-01","2015-09-01","2015-10-01","2015-11-01","2015-12-01","2016-01-01","2016-02-01","2016-03-01","2016-04-01","2016-05-01","2016-06-01","2016-07-01","2016-08-01","2016-09-01","2016-10-01","2016-11-01","2016-12-01","2017-01-01","2017-02-01","2017-03-01","2017-04-01","2017-05-01","2017-06-01","2017-07-01","2017-08-01","2017-09-01","2017-10-01","2017-11-01","2017-12-01","2018-01-01","2018-02-01","2018-03-01","2018-04-01","2018-05-01","2018-06-01","2018-07-01","2018-08-01","2018-09-01","2018-10-01","2018-11-01","2018-12-01"]
[null,"Hidráulica",3812.6836999999987,3241.3313999999987,2387.7997000000005,1664.4924999999992,1752.901800000001,1739.8822,1544.0681999999999,1169.8983999999989,1178.3229000000017,1337.0603000000017,1868.1971000000021,1844.1224000000009,2467.4703999999979,1919.5628999999992,3614.2048000000013,3316.7103000000006,2694.829699999998,1973.8522000000016,1620.9676000000009,1055.4560000000006,1050.6569000000009,1456.6256999999982,1844.0770999999968,1713.5203000000015,1250.8666000000014,723.77950000000226,698.12999999999874,1390.8228999999994,1287.4845000000005,1384.7241999999992,1490.8638999999987,1021.247400000003,1103.2181999999984,1653.1741000000013,1965.1256999999989,2587.4304999999986,1964.7223000000017,1382.2487000000033,1283.8341999999971,971.62319999999681,1629.2967000000003,1998.1276000000009,1732.0918000000011,1141.0418999999988,1098.4951999999985,2604.2501000000002,3227.9826999999968,2480.7752999999984,3506.1817999999994,2871.0269000000003,2559.2106999999965,2180.1566999999995,2397.3124999999977,2261.0100000000029,1724.8935999999999,1239.8088000000002,1153.1582000000008,1376.5238999999979,2086.2166000000016,1653.1660000000034,2531.9199000000003,2392.7034000000026,2922.0561999999995,1736.6887000000038,1575.2418999999973,1613.2683,1506.0024999999998,986.9472999999989,810.23769999999809,876.02170000000251,1104.648999999999,2183.3511999999996,5366.4255000000003,5212.2742000000007,3299.6810999999993,3427.3588999999974,3565.8544000000006,2717.445299999999,2133.1411999999978,1426.6442,1653.9289000000003,1642.9637000000023,2028.170699999999,3850.8693000000017,5243.6578000000009,3212.0474000000017,2463.6685999999991,2149.822099999999,2047.0708000000016,2156.1440999999982,1862.2452000000017,1573.612700000001,1466.7002999999995,1361.9637999999989,3192.0373000000009,4952.2926000000007,5470.6294999999982,3738.6073999999985,2434.159300000003,3142.3083000000001,3702.8203000000008,3175.0883999999992,2392.2328999999995,1887.271500000001,1699.3457999999996,1791.5409000000006,1342.3168000000005,1079.2141000000008,1111.8596000000011,1083.0403000000006,1671.6503000000014,1854.149699999999,2506.3907999999997,2240.7727999999997,1763.463400000001,1280.9923999999987,1341.8103000000001,1474.790199999999,2480.3627999999994,2488.0994000000019,2258.7286000000026,1356.0572000000002,1300.8535999999999,1804.3185999999987,2863.7578000000017,2010.3655000000006,1492.7415999999989,1557.3933000000006,1681.1606000000013,1511.4157000000005,2137.1221000000005,4083.9201999999987,5842.8609000000006,5371.9687000000013,6098.7381000000005,3956.8406999999988,2967.3583000000017,2227.5889000000011,1785.2493000000011,1721.3026000000004,1319.4317000000015,1577.8276999999989,1812.4448,1422.9655,1092.5866000000001,918.69360000000006,1561.1817000000001,1532.7879,1572.4141000000002,1595.1734000000001,1135.2789,844.28559999999993,837.77120000000014,937.81510000000003,1607.2706000000001,3690.6138999999998,5077.4655000000002,3962.1758999999997,4042.1839999999997,3389.9379999999996,3195.2093,2009.3285000000001,1705.3562000000002,1257.8616999999999,1451.1365000000001,1701.9632999999999,2809.7932000000001,4405.9511000000002,3194.3600999999985,2970.8209999999976,2675.6499000000003,2489.1504999999997,2791.3154000000013,2347.6550999999999,1776.8765999999987,1499.0746000000015,1336.6138000000053,1499.4952000000026,2039.2544999999986,1500.192400000001,1212.9129999999996,1247.2604000000024,1424.3981000000015,1633.9949999999992,1748.5583999999988,1526.0680999999977,1063.7019000000018,938.54999999999757,667.86839999999802,638.98779999999829,1022.1012999999966,1306.2117000000005,1233.9692999999993,869.53769999999804,2443.6332999999972,2221.2243000000017,1775.277900000001,1255.5403000000015,1280.5138000000029,855.7432,952.06890000000055,1324.1278999999988,2588.522599999998,4426.2256999999954,1920.0478000000003,2539.7347,3412.3603999999996,2337.7021,2328.2846,1896.4941999999999,2152.4522999999999,1514.2806,1189.9214999999999,1525.5493000000001,1152.0925,1010.0581,1052.9718,724.43350000000009,774.5612000000001,2158.8984000000028,2756.8809000000001,2593.9364999999998,1801.4576,1275.0206000000001,1101.1437999999998,904.63950000000011,1192.6748000000002,1959.02,1753.4290999999998,2852.5814999999998,2234.3775999999998,1704.1587,2008.6723999999999,1659.6541999999999,1393.0593999999999,1167.1748,750.34090000000003,1028.1299000000001,1560.9612999999999,2619.7628999999997,4414.2761132999995,3450.7255615999998,5031.7780444,4029.8561307,3174.5390475999998,2946.0881532000003,2437.1694070000003,1695.0818135,1249.4073436999997,1282.6130285000002,2043.8580677,3254.0614768999999,4452.6179633060001,2489.5449081979996,3179.3737100999997,2947.9286343640001,2303.8190585580001,1656.8643463960002,1275.667963936,1226.754154882,987.62639421200004,1058.4860482879999,1728.4718566200004,1735.21487035,1290.8354821600001,892.93011502000013,986.88043857999992,1274.3038001159998,1893.1437641940004,1663.7087523760001,1333.759449704,1069.821452312,836.67316930199979,1119.087479006,1575.4273045339999,2041.313122994,2346.31781026,2863.5976818160002,3778.6305351000001,4543.6187317780004,3031.87805385,2542.564553832,2184.2292828140003,1739.652574466,1523.9424708719998,1522.3665315180001,2278.7143926239996,1931.9919450100001,3475.8993178300002,5004.8099078599998,4483.1102180580001,4171.2361138279994,2211.6758872419996,1958.705239572,1871.228496684,1639.2983342280002,1440.6196519580001,1271.1454530799999,1906.2266791900001,2608.923207674,2566.888279364,3559.434091526,3844.206083778,2655.528439486,2946.0626280720003,2485.9641503080002,2054.6366936880004,1634.9782370920002,1601.6680798899999,1646.579402544,1887.6912419959999,1438.786957106,3440.58428495,4050.8695185739994,4362.851437966,5231.3090089240004,5085.1196365120004,2938.0602728839999,2264.8167052260001,2040.7426219440003,1653.80530344,1632.8625515920003,1493.763942218,1844.3684335419998,2043.1615533339998,1952.9824518620001,2696.8499227359998,1714.3967434680001,1923.6625081560001,1637.937684776,1193.060807952,1085.2741187339998,1188.239510438,828.31292537800005,842.28049153200004,1254.3414266699999,2195.1409847860004,2386.6154253499999,4379.9547000000002,"-","-","-","-","-","-","-","-","-"]
[null,"Turbinación bombeo",{"$f":"-C20*0.7","v":161.4753},{"$f":"-D20*0.7","v":85.601599999999991},10.0023,19.701499999999999,30.440199999999997,9.1798000000000002,15.472799999999998,34.9846,112.49909999999998,108.8507,31.154899999999998,108.12759999999999,188.23560000000001,152.8681,120.1802,8.5406999999999993,10.940299999999999,28.968799999999998,40.398400000000002,50.463000000000001,78.941099999999992,56.615299999999998,131.96889999999999,134.7927,183.39439999999999,101.0205,119.30799999999999,208.3151,139.03049999999999,172.7978,194.17509999999996,192.34460000000001,192.08979999999997,204.50989999999999,127.22429999999999,119.28349999999999,97.118700000000004,78.882299999999987,132.29579999999999,141.7808,158.94829999999999,94.095399999999998,97.892200000000003,133.19809999999998,141.65479999999999,133.4529,59.527299999999997,52.444700000000005,212.85320000000002,87.943099999999987,11.206299999999999,24.212299999999999,37.103499999999997,28,78.989399999999989,20.304199999999998,118.04379999999998,131.6301,78.821399999999997,112.66499999999998,160.95309999999998,106.2796,104.93979999999999,97.369299999999981,88.76209999999999,{"$f":"-BP20*0.7","v":88.375699999999995},114.76149999999998,110.08269999999999,122.0093,124.77429999999998,116.68299999999999,222.21779999999998,532.94150000000002,133.28979999999999,21.018899999999999,23.697099999999999,30.819599999999998,51.009699999999995,46.447799999999994,8.4517999999999986,16.242099999999997,27.432299999999998,48.775300000000001,125.70669999999998,177.05519999999999,26.094599999999996,8.5833999999999993,15.047899999999998,57.320199999999993,59.81989999999999,82.714799999999997,123.43729999999999,133.03569999999999,101.2872,186.24269999999999,261.98339999999996,194.00849999999997,94.386599999999987,77.847699999999989,150.40269999999998,127.23269999999999,80.190600000000003,142.36109999999999,223.94749999999999,135.36320000000001,120.20610000000001,149.65019999999998,315.83089999999999,328.1404,239.93270000000001,164.0667,151.03129999999999,153.87819999999999,124.34519999999999,150.1626,182.5866,238.65169999999998,342.83479999999997,221.2182,269.61759999999998,258.01439999999997,219.27780000000001,241.97040000000001,359.50039999999996,432.54820000000001,231.15049999999997,226.40939999999998,172.43869999999998,179.7824,{"$f":"-EB20*0.7","v":253.77029999999999},316.1739,543.78379999999993,377.35109999999997,215.15129999999996,271.24790000000002,140.6713,150.2347,181.0641,212.10769999999999,204.07239999999999,258.12430000000001,254.86929999999998,235.3022,391.68849999999992,456.99639999999994,354.36939999999998,326.40229999999997,310.37509999999997,391.61989999999997,439.92059999999998,489.86909999999995,400.59039999999999,418.58179999999999,402.89689999999996,399.29539999999997,478.76009999999997,411.1345,265.81309999999996,258.05499999999995,153.08999999999997,186.19369999999998,291.00049999999999,293.89079999999996,330.62329999999997,305.91749999999996,273.21069999999997,225.48679999999999,280.27789999999999,283.37189999999998,193.28399999999999,237.30209999999997,230.29649999999998,275.3646,297.92489999999998,285.8184,270.50939999999997,271.4502,288.03879999999998,251.00249999999997,338.93159999999995,387.16300000000001,303.05659999999995,344.81089999999995,315.43399999999997,450.14759999999995,444.16890000000001,485.31909999999993,312.25599999999997,363.80259999999993,337.94319999999999,318.21369999999996,387.54730000000001,410.50869999999998,{"$f":"-GN20*0.7","v":370.94329999999997},262.44469999999995,214.06069999999997,219.59209999999996,259.05669999999998,359.3492,280.24779999999998,340.60109999999997,379.06610000000001,379.10039999999998,268.89030000000002,260.2432,277.11529999999999,268.91759999999999,205.37789999999998,278.33539999999999,249.37780000000001,233.46469999999999,259.9674,242.14749999999998,221.90069999999997,268.90849999999995,336.8449,301.58519999999999,293.51349999999996,281.25579999999997,153.34059999999999,144.25110000000001,199.67849999999999,177.6474,133.56139999999999,158.58920000000001,208.00149999999996,287.87919999999997,322.44799999999998,344.55889999999994,274.42450000000002,197.03039999999999,179.03129999999999,173.24859999999998,157.21579999999997,168.71259999999998,171.5042,178.14509999999999,198.88609999999997,278.25069999999994,334.92410000000001,529.60983670000007,388.30555539999995,381.26509259999995,212.21241929999999,195.96443439999999,161.10858679999998,139.41769099999999,161.80076849999998,163.58696829999997,242.28118949999995,225.55656829999995,319.33869309999994,283.94490769399999,172.14437780200001,234.3481209,201.526885636,111.13141044199999,97.401727604000001,102.43908606400001,120.019735118,138.437161788,216.20731071200001,224.26137738,281.67412965,318.69145184000001,266.29888497999997,265.75549541999999,307.58115988400004,223.421483806,199.61285362400002,195.82272629600001,256.54768168800001,270.24170669800003,283.98781499400002,276.84362946600004,337.08485500600005,372.34012374000002,342.600296184,457.14945289999997,370.51571222199999,251.14840015000001,216.49426816800002,175.260815186,163.016439534,139.951745128,216.268290482,246.284607376,338.64703298999996,443.67862617000003,369.22198314000002,354.77524994200002,361.18861317199998,275.95647575800001,207.70265442800002,170.77235531599999,151.65694177199998,160.19068604199998,267.50232792000003,326.90832081000002,326.44179232599998,319.02103063599998,291.33964547400001,327.144737222,255.86272351400001,242.84147692799999,125.366838692,110.974045312,202.46425890799998,162.10553811,249.57726645600002,276.57492800400001,332.09329889399999,454.98487605000003,434.36759242599999,351.10246903400002,429.29966807599999,316.01911348800002,169.55252211600001,96.849533773999994,110.35765205600001,101.23997756,161.43736240799998,258.23356678200003,250.884576458,291.21301766599998,267.73958013800001,241.22357426400001,199.433449532,162.454982844,91.897749223999995,98.826694048000007,112.205176266,118.523846562,133.817345622,222.08938846799998,309.56905333000003,273.43523521399999,180.62302364999999,283.77729999999997,"-","-","-","-","-","-","-","-","-"]
[null,"Nuclear",5193.2669999999998,4339.07,4257.0429999999997,4556.652,3888.4780000000001,3340.7759999999998,4237.2030000000004,4785.9570000000003,3922.86,3724.6979999999999,4508.0119999999997,5151.652,5104.1710000000003,4384.2939999999999,4067.27,3992.02,4552.1890000000003,4225.1899999999996,4437.6530000000002,4942.09,4277.0730000000003,4464.0169999999998,4223.2820000000002,4493.1509999999998,5192.8770000000004,4385.7290000000003,4026.587,3462.453,4064.5410000000002,4293.1989999999996,4749.7550000000001,4946.1469999999999,4034.17,4813.0360000000001,4192.3450000000003,5199.2209999999995,5201.174,4155.7929999999997,4669.1880000000001,4062.3710000000001,3893.6060000000002,4183.93,4729.2460000000001,4829.7979999999998,4382.91,4501.3059999999996,4049.26,5006.7079999999996,4888.2139999999999,3958.1379999999999,3900.1210000000001,4180.04,4543.5010000000002,3955.25,4579.1760000000004,5011.7669999999998,4867.835,4055.7330000000002,3978.7339999999999,5077.2939999999999,5146.4290000000001,4395.348,4446.4219999999996,4134.1989999999996,4752.0510000000004,4513.0550000000003,4113.75,4140.442,3814.6640000000002,4207.8209999999999,4297.0649999999996,5176.8519999999999,5195.7539999999999,4737.4430000000002,4830.9219999999996,4445.9740000000002,5116.9250000000002,3774.4290000000001,3664.36,3673.0569999999998,3886.011,4866.2370000000001,4595.5460000000003,5326.0879999999997,5031.4409999999998,4410.6220000000003,3691.5619999999999,4062.0650000000001,4998.1310000000003,4588.0749999999998,4734.5360000000001,4656.4660000000003,4176.0129999999999,4076.8440000000001,4225.6610000000001,4396.9260000000004,4850.357,4864.741,4461.1189999999997,4236.9560000000001,4651.5559999999996,4934.2110000000002,5286.8950000000004,5284.7460000000001,4524.4040000000005,4228.4549999999999,4439.5460000000003,4809.0609999999997,5175.085,3934.9490000000001,4011.0189999999998,3517.41,4880.7039999999997,4516.8969999999999,4677.9319999999998,5216.1670000000004,4711.5259999999998,5076.299,5278.6869999999999,5381.5219999999999,5459.17,5121.3310000000001,4958.84,4468.1360000000004,4874.4319999999998,5231.8050000000003,5359.4309999999996,5001.26,4030.7669999999998,4407.5630000000001,5064.9549999999999,5552.63,5502.3770000000004,4781.0929999999998,4681.95,4579.076,5513.3280000000004,5103.848,5432.7079999999996,5308.9870000000001,4701.9359999999997,4737.7489999999998,5173.6959999999999,5468.4650000000001,5520.4269999999997,4774.6279999999997,4206.7129999999997,4213.8419999999996,4779.2070000000003,5056.317,5461.0479999999998,5342.009,4584.9179999999997,5397.9639999999999,5372.2539999999999,5579.12,5509.2039999999997,4935.9390000000003,4672.1049999999996,4666.5870000000004,4788.8159999999998,4456.1189999999997,5407.9309999999996,5310.3649999999998,4125.6400000000003,4543.8519999999999,5301.45,5501.5820000000003,5460.7179999999998,5125.5640000000003,4948.6270000000004,5126.8320000000003,4825.2929999999997,5119.8680000000004,5506.2659999999996,5391.1970000000001,4699.0659999999998,4456.99,5064.8130000000001,5150.5079999999998,5568.3090000000002,4881.1490000000003,4397.3779999999997,3772.4949999999999,3619.3679999999999,3778.6930000000002,3888.0259999999998,4532.116,5109.7690000000002,4710.4870000000001,5173.1639999999998,5470.8789999999999,5421.2830000000004,4884.5969999999998,5073.241,3528.8339999999998,4300.0879999999997,4842.6530000000002,4775.66,5164.5550000000003,4298.7560000000003,4620.2969999999996,5068.6260000000002,5375.116,5319.1580000000004,4778.3050000000003,4947.4629999999997,4342.93,3485.058,3161.45,3855.7460000000001,3976.62,4877.2839999999997,4891.0659999999998,3934.346,5069.5010000000002,5322.9409999999998,5119.9319999999998,5354.7060000000001,4039.7550000000001,4689.7039999999997,4579.7330000000002,4541.0349999999999,5013.9489999999996,4482.3890000000001,4314.4620000000004,4045.8270000000002,4955.8580000000002,5438.39,4335.1400000000003,3949.223,4063.489,3687.607,3530.33,3998.25,5278.1620000000003,4387.8469999999998,3957.8240000000001,3973.4949999999999,3949.6880000000001,4480.6099999999997,4635.9830000000002,4877.9646469999998,4894.268,4417.8689999999997,4693.97,5399.9840000000004,5421.2550000000001,5066.8190000000004,5429.7690000000002,5094.6189999999997,4829.2110000000002,4718.777,4271.59,4332.2643109999999,4457.3370000000004,3640.74,4702.2290000000003,4823.0249999999996,5271.61,4983.1229999999996,4499.7290000000003,4546.8770000000004,4856.63,5171.7839999999997,5146.0450000000001,5472.3729999999996,5200.7150000000001,4487.326,3504.3710000000001,5098.692,5457.9219999999996,5300.0649999999996,5396.02,4070.386,4361.2879999999996,4582.8119999999999,4425.6019999999999,5210.3209999999999,4458.8410000000003,3995.2890000000002,4334.933,5136.4780000000001,5025.3630000000003,4740.6139999999996,4342.4009999999998,4067.681,3986.5520000000001,4535.384,4723.7730000000001,5288.5060000000003,5057.6959999999999,4341.3779999999997,3439.377,4262.5479999999998,4221.3969999999999,4806.0709999999999,5129.5820000000003,4369.2830000000004,4695.2439999999997,5242.7219999999998,4720.8609999999999,5205.7860000000001,4690.1409999999996,3554.4010480000002,3771.7689999999998,4798.9250000000002,4963.9790000000003,4873.9170000000004,4095.259,3973.4929999999999,4863.5860000000002,4615.6859999999997,3973.2069999999999,5191.7529999999997,5055.57,3891.866,4819.2470000000003,5178.0649999999996,5151.8209999999999,5009.8950000000004,5096.1009999999997,3774.5970000000002,4341.1639999999998,5285.3739999999998,4768.268,5270.7340000000004,4928.7539999999999,4143.7839999999997,4049.538,4393.4089999999997,5080.2929999999997,4725.6310000000003,4310.2259999999997,3615.6709999999998,5037.24,5098.7070000000003,4594.5630000000001,4486.4690999999993,"-","-","-","-","-","-","-","-","-"]
[null,"Carbón",3554.7130000000002,2808.93,4652.6989999999996,4136.5429999999997,4587.1109999999999,5321.4319999999998,5250.7060000000001,3947.904,5387.902,5510.9690000000001,4915.0630000000001,5264.8360000000002,5224.28,5296.625,3495.0279999999998,3481.8490000000002,3671.8180000000002,4256.6930000000002,4980.1729999999998,4086.721,5208.0709999999999,5263.2470000000003,5335.63,5504.1719999999996,5944.99,5738.3360000000002,6103.6019999999999,5201.3090000000002,4697.4560000000001,4286.62,5015.9709999999995,4074.3449999999998,5319.2740000000003,4625.6970000000001,4904.8990000000003,3913.3960000000002,5346.884,5513.03,5612.2,5170.2950000000001,4777.482,4212.7860000000001,4707.7950000000001,4404.0150000000003,5167.9459999999999,4033.7550000000001,4331.0810000000001,4573.8289999999997,3978.51,4574.6260000000002,4772.0309999999999,4414.0839999999998,3947.5819999999999,4969.9160000000002,5461.8220000000001,4646.473,4986.63,5297.8029999999999,4989.8029999999999,5135.4290000000001,4961.5429999999997,4086.7020000000002,4543.3760000000002,4764.9229999999998,4849.9660000000003,4988.4269999999997,5813.1210000000001,5715.2879999999996,5955.4340000000002,5452.8069999999998,5627.4120000000003,4475.7129999999997,2360.5059999999999,2530.3960000000002,3906.415,2566.183,2468.0160000000001,4802.9570000000003,6075.884,5718.72,5483.2709999999997,5300.6729999999998,5235.7960000000003,3019.8519999999999,3369.9650000000001,3440.4050000000002,5261.442,5405.2070000000003,4764.1080000000002,4851.4949999999999,5510.2690000000002,5458.799,6182.2820000000002,6159.8909999999996,4489.942,3626.0010000000002,2784.9969999999998,3170.357,5292.9309999999996,4252.3119999999999,3309.6819999999998,4052.5839999999998,5346.3990000000003,4423.5739999999996,5801.1279999999997,6013.634,6005.6689999999999,6472.7079999999996,6340.8639999999996,5930.6809999999996,6145.65,5483.5320000000002,4405.9440000000004,5287.6989999999996,6323.3829999999998,5275.55,6366.4870000000001,5855.6469999999999,5280.2830000000004,5709.9129999999996,6646.7269999999999,6309.58,6444.9,5440.6189999999997,4905.92,5885.0379999999996,6534.3549999999996,6262.8040000000001,6674.8770000000004,6592.7020000000002,6222.2370000000001,4308.4120000000003,3864.127,3418.3440000000001,3396.4870000000001,3806.2080000000001,4867.4440000000004,5835.1459999999997,6385.9369999999999,6261.54,6593.6639999999998,6585.9129999999996,6448.018,6986.076,6959.4219999999996,6404.2160000000003,6858.5259999999998,6465.3549999999996,6436.5510000000004,6061.0640000000003,6297.098,6142.6760000000004,6405.9840000000004,5954.9880000000003,6040.4160000000002,4529.3950000000004,4692.41,5217.6180000000004,5238.5379999999996,4917.42,5208.8059999999996,6150.0929999999998,6649.875,6645.7740000000003,6560.4669999999996,6463.7240000000002,5574.1440000000002,4974.2969999999996,5656.4549999999999,5871.2439999999997,6356.1559999999999,5163.0929999999998,5313.8549999999996,5886.91,6545.9870000000001,6332.2389999999996,6239.2479999999996,6190.8059999999996,5967.0519999999997,6597.0609999999997,6811.0429999999997,6089.2169999999996,6168.6570000000002,5506.63,5676.7759999999998,5758.9080000000004,6257.933,5758.1769999999997,5916.0669999999991,6141.5519999999997,6328.2110000000002,6580.9179999999997,6886.5889999999999,5775.3689999999997,4765.6580000000004,3496.4920000000002,5080.473,5562.59,6510.018,5286.5910000000003,5409.01,4807.43,4258.2139999999999,4287.6310000000003,6102.67,4895.3440000000001,4863.6350000000002,5834.9139999999998,5991.8040000000001,5773.7129999999997,5941.4759999999997,5886.2380000000003,5490.1840000000002,5348.8280000000004,5486.22,6071.2219999999998,4980.9620000000004,4597.7120000000004,3661.9070000000002,3107.0479999999998,2174.694,2041.751,3682.3649999999998,3065.9859999999999,3445.7359999999999,4099.5609999999997,4098.3509999999997,4453.4639999999999,4585.1629999999996,3015.4140000000002,2964.835,1785.3620000000001,2230.875,2454.0859999999998,3212.9270000000001,1795.0940000000001,2689.4720000000002,3054.2979999999998,1997.712,1837.3240000000001,1696.0940000000001,1367.2760000000001,844.19683400000008,633.69799999999998,823.90599999999995,1322.5630000000001,2450.4160000000002,2835.7339999999999,2971.1260000000002,1987.136,1627.231,2039.8789999999999,2046.91,2465.9850000000001,2981.8594069999999,2442.991,2961.694,2727.0279999999998,4186.6130000000003,4069.8069999999998,4665.6499999999996,4282.6189999999997,3880.549,3790.1219999999998,5155.723,5284.4470000000001,4450.6859999999997,2519.9769999999999,3786.125,5062.384,4674.9290000000001,4819.2690000000002,3811.0169999999998,4058.4580369999999,3915.7240000000002,3592.1469999999999,2887.2489999999998,2416.6030000000001,1257.787,904.23199999999997,1901.7360000000001,2464.3339999999998,5226.9780000000001,4374.2529999999997,4539.9620000000004,4032.0120000000002,2511.31,4660.4269999999997,2116.6080000000002,756.298,1149.2190000000001,1222.6990000000001,3177.6909999999998,5007.9830000000002,5378.1710000000003,5052.8900000000003,5684.2669999999998,4391.0060000000003,3148.0790000000002,4047.7660000000001,4900.1130000000003,2941.5079999999998,2591.2600000000002,2955.7919999999999,2829.4630000000002,5330.826,6063.442,5202.1499999999996,4598.2759999999998,4304.6319999999996,4578.0150000000003,4628.2953669999997,2561.0259999999998,1806.4839999999999,1690.627,903.56100000000004,1036.145,2053.3679999999999,3659.5210000000002,3398.3910000000001,4304.2709999999997,4283.7070000000003,4457.4279999999999,5032.9750000000004,5166.1390000000001,3326.569,1791.5029999999999,1901.8214580000001,3538.877,4289.04,4040.0160000000001,2977.3270000000002,2835.5230000000001,3910.402,4674.415,4141.2920000000004,3041.538,3500.7289999999998,1320.4065000000001,"-","-","-","-","-","-","-","-","-"]
[null,"Fuel + Gas",204.21799999999999,106.63200000000001,108.53100000000001,79.792000000000002,202.10499999999999,384.87799999999999,413.75400000000002,154.66399999999999,238.91200000000001,286.88600000000002,267.43900000000002,418.13499999999999,255.22300000000001,330.26900000000001,128.71299999999999,181.60300000000001,200.85400000000001,278.56799999999998,687.28200000000004,178.96100000000001,651.77,308.13900000000001,371.59300000000002,468.71,1299.375,1787.73,1434.2529999999999,698.91499999999996,614.41099999999994,147.673,415.72300000000001,221.51499999999999,529.48400000000004,185.83699999999999,87.533000000000001,41.134,95.265000000000001,339.47300000000001,343.83600000000001,259.45,99.405000000000001,120.458,38.927,88.599000000000004,185.27199999999999,52.688000000000002,79.194000000000003,74.58,99.884,90.411000000000001,115.89400000000001,122.31100000000001,19.071000000000002,97.451999999999998,377.67399999999998,54.8,84.703999999999994,118.869,64.489999999999995,166.625,152.78100000000001,37.526000000000003,143.05000000000001,120.69,108.38200000000001,288.23200000000003,593.74300000000005,231.72399999999999,578.34900000000005,658.57899999999995,432.286,315.82100000000003,15.11,185.81,257.11,138.06399999999999,30.667999999999999,162.97,265.834,140.58600000000001,231.84,97.462999999999994,243.30500000000001,274.57,261.459,382.80099999999999,453.16300000000001,496.78800000000001,437.55900000000003,493.38499999999999,819.47199999999998,582.31200000000001,735.84,822.64400000000001,542.72900000000004,524.38900000000001,69.924000000000007,100.93300000000001,152.994,52.481999999999999,36.298000000000002,200.45699999999999,473.96899999999999,507.113,713.85500000000002,389.214,997.22,1644.422,1502.4580000000001,1861.3040000000001,1086.079,532.75699999999995,168.64400000000001,532.41,1127.99,686.73099999999999,596.71299999999997,154.83099999999999,413.447,687.29899999999998,1113.6690000000001,491.26400000000001,1132.8869999999999,724.64300000000003,174.01300000000001,674.13099999999997,890.41,736.76900000000001,1450.383,931.17499999999995,755.077,490.87799999999999,502.29,406.87400000000002,415.24599999999998,162.84899999999999,332.142,1148.567,1351.6949999999999,1201.8900000000001,1299.134,1281.4549999999999,1320.4590000000001,2157.018,2663.5720000000001,1619.6969999999999,1419.443,1389.165,1086.731,1639.8030000000001,1896.914,889.726,1207.8599999999999,878.51300000000003,477.95100000000002,376.30700000000002,581.38300000000004,499.10700000000003,206.44800000000001,78.707999999999998,237.10300000000001,1224.425,1186.8030000000001,1068.492,943.46799999999996,648.37199999999996,347.553,409.78,431.41399999999999,344.90600000000001,608.28800000000001,174.5,312.65300000000002,737.54499999999996,1090.75,714.63199999999995,946.65800000000002,578.89200000000005,466.279,682.95100000000002,916.31399999999996,1095.0899999999999,1363.62,371.74299999999999,521.77099999999996,1160.585,1354.2950000000001,407.67500000000001,515.48199999999997,357.86500000000001,420.92899999999997,808.94899999999996,760.53599999999994,627.52300000000002,291.553,282.34699999999998,230.67099999999999,521.58600000000001,1004.05,339.096,760.59699999999998,340.62799999999999,131.166,106.30500000000001,102.61,220.43700000000001,191.126,113.172,166.47399999999999,83.596000000000004,272.95100000000002,212.661,233.035,127.13200000000001,199.01599999999999,168.55500000000001,142.142,124.255,70.555000000000007,137.19999999999999,147.767,248.85499999999999,154.96299999999999,242.51900000000001,189.06899999999999,200.066,227.26599999999999,190.238,128.80699999999999,119.209,191.56200000000001,137.76900000000001,91.483999999999995,147.09100000000001,212.322,171.65,154.518,104.51600000000001,165.87799999999999,164.78399999999999,153.209,126.666,22.518000000000001,105.508,163.869,165.56899999999999,138.49199999999999,113.152,138.31899999999999,124.90300000000001,166.81100000000001,147.00700000000001,0,0,0,0,0,0,0,0,0,0,0,0,0,0,0,0,0,0,0,0,0,0,0,0,0,0,0,0,0,0,0,0,0,0,0,0,0,0,0,0,0,0,0,0,0,0,0,0,0,0,0,0,0,0,0,0,0,0,0,0,0,0,0,0,0,0,0,0,0,0,0,0,0,0,0,0,0,0,0,0,0,0,0,0,0,0,0,"-","-","-","-","-","-","-","-","-"]
[null,"Ciclo combinado","-","-","-","-","-","-","-","-","-","-","-","-","-","-","-","-","-","-","-","-","-","-","-","-","-","-","-","-","-","-","-","-","-","-","-","-",0.21299999999999999,"-","-","-","-","-","-","-","-","-","-","-","-","-","-","-","-","-","-","-","-","-","-","-","-","-","-","-","-","-","-","-","-","-","-","-","-","-","-","-","-","-","-","-","-","-","-","-","-","-","-","-","-","-","-","-","-","-","-","-","-","-","-","-","-","-","-","-","-","-","-","-","-","-","-","-","-","-","-","-","-","-","-","-","-","-","-","-","-","-","-","-","-","-","-","-","-","-","-","-","-","-","-","-","-","-","-","-","-","-","-","-",121.518,305.00700000000001,520.59400000000005,763.19200000000001,1165.914,1151.1369999999999,610.33199999999999,517.97900000000004,436.83199999999999,845.81500000000005,761.98099999999999,386.589,799.41600000000005,1781.1379999999999,1927.3420000000001,1793.886,2025.4680000000001,1795.77,1208.1959999999999,863.65300000000002,1541.807,1943.2280000000001,2272.9110000000001,1822.15,2011.424,2317.6480000000001,2722.288,2333.433,2921.5369999999998,2845.4029999999998,2763.1559999999999,2817.86,3347.6289999999999,3357.8130000000001,3345.9479999999999,3237.21,3507.2539999999999,4645.3109999999997,5188.2110000000002,4424.9160000000002,4433.4340000000002,4074.636,4170.7370000000001,4113.6899999999996,5549.6480000000001,5482.8220000000001,4705.1390000000001,4650.8059999999996,4929.5569999999998,5469.55,6664.4570000000003,4828.1819999999998,6324.433,5050.22,4256.4570000000003,4211.1629999999996,6046.6490000000003,3813.0230000000001,3823.5529999999999,4054.7080000000001,4329.2470000000003,6168.9219999999996,6583.8389999999999,5145.5169999999998,5637.6090000000004,6092.1170000000002,7608.1620000000003,7269.5219999999999,7999.7709999999997,7995.5810000000001,6774.8040000000001,6899.11,7196.2809999999999,7596.2740000000003,8863.5310000000009,8223.3009999999995,7817.5169999999998,7214.4549999999999,6826.1670000000004,5693.94,5970.2749999999996,4444.1909999999998,5032.6499999999996,5434.4449999999997,5603.4830000000002,7620.6459999999997,8497.5750000000007,8177.8140000000003,7385.0879999999997,6555.009,5522.15,6135.9579999999996,5308.0950000000003,4758.78,4086.5899279999999,4360.6160999999993,4552.942,5475.442,6782.4560000000001,5736.69,6235.23,5277.7479999999996,5529.0940000000001,4851.2572170000003,5017.5481399999999,4626.0790999999999,3936.2882829999999,2780.183,4145.3770299999996,4837.5429999999997,4513.7520059999997,4686.5900339999998,4471.7389999999996,3709.547,3346.7570000000001,3340.253412,4223.4920000000002,3867.6390000000001,3070.4450000000002,2221.1074309999999,2396.9130299999997,3094.7109999999998,3351.596,3470.2919649999999,2874.5963450000004,3215.3029999999999,2947.85,2797.7220000000002,2607.2273,1958.4953500000001,1498.0340000000001,1120.7550000000001,1635.2412960000001,1378.832001,2221.196817,2365.5941080000002,2232.1579999999999,2535.2040000000002,2034.98,2772.864,1551.0370190000001,1268.5402469999999,1284.1469999999999,1230.0104410000001,1422.7929999999999,1773.52217,1859.79216,2219.6498360000001,2659.4920000000002,2137.4920299999999,1928.739,2001.539,2227.4250000000002,1716.241,1625.308002,1666.992,1600.5170000000001,1879.125,3407.078,2337.2719999999999,1999.653,2081.9119999999998,2093.5509999999999,2633.3939999999998,1878.4259999999999,1312.3710000000001,1344.51,1171.7449999999999,1499.5540000000001,1891.633495,2381.915,2023.2982930000001,2143.0909999999999,3301.415,3431.904,3306.2860000000001,2932.246369,1526.5029999999999,1448.9780000000001,1247.3969999999999,1617.9829999999999,3174.7585960000001,3712.319,3479.8420000000001,3215.1759649999999,3873.3009999999999,4569.8599999999997,3056.1640000000002,2277.6590000000001,1973.229,1219.2908,"-","-","-","-","-","-","-","-","-"]
[null,"Régimen ordinario",12926.357,10581.564999999999,11416.075000000001,10457.180999999999,10461.036,10796.148000000001,11461.204000000002,10093.407999999999,10840.496000000003,10968.464000000002,11589.866000000002,12786.873000000001,13239.38,12083.618999999999,11425.396000000001,10980.723,11130.630999999998,10763.272000000001,11766.474,10313.691000000001,11266.512000000002,11548.643999999997,11906.550999999998,12314.346000000001,13871.503000000001,12736.595000000001,12381.88,10961.814999999999,10802.923000000001,10285.013999999999,11866.487999999999,10455.599000000002,11178.235999999999,11482.254000000001,11277.127,11860.464999999998,12705.377,11469.427000000001,12041.353999999996,10605.519999999997,10558.738000000001,10609.397000000003,11305.952000000001,10596.652,10976.277999999998,11325.451999999999,11747.044999999996,12188.336999999998,12685.643,11582.145,11358.462999999996,10920.803999999998,10944.569999999998,11311.628000000002,12222.555,10973.152999999998,11210.371000000001,10980.558999999999,11198.065000000001,12145.179000000004,12953.626000000002,11018.559000000003,12159.843999999999,10853.870000000004,11374.402999999997,11491.358,12141.378000000001,11184.483999999999,11280.693999999998,11320.003000000002,11578.094999999999,12373.954999999998,13470.736999999999,12799.213000000002,12315.147000000001,10601.276999999996,11212.282999999999,11508.811,12185.666999999999,10967.458999999999,11271.293000000001,11934.769000000002,12151.593000000001,12597.085999999999,14083.578000000001,11471.970000000001,11878.418999999998,12128.93,12304.189,12148.918999999998,13009.237000000003,12394.627000000002,12693.870999999999,12522.63,12636.612000000001,13761.592000000001,13369.915999999999,11969.025,12419.051000000001,11834.460999999999,11827.589000000002,12442.531000000001,13641.856999999998,12326.652,12874.096,12543.050000000001,12934.402,14321.236000000001,14458.407000000001,13049.906999999999,13078.465,11538.88,12115.561000000002,12702.124,14042.931,12642.026999999998,13255.187999999998,12904.402,13673.998,14536.451000000001,15736.309000000003,13497.509999999998,14079.450999999999,12797.216999999999,13250.671000000002,14032.49,14503.346999999998,13730.665000000001,14016.970000000001,13696.626,14495.565000000001,14979.624,16089.006000000001,14193.431,14863.669000000002,12645.645,13830.507000000001,14496.214,15167.697,14697.792000000001,14172.29,14437.813999999998,14989.92,16426.213,16693.004000000001,14071.603999999999,14372.266,13911.524999999998,14388.041000000001,15097.285,15800.802,14382.479000000003,14621.029000000002,14723.314000000002,14507.519000000002,15172.174999999999,16708.429,15726.468000000001,15179.310999999998,13592.332,14415.543999999996,15912.103999999999,17171.198,16407.002,15412.097000000002,15426.892,15466.623,16435.541000000001,16568.126,16449.046999999999,17098.934000000001,15006.021999999999,15529.905000000002,16707.550999999999,17927.985999999997,16541.084999999999,16414.573000000004,15859.625000000002,16551.557000000001,17087.504000000001,18243.370999999999,16973.586000000003,17044.812000000002,14837.507000000001,15523.875,17313.733999999997,18237.486000000001,16373.689999999999,17006.422999999999,16261.470999999998,17433.355999999996,18668.195,20262.534,18010.791999999994,17541.668999999998,14393.763999999999,16535.659,17910.976000000002,20594.048000000003,16754.415000000001,18085.466,16521.769,16682.085999999996,18675.330999999998,19751.378000000001,16523.958999999999,17507.055,16888.804,16579.203000000001,17333.553,19039.929,16995.284,17670.181,18206.593000000001,18648.744999999999,19925.703000000001,19800.373,18855.427,16917.789000000001,16495.352000000003,17109.577999999998,17260.227999999999,19220.999,17954.337,17194.444,16941.185000000001,16678.165000000001,17574.968000000001,18220.623,15040.960000000003,14569.678,13304.255000000001,13795.37,15569.023000000001,17482.846000000001,16761.399000000001,15545.411,14898.662999999999,13498.447,15042.440999999999,16581.893950000001,14727.736116999997,15244.312545999999,14236.158649999999,13329.089481999999,14764.740740000001,17347.935098000002,15963.713582,15824.488311999999,14344.450218,14687.169635999999,15440.754387000001,16519.798010999999,14025.343386,14664.133832,12829.966520000002,13162.761498999998,14021.066074,14901.497056,15374.780923999999,15246.575555999998,13766.588358999999,13726.916234,14003.894412,16160.525933999999,15457.36,14246.139933999999,11523.684390999999,12786.929278,13524.787606,14654.799175999999,15073.852099,13092.593220999999,14072.856331000001,12786.230934000001,13129.554977999998,12795.946234000001,12006.898327999999,12201.921988,11397.962444000001,10815.292750000001,10937.157823,14944.142915,13667.879122000002,13176.628215999999,12648.251822,11138.97,13690.481978,"-","-","-","-","-","-","-","-","-","-","-","-","-","-","-","-","-","-","-","-","-","-","-","-","-","-","-","-","-","-","-","-","-","-","-","-","-","-","-","-","-","-","-","-","-","-","-","-","-","-","-","-","-","-","-","-","-","-","-","-"]
[null,"Hidráulica/Resto hidráulica",105.99199999,92.305999990000004,64.729999989999996,90.829000010000001,84.022999960000007,91.299000000000007,55.459000000000003,57.632000010000006,34.01199999,69.633999989999992,110.01000001,126.70600002,179.13800000000001,122.81100000000001,215.011,190.10900000000001,195.07300000000001,144.59399999999999,99.561000000000007,80.388999999999996,78.209000000000003,93.88,141.988,164.018,125.13500000000001,89.668999999999997,114.31100000000001,191.75700000000001,193.59,203.803,181.00200000000001,118.066,117.869,215.52699999999999,233.875,297.16899999999998,208.39500000000001,120.724,171.35300000000001,192.554,247.309,207.114,151.58000000000001,102.715,108.434,243.80099999999999,228.351,251.898,342.685,275.54899999999998,261.048,218.69300000000001,253.36600000000001,170.89599999999999,113.035,101.443,106.75,171.69800000000001,238.982,221.12299999999999,329.74799999999999,321.577,299.32900000000001,168.03299999999999,176.27099999999999,142.42699999999999,114.44499999999999,86.066999999999993,110.54,88.179000000000002,129.774,256.48399999999998,431.99400000000003,394.01900000000001,364.69799999999998,371.68,349.161,242.65199999999999,197.03100000000001,174.12299999999999,161.74299999999999,181.57599999999999,235.11199999999999,440.05799999999999,440.79199999999997,368.97300000000001,267.72199999999998,216.18199999999999,261.68,278.39100000000002,254.60499999999999,204.18799999999999,190.68700000000001,154.25,310.86200000000002,480.66300000000001,492.71681900000027,339.41051800000037,327.06436500000001,403.45852500000007,412.07627199999973,315.95694499999991,207.93444699999981,197.43269499999997,167.836814,248.31532999999988,203.70192800000009,262.56925899999993,323.52239599999979,292.89981199999983,373.90223100000003,348.71718900000002,443.13831299999953,296.52359400000012,224.70694300000005,189.84542699999983,210.82529300000019,274.4117980000002,366.44797700000021,395.38163899999972,330.40558000000061,282.4367390000001,249.44621600000002,435.78321799999981,494.62790899999982,357.92745100000013,254.29291899999987,199.41030499999974,158.61218700000026,230.15518499999985,367.53720900000002,475.46501499999971,558.92030299999965,485.9960640000001,596.9482809999995,489.46396500000048,476.68399000000039,352.76099499999998,300.49062999999978,227.07167800000002,181.60083700000001,202.50831499999984,222.42956999999993,192.64800500000001,255.92034899999996,271.46624000000031,345.5155519999999,361.37205199999977,420.06244200000003,357.79012199999954,235.872343,210.05402300000023,204.41109700000004,280.620946,390.81764499999963,565.54952800000058,581.19393900000068,453.43333999999987,562.61659000000009,532.27852599999949,529.63067400000057,359.33567800000003,277.91316899999993,209.44763500000025,208.93049999999982,309.71749599999981,485.77285999999998,578.37363800000003,587.99536900000066,427.62895799999984,507.79213800000031,547.04272999999989,572.54148200000088,412.62300300000021,336.46757500000012,259.27092500000015,199.83813299999983,245.59888100000015,329.70104599999968,323.07814500000035,350.78451000000035,292.22942700000004,386.56584999999961,465.50854399999992,438.71030300000024,297.45351899999991,244.46804400000011,191.04961800000027,151.16209100000012,217.90684300000004,377.39904099999995,404.34514899999988,400.55887300000069,320.87833499999977,567.0589700000005,506.03915599999999,360.07454500000034,248.51400000000001,226.34899999999999,177.815,164.14,312.404,381.88099999999997,482.851,345.48899999999998,478.79599999999999,516.02800000000002,529.75900000000001,509.19,412.91699999999997,302.21199999999999,256.50099999999998,186.13399999999999,186.88800000000001,189.87299999999999,211.53800000000001,340.20600000000002,233.21799999999999,301.23399999999998,581.11099999999999,613.279,581.55499999999995,380.40899999999999,264.58100000000002,212.28,190.523,400.12099999999998,539.62599999999998,521.05499999999995,629.452,559.84500000000003,501.44200000000001,577.14200000000005,468.387,365.35300000000001,282.64999999999998,242.869,230.81,466.05,608.61800000000005,764.37,616.57799999999997,784.76,690.19600000000003,688.34299999999996,608.94799999999998,459.60300000000001,341.74799999999999,281.05,318.88900000000001,567.66,702.17499999999995,663.64800000000002,506.22,655.86300000000006,588.12800000000004,489.53800000000001,405.25799999999998,384.18599999999998,304.79399999999998,235.56299999999999,189.00200000000001,423.49200000000002,448.62299999999999,336.82299999999998,331.68099999999998,324.86200000000002,468.28100000000001,642.16,439.56299999999999,337.726,264.85199999999998,198.80799999999999,269.48399999999998,410.351,619.95500000000004,667.28899999999999,687.923,842.28099999999995,845.36900000000003,779.84699999999998,658.83900000000006,534.94100000000003,402.89299999999997,302.90899999999999,342.66300000000001,522.62599999999998,511.57499999999999,783.351,754.57299999999998,806.16800000000001,776.29499999999996,608.47699999999998,523.41800000000001,479.798,401.51499999999999,357.392,362.73,544.005,671.798,"-","-","-","-","-","-","-","-","-","-","-","-","-","-","-","-","-","-","-","-","-","-","-","-","-","-","-","-","-","-","-","-","-","-","-","-","-","-","-","-","-","-","-","-","-","-","-","-"]
[null,"Eólica",0.115,0.19899998999999999,0.18,0.189,0.17399999999999999,0.12,0.26,0.186,0.13100000000000001,0.17,0.20699999999999999,0.25599999000000001,0.192,0.14299999999999999,0.21199999999999999,0.56200000000000006,0.32200000000000001,0.2,0.184,0.21199999999999999,0.14399999999999999,0.24199999999999999,0.27100000000000002,0.18099999999999999,0.26200000000000001,0.22500000000000001,0.313,0.20699999999999999,0.19500000000000001,0.16300000000000001,0.19500000000000001,0.66600000000000004,1.2949999999999999,2.137,2.5070000000000001,9.1959999999999997,7.1150000000000002,11.385999999999999,7.3259999999999996,6.1639999999999997,5.2709999999999999,7.9740000000000002,7.391,6.9809999999999999,5.6310000000000002,7.1980000000000004,6.7279999999999998,5.6029999999999998,6.899,4.8140000000000001,8.7690000000000001,6.859,4.97,6.4619999999999997,3.859,5.3929999999999998,5.0469999999999997,6.3360000000000003,7.78,5.6719999999999997,7.87,7.6749999999999998,8.4960000000000004,11.901999999999999,9.2110000000000003,8.8979999999999997,14.465,17.63,14.853,27.623000000000001,13.795,17.439,18.829999999999998,22.030999999999999,24.646000000000001,26.102,23.157,27.099,25.434000000000001,15.643000000000001,22.706,30.321000000000002,31.616,36.543999999999997,39.627000000000002,32.179000000000002,46.04,56.365000000000002,39.409999999999997,43.759,57.268000000000001,41.052999999999997,45.835000000000001,69.47,72.793999999999997,76.084999999999994,85.726278999999991,73.041770999999997,100.15667400000001,97.154274999999998,87.936697000000009,72.687051000000011,112.78895799999999,131.01327799999996,104.74763500000003,104.14675399999999,128.51891699999999,138.738417,159.91106499999998,214.37513500000003,206.77279700000003,190.99942600000003,173.14856599999996,212.21415299999998,177.00095900000005,139.30212900000004,172.17858000000001,199.35031500000005,312.98064799999997,315.79952500000002,305.02478600000001,295.11369999999994,338.14951600000018,416.02144200000009,226.957358,365.846115,360.05244799999997,315.70721200000003,276.36600500000014,409.72117300000014,544.09382199999982,609.44247300000018,594.73167599999999,573.65477800000008,654.24861100000021,650.22456599999998,424.36108700000011,408.90728200000012,400.20572300000021,374.72081200000002,611.54289400000005,574.769948,768.828981,557.95175500000039,657.00929500000052,782.54075799999964,795.79277999999965,618.78730799999983,820.58633199999974,646.36536599999977,693.5828309999996,598.4340899999994,505.37139599999978,869.00001900000052,1056.9575050000003,1214.8690069999998,1395.1710190000006,997.62484999999981,837.86062599999968,1138.0008659999992,901.86601600000074,703.48306400000013,727.40598099999977,543.97083900000018,781.24529999999993,1086.9553520000009,1172.985179,1433.6770410000006,1685.3449229999994,1074.4477040000002,1281.2794619999981,1519.3727670000001,1019.3578530000005,1048.3327160000013,970.02610899999979,1114.316325,1147.637898,1635.2691430000013,1511.2452730000009,1747.4875960000002,1879.1933479999996,1745.3139569999989,1763.5135970000013,1926.4580810000014,1492.0681999999997,1261.4607640000008,1611.0284699999993,1640.4408529999992,1271.4945329999998,1902.7245970000004,1958.5321529999999,2405.4374059999986,1563.7009309999996,1924.8670310000009,2788.2671979999986,1955.917235000001,1670.5176799999992,1364.4480000000001,1171.7909999999999,2177.8209999999999,1465.816,2334.8020000000001,2279.5230000000001,2183.3850000000002,2149.8069999999998,2871.9189999999999,3086.2469999999998,1356.316,2605.873,1786.288,1888.6089999999999,2419.819,2028.855,1907.625,2752.3119999999999,2395.4850000000001,2651.4679999999998,2018.9480000000001,4092.55,3352.6860000000001,1737.1610000000001,2085.509,2124.2370000000001,1972.5229999999999,2129.8850000000002,2482.0129999999999,3462.6880000000001,3648.1819999999998,3503.799,3226.32,3100.5160000000001,3059.6579999999999,2698.0039999999999,2332.395,2426.1289999999999,2235.837,2466.7310000000002,3125.33,4792.63,4921.2280000000001,4292.0919999999996,4622.4350000000004,4546.5469999999996,2634.819,3619.3339999999998,2576.1970000000001,2798.1329999999998,2894.7440000000001,2301.3229999999999,3952.8310000000001,4348.0590000000002,4621.8819999999996,4018.65,4028.2460000000001,4690.99,3399.4090000000001,3165.6219999999998,2937.1970000000001,3254.7049999999999,2729.4850000000001,2322.9769999999999,3149.5050000000001,3819.8870000000002,4588.76,3645.5149999999999,5014.665,3805.5540000000001,5306.39,3707.8789999999999,3429.201,2981.913,3126.895,3937.4119999999998,3129.8209999999999,4604.8419999999996,5449.9780000000001,6291.5739999999996,5340.9960000000001,5749.1030000000001,4396.7820000000002,3932.35,3827.0520000000001,2844.2130000000002,3410.875,3214.2730000000001,3963.88,6429.8140000000003,4943.4399999999996,6539.4849999999997,5884.2849999999999,5050.3310000000001,3950.2179999999998,4134.8410000000003,3275.5990000000002,3591.6019999999999,2856.8409999999999,2132.614,3382.7719999999999,5071.9809999999998,4764.3209999999999,4912.46,5948.174,4865.1239999999998,3904.518,4800.4530000000004,2873.288,3053.3739999999998,3237.373,3002.6950000000002,3887.2489999999998,3699.88,3528.5619999999999,5604.8440000000001,6068.143,5409.6030000000001,4414.6530000000002,3902.1860000000001,3226.857,3464.6790000000001,3603.8629999999998,2666.8890000000001,2376.0120000000002,3888.75,2671.6909999999998,4796.9650000000001,4905.5370000000003,4687.8389999999999,4177.34,3440.3440000000001,3149.38,3336.7930000000001,3296.2750000000001,2817.2429999999999,3186.259,3956.4580000000001,5747.7089999999998,5276.3649999999998,4622.9570000000003,7689.6802939999998,"-","-","-","-","-","-","-","-","-"]
[null,"Solar fotovoltaica",0,0,0,0,0,0,0,0,0,0,0,0,0,0,0,0,0,0,0,0,0,0,0,0,1.01,0.77200000000000002,0.57199999999999995,1.2889999999999999,1.113,1.1639999999999999,1.3069999999999999,1.155,1.2230000000000001,0.94399999999999995,0.56999999999999995,0.93700000000000006,0.53800000000000003,0.53300000000000003,1.252,1.3029999999999999,1.05,1.069,1.2729999999999999,1.1930000000000001,0.88,0.72,1.2629999999999999,0.92600000000000005,0.97799999999999998,1.242,1.0649999999999999,1.208,1.742,1.484,1.635,1.6679999999999999,1.69,1.5209999999999999,1.004,5.8900000000000001E-2,6.4000000000000001E-2,6.8000000000000005E-2,0.112,0.11700000000000001,0.13200000000000001,0.111,0.105,9.6000000000000002E-2,9.0999999999999998E-2,4.8000000000000001E-2,9.0999999999999998E-2,2.7E-2,2.4E-2,3.3000000000000002E-2,4.7E-2,9.2999999999999999E-2,8.5999999999999993E-2,0.11700000000000001,0.107,0.10299999999999999,9.6000000000000002E-2,9.5000000000000001E-2,6.4000000000000001E-2,2.5999999999999999E-2,4.1000000000000002E-2,8.7999999999999995E-2,8.7999999999999995E-2,0.11899999999999999,9.2999999999999999E-2,0.107,0.14299999999999999,8.6999999999999994E-2,0.12,9.6000000000000002E-2,0.105,0.04,4.9634999999999999E-2,7.0578000000000002E-2,0.11298999999999999,0.11806,9.6176999999999999E-2,0.13051699999999999,0.13625000000000001,0.11049299999999999,9.6509999999999999E-2,0.11281099999999999,6.9553000000000004E-2,6.6723000000000005E-2,5.3642000000000002E-2,0.107873,0.15287999999999999,0.117727,0.12252399999999999,0.14707999999999999,0.159277,0.14216999999999999,0.121715,8.8742000000000001E-2,7.9733999999999999E-2,4.7816999999999998E-2,-2.6860999999999999E-2,0.101559,0.124075,1.2024E-2,0.205484,0.16091,1.9984999999999999E-2,0.29827199999999998,0.13695099999999999,0.12126000000000001,7.2305999999999995E-2,4.3852000000000002E-2,5.4684999999999997E-2,9.8405999999999993E-2,0.10854,0.17056499999999999,0.156555,0.197492,0.16886599999999999,0.21376400000000001,0.12875300000000001,0.163998,9.4907000000000005E-2,8.3112000000000005E-2,0.126051,0.22952900000000001,0.27410599999999996,0.39638100000000026,0.47843600000000014,0.47939100000000001,0.5380640000000001,0.53365199999999957,0.48980900000000005,0.41930600000000023,0.31798800000000005,0.27873900000000007,0.33177200000000012,0.40585699999999975,0.56218699999999999,0.71534800000000021,0.85679699999999903,0.97693399999999941,1.1408959999999975,1.0179979999999982,0.91532600000000108,0.80906499999999926,0.5318040000000005,0.66612099999999963,0.57597900000000002,0.83336899999999914,1.1270059999999986,1.3765969999999994,1.6380649999999966,1.9365689999999964,2.0151259999999924,2.030071999999997,1.8506319999999978,1.7061280000000048,1.3758539999999999,1.3286139999999964,1.3100380000000011,1.5964899999999982,2.7521050000000016,2.9168830000000008,3.6370650000000015,4.27022700000001,4.3964089999999914,4.5427230000000041,4.2910249999999994,3.9432079999999976,3.2481789999999919,3.1839970000000024,2.5656399999999966,4.3413879999999949,5.1637430000000002,7.3147159999999678,8.7745119999999783,10.192,11.021000000000001,13.52,11.63,9.9489999999999998,8.077,9.8260000000000005,9.6859999999999999,12.005000000000001,20.550999999999998,24.491,34.18,38.843000000000004,49.655000000000001,53.862000000000002,58.231000000000002,55.534999999999997,52.622,52.915999999999997,57.420999999999999,70.549000000000007,104.43300000000001,126.235,131.75399999999999,189.70699999999999,232.23400000000001,288.11200000000002,317.11099999999999,320.166,324.32100000000003,244.02699999999999,248.703,380.17399999999998,508.66199999999998,546.45500000000004,647.31700000000001,618.52800000000002,690.86199999999997,637.125,492.28899999999999,482.28500000000003,345.4,231.20500000000001,248.57499999999999,289.95,458.21699999999998,565.84,683.24800000000005,656.76599999999996,752.89,691.53200000000004,605.38800000000003,525.85500000000002,364.05200000000002,297.46899999999999,335.96800000000002,481.24700000000001,508.38400000000001,631.45399999999995,716.11800000000005,776.89800000000002,821.81,766.36800000000005,702.33399999999995,601.93499999999995,344.35599999999999,404.81599999999997,482.68,635.51400000000001,736.94500000000005,627.60400000000004,826.20899999999995,839.14599999999996,902.62699999999995,826.45399999999995,658.33399999999995,566.62,350.38200000000001,377.38600000000002,418.75299999999999,500.80700000000002,531.45600000000002,725.43600000000004,832.56,886.25199999999995,929.53700000000003,856.80600000000004,724.78499999999997,603.79,490.22800000000001,417.62799999999999,352.69099999999997,405.78500000000003,697.63,753.26400000000001,882.48699999999997,862.84699999999998,910.00900000000001,871.50300000000004,655.16399999999999,616.97400000000005,362.10700000000003,431.96300000000002,493.21899999999999,469.24299999999999,677.68200000000002,718.22900000000004,880.72199999999998,848.48,888.93600000000004,793.673,691.73900000000003,510.30200000000002,503.19499999999999,369.37799999999999,337.68900000000002,452.54500000000002,674.59799999999996,686.16099999999994,769.20699999999999,881.47199999999998,875.51300000000003,855.10400000000004,730.03899999999999,555.78700000000003,402.95400000000001,358.24400000000003,452.34,419.3,679.83299999999997,798.18700000000001,833.85500000000002,839.82,871.42700000000002,778.17200000000003,740.76099999999997,651.03,515.77,407.721,416.28800000000001,484.916,553.14400000000001,"-","-","-","-","-","-","-","-","-"]
[null,"Solar térmica","-","-","-","-","-","-","-","-","-","-","-","-","-","-","-","-","-","-","-","-","-","-","-","-","-","-","-","-","-","-","-","-","-","-","-","-","-","-","-","-","-","-","-","-","-","-","-","-","-","-","-","-","-","-","-","-","-","-","-","-","-","-","-","-","-","-","-","-","-","-","-","-","-","-","-","-","-","-","-","-","-","-","-","-","-","-","-","-","-","-","-","-","-","-","-","-","-","-","-","-","-","-","-","-","-","-","-","-","-","-","-","-","-","-","-","-","-","-","-","-","-","-","-","-","-","-","-","-","-","-","-","-","-","-","-","-","-","-","-","-","-","-","-","-","-","-","-","-","-","-","-","-","-","-","-","-","-","-","-","-","-","-","-","-","-","-","-","-","-","-","-","-","-","-","-","-","-","-","-","-","-","-","-","-","-","-","-","-","-","-","-","-",0,0,0,0,0,0,0,0,0,0,0,0,0,0,0.43099999999999999,0.34200000000000003,0.55800000000000005,0.88300000000000001,1.256,1.1160000000000001,0.63900000000000001,1.214,0.997,0.191,1.0840000000000001,0.79700000000000004,1.4610000000000001,0.95799999999999996,0.94199999999999995,1.9630000000000001,2.0379999999999998,1.98,0.85899999999999999,0.86599999999999999,1.27,1.1599999999999999,0.69,1.236,2.323,7.2039999999999997,7.6580000000000004,6.7519999999999998,12.414,23.867999999999999,17.539000000000001,23.446000000000002,16.183,10.51,13.151999999999999,11.682,23.731999999999999,36.92,69.084000000000003,72.531999999999996,104.59,121.9,100.917,71.745000000000005,31.619,33.747,34.25,88.656999999999996,98.456999999999994,137.833,154.07300000000001,232.48400000000001,284.20800000000003,235.32900000000001,228.55799999999999,172.91200000000001,80.436999999999998,85.159000000000006,117.342,200.34200000000001,235.113,177.77699999999999,348.38200000000001,414.74900000000002,541.31700000000001,485.12700000000001,368.64299999999997,285.79500000000002,133.96199999999999,135.58500000000001,113.494,204.00899999999999,125.37,300.89400000000001,499.26799999999997,647.33000000000004,758.52300000000002,661.85599999999999,478.95499999999998,294.24200000000002,199.22399999999999,158.36199999999999,79.801000000000002,103.265,385.17500000000001,435.52699999999999,729.93600000000004,687.28800000000001,811.15300000000002,833.178,389.596,289.33699999999999,90.186999999999998,124.47199999999999,176.95099999999999,190.92500000000001,415.82900000000001,393.16,694.83900000000006,734.05399999999997,888.91800000000001,607.62300000000005,483.25,188.16900000000001,226.81800000000001,84.698999999999998,59.914000000000001,133.01,387.86099999999999,408.32299999999998,498.79500000000002,813.99099999999999,825.32500000000005,805.81899999999996,595.62699999999995,284.70299999999997,139.69999999999999,118.136,149.21199999999999,88.741,340.84500000000003,535.255,607.89800000000002,761.90200000000004,812.88,692.43499999999995,608.14,398.79300000000001,220.65199999999999,131.196,112.38800000000001,229.80799999999999,227.90559999999999,"-","-","-","-","-","-","-","-","-"]
[null,"Térmica renovable/Otras renovables","-","-","-","-","-","-","-","-","-","-","-","-","-","-","-","-","-","-","-","-","-",0.47899999999999998,0.19500000000000001,0.18,0.22600000000000001,0.185,0.20899999999999999,0.186,0.219,2.4910000000000001,0.85499999999999998,1.6519999999999999,2.1949999999999998,3.1859999999999999,2.8519999999999999,2.2930000000000001,2.7469999999999999,4.2910000000000004,5.55,5.08,5.1909999999999998,4.069,4.4050000000000002,5.0549999999999997,4.7699999999999996,5.9989999999999997,6.5289999999999999,5.1360000000000001,6.1820000000000004,4.2009999999999996,7.7879999999999994,12.483000000000001,22.434000000000001,14.593,25.895,34.064,35.963000000000001,40.081000000000003,55.064999999999998,63.701000000000001,52.516000000000005,54.168999999999997,59.649000000000001,59.275000000000006,60.629999999999995,38.39,56.09,56.16,55.471000000000004,65.760999999999996,51.017000000000003,62.140999999999998,61.97,55.767000000000003,73.194000000000003,69.39,67.606999999999999,74.480999999999995,76.311000000000007,76.088999999999999,74.905000000000001,70.728000000000009,57.923000000000002,56.715000000000003,56.474000000000004,46.637,55.156000000000006,57.041000000000004,57.334000000000003,33.856000000000002,57.003,53.271999999999998,57.103999999999999,61.066000000000003,58.17,55.262,29.002800999999998,53.305843000000003,61.54951100000001,62.649002999999993,69.878224000000017,68.57453000000001,70.406914,67.345651000000004,60.385233999999997,67.235011999999998,69.010128999999992,69.403475,71.806641999999997,67.74066400000001,76.241169000000014,70.55664800000001,71.228352999999998,64.031021999999993,80.270443,79.088937999999999,85.153421000000009,84.480839000000003,82.713457999999989,74.942079000000007,77.705164000000011,72.094493,81.578700000000012,75.639544999999998,57.155141000000015,64.878718000000006,80.062335000000004,78.219893000000013,86.225769,91.935601000000005,96.959690999999992,98.655336000000005,114.03217000000001,103.259727,115.38466,106.780576,116.22663500000002,163.25343300000003,164.15603399999998,142.64494099999999,174.91251699999998,184.36809099999999,170.80096299999997,182.63868100000002,102.326662,103.97290799999999,114.93776699999999,113.40504600000001,116.82101699999998,106.527145,125.927582,138.27553399999999,128.41537399999999,130.56901199999999,128.796967,143.04027199999999,125.499869,125.666718,141.367661,136.22556399999999,148.43464900000001,135.67495399999999,145.85112000000001,152.32964200000001,154.93832699999999,162.073384,144.46359000000001,164.51626000000002,165.78169199999999,141.425287,163.310002,158.00111900000002,158.15428799999998,141.57013900000001,142.66767899999999,139.21697600000002,148.774135,152.85692900000001,147.72687300000001,158.60851299999999,174.85460999999998,150.82777100000001,176.75611499999999,159.635672,172.11730599999999,162.54098200000001,167.51991400000003,173.00340799999998,160.25450599999999,152.959924,165.98202600000002,171.40583599999999,172.08671999999999,164.50467899999998,179.21714800000001,172.15726300000003,184.66687200000001,201.17400000000001,194.67,180.72499999999999,181.291,197.31100000000001,176.12700000000001,178.67599999999999,195.417,170.86799999999999,196.96199999999999,184.11799999999999,197.114,193.24700000000001,203.05199999999999,202.649,191.273,224.429,204.15700000000001,212.399,218.304,215.69800000000001,223.7,221.483,218.887,220.45099999999999,223.50399999999999,218.31,211.55500000000001,229.72499999999999,225.65600000000001,224.21600000000001,243.68600000000001,231.25299999999999,252.346,275.29700000000003,250.078,229.126,236.274,235.85900000000001,264.07600000000002,325.339,249.01,251.94300000000001,250.94,226.42400000000001,245.99799999999999,252.761,274.92500000000001,268.96100000000001,268.02999999999997,278.80399999999997,262.93700000000001,279.28699999999998,269.12099999999998,293.61099999999999,357.05099999999999,328.661,349.27699999999999,351.05500000000001,328.80399999999997,335.64499999999998,357.9,355.29899999999998,375.1,383.14,375.33800000000002,387.57100000000003,393.7,372.92,398.17899999999997,371.93,360.83499999999998,406.08199999999999,421.35399999999998,400.50700000000001,373.05,413.07400000000001,400.88299999999998,433.63499999999999,435.82100000000003,414.99700000000001,452.92399999999998,421.41500000000002,437.99700000000001,392.45299999999997,431.91300000000001,417.43799999999999,398.00200000000001,404.68900000000002,413.637,444.28,423.54599999999999,331.35399999999998,365.40100000000001,338.69600000000003,410.02199999999999,406.22699999999998,411.334,445.07,422.226,387.61500000000001,372.54199999999997,403.94499999999999,239.40199999999999,205.804,234.04400000000001,179.708,226.202,276.375,299.334,311.42200000000003,301.42899999999997,310.14600000000002,303.68599999999998,286.399,268.935,260.66800000000001,254.63,209.02500000000001,276.21199999999999,286.84899999999999,310.28399999999999,325.988,306.89100000000002,305.47899999999998,303.69499999999999,305.25799999999998,326.24599999999998,288.83,268.62599999999998,231.77099999999999,297.72899999999998,301.45100000000002,332.56799999999998,316.09800000000001,309.25400000000002,310.00299999999999,307.70600000000002,312.63099999999997,296.49200000000002,301.63099999999997,279.18259999999998,"-","-","-","-","-","-","-","-","-"]
[null,"Térmica no renovable/Cogeneración y resto/Cogeneración",35.685000010000024,38.351000019999979,45.945000009999994,29.542999990000006,39.724000039999993,36.553999999999988,59.265999999999998,54.415999989999989,70.548000009999996,79.426000009999981,86.149999990000012,79.248999989999987,95.989000000000019,93.531000000000006,115.05600000000001,116.111,113.29,97.624000000000009,119.55,109.12599999999999,134.50700000000001,150.72200000000001,140.30100000000002,150.17699999999999,158.54399999999998,156.649,153.35299999999998,133.67700000000002,150.357,147.03700000000003,147.13500000000008,155.59799999999998,159.136,169.63300000000004,179.52700000000002,192.23599999999996,216.233,207.39499999999998,238.97599999999997,228.40900000000002,230.78099999999998,243.42200000000008,273.03300000000002,222.17500000000004,290.86800000000005,356.51100000000002,393.02699999999999,406.67399999999998,424.01199999999994,397.50999999999993,428.83,427.68300000000005,448.76199999999989,440.01700000000005,418.09199999999998,419.03999999999996,459.93099999999993,463.43,473.75599999999997,510.92809999999992,488.05499999999995,461.94399999999996,538.60199999999998,514.274,531.6149999999999,523.03700000000003,524.91700000000003,510.6640000000001,559.84399999999994,605.28700000000003,625.35600000000011,657.15800000000013,649.31399999999996,674.23500000000001,693.76300000000003,721.26300000000015,706.92700000000013,708.29699999999991,764.04299999999989,721.08300000000008,746.32599999999991,827.94400000000007,871.21600000000001,907.40899999999999,907.43,826.93799999999999,929.04899999999986,911.04300000000012,932.33899999999994,902.09600000000012,984.03500000000008,910.40900000000011,947.55,1078.5139999999999,1050.981,1082.232,1132.4634659999997,1055.3262899999995,1179.4824599999999,1140.4561370000001,1143.3816300000001,1071.931957,1169.5214310000001,1090.5068830000002,1176.458807,1306.9340929999998,1295.514473,1406.3031259999998,1379.8752550000006,1318.561516,1436.0569230000001,1384.7270100000001,1425.3322440000002,1390.930151,1434.8443779999998,1350.318336,1395.920991,1537.4033059999997,1510.1531829999997,1573.1489400000003,1568.0163309999991,1437.8635089999998,1555.5964929999996,1469.5937710000005,1469.0271080000005,1426.760806,1439.9263130000002,1348.3463180000001,1376.7260879999997,1451.7187810000003,1351.8059720000003,1484.1733240000003,1509.9821660000005,1420.9730249999998,1480.3319080000003,1391.9773279999997,1478.9017329999997,1418.0977979999996,1481.5337469999999,1315.0298049999999,1436.0749989999999,1554.6446480000002,1587.637579,1581.5034469999994,1753.946643,1624.3835650000003,1752.2777950000002,1751.5292130000003,1747.5227730000001,1607.2819760000004,1731.7671800000005,1586.2397010000004,1675.7063240000002,1903.9247169999992,1846.9618950000001,1850.1104539999997,1949.8964009999988,1795.4542350000002,1917.1289360000001,1863.5466960000015,1892.4928639999987,1805.7993700000002,1913.7958340000005,1744.9618859999998,1903.9135469999999,2075.8847029999993,1958.6965669999997,2023.7759399999993,2046.9260369999997,1962.1146819999997,2107.6563920000017,1979.8427870000005,1934.4913119999985,1817.9965729999983,1921.3405109999997,1769.4697020000003,1826.6772020000005,1981.9419189999987,2074.2319539999994,2106.015132,2043.0234940000005,1951.7983550000013,2095.8113329999996,2039.9988199999989,2040.2971259999995,1919.5815079999988,1935.7391630000006,1786.1623980000002,1917.1898449999997,1838.2194279999994,1867.2426009999992,1828.6396120000024,1998.0738359999998,1940.3785669999995,2060.4519410000007,1910.7046299999986,1907.4363910000006,1747.2180000000001,1731.357,1635.847,1728.153,1850.3889999999999,1883.634,1925.296,1984.567,1757.03,1865.8879999999999,1831.5619999999999,1829.89,1893.941,1990.347,1868.579,1956.135,2102.7629999999999,2100.0659999999998,2146.989,2251.9169999999999,2226.8589999999999,2271.9859999999999,2229.3420000000001,2106.663,2078.8119999999999,2217.9769999999999,2016.6590000000001,2177.9,2358.9569999999999,2314.2759999999998,2324.6280000000002,2421.9630000000002,2242.4059999999999,2406.6460000000002,2338.3670000000002,2351.1260000000002,2309.7330000000002,2396.5940000000001,2034.3920000000001,2337.3000000000002,2464.42,2571.2600000000002,2591.7269999999999,2661.2139999999999,2477.0210000000002,2616.777,2550.3539999999998,2581.357,2541.7829999999999,2613.6729999999998,2153.4079999999999,2523.7640000000001,2647.1170000000002,2659.6819999999998,2762.902,2780.759,2596.0859999999998,2880.4789999999998,2687.991,2721.65,2576.5790000000002,2636.97,2201.011,2634.4760000000001,2759.1210000000001,2749.1669999999999,2826.723,2930.7240000000002,2780.5949999999998,2916.4430000000002,2814.6729999999998,2845.8359999999998,2681.83,2782.808,2350.1129999999998,2741.203,2903.6280000000002,2845.6439999999998,2899.3670000000002,3001.223,2689.5259999999998,2882.2240000000002,2782.855,2818.268,2650.7829999999999,2656.915,2097.047,2558.0140000000001,2616.5500000000002,2613.4690000000001,2669.8510000000001,2680.59,1980.6980000000001,1893.6320000000001,1709.93,2060.306,2193.4499999999998,2250.8989999999999,2101.0030000000002,2253.2530000000002,2263.2739999999999,2067.924,2140.5770000000002,2222.8029999999999,1961.5309999999999,2117.5819999999999,2033.1849999999999,2122.1669999999999,2073.4119999999998,2167.2449999999999,2041.69,2153.7280000000001,2214.8960000000002,2129.212,2180.5239999999999,2128.3229999999999,1967.5650000000001,2069.4740000000002,1992.4880000000001,2113.6080000000002,2167.73,2239.7620000000002,2120.5990000000002,2135.1750000000002,2318.6480000000001,2296.1550000000002,2322.3850000000002,2446.9639999999999,2203.8989999999999,2388.6909999999998,2231.3110000000001,2324.4270000000001,2312.48,2395.0329999999999,2253.788,2268.7860000000001,2389.42,2438.3620000000001,2481.1149999999998,2474.7359999999999,2243.4229999999998,2499.0647059999997,"-","-","-","-","-","-","-","-","-"]
[null,"Residuos no renovables","-","-","-","-","-","-","-","-","-","-","-","-","-","-","-","-","-","-","-","-","-","-","-","-","-","-","-","-","-","-","-","-","-","-","-","-","-","-","-","-","-","-","-","-","-","-","-","-","-","-","-","-","-","-","-","-","-","-","-","-","-","-","-","-","-","-","-","-","-","-","-","-","-","-","-","-","-","-","-","-","-","-","-","-","-","-","-","-","-","-","-","-","-","-","-","-","-","-","-","-","-","-","-","-","-","-","-","-","-","-","-","-","-","-","-","-","-","-","-","-","-","-","-","-","-","-","-","-","-","-","-","-","-","-","-","-","-","-","-","-","-","-","-","-","-","-","-","-","-","-","-","-","-","-","-","-","-","-","-","-","-","-","-","-","-","-","-","-","-","-","-","-","-","-","-","-","-","-","-","-","-","-","-","-","-","-","-","-","-","-","-","-","-","-","-","-","-","-","-","-","-","-","-","-","-","-","-","-","-","-","-","-","-","-","-","-","-","-","-","-","-","-","-","-","-","-","-","-","-","-","-","-","-","-","-","-","-","-","-","-","-","-","-","-","-","-","-","-","-","-","-","-","-","-","-","-","-","-","-","-","-","-","-","-","-","-","-","-","-","-","-","-","-","-","-","-","-","-","-","-","-","-","-","-","-","-","-","-","-","-","-","-","-","-","-","-","-","-","-","-",188.12449999999998,170.32149999999999,195.81900000000002,154.012,192.69750000000002,196.30149999999998,210.19649999999999,213.78100000000001,202.41649999999998,215.48899999999998,203.28699999999998,182.27,200.86,187.60599999999999,209.0865,179.41449999999998,136.9975,195.59100000000001,242.94450000000001,243.15450000000004,236.99300000000002,230.03800000000001,205.32249999999999,203.3015,216.85649999999998,190.88499999999999,209.13,172.66749999999999,175.583,211.36150000000001,200.6275,214.93300000000002,213.31550000000001,228.41249999999997,206.52449999999999,218.512,226.57149999999999,202.00300000000001,217.50215000000003,"-","-","-","-","-","-","-","-","-"]
[null,"Residuos renovables","-","-","-","-","-","-","-","-","-","-","-","-","-","-","-","-","-","-","-","-","-","-","-","-","-","-","-","-","-","-","-","-","-","-","-","-","-","-","-","-","-","-","-","-","-","-","-","-","-","-","-","-","-","-","-","-","-","-","-","-","-","-","-","-","-","-","-","-","-","-","-","-","-","-","-","-","-","-","-","-","-","-","-","-","-","-","-","-","-","-","-","-","-","-","-","-","-","-","-","-","-","-","-","-","-","-","-","-","-","-","-","-","-","-","-","-","-","-","-","-","-","-","-","-","-","-","-","-","-","-","-","-","-","-","-","-","-","-","-","-","-","-","-","-","-","-","-","-","-","-","-","-","-","-","-","-","-","-","-","-","-","-","-","-","-","-","-","-","-","-","-","-","-","-","-","-","-","-","-","-","-","-","-","-","-","-","-","-","-","-","-","-","-","-","-","-","-","-","-","-","-","-","-","-","-","-","-","-","-","-","-","-","-","-","-","-","-","-","-","-","-","-","-","-","-","-","-","-","-","-","-","-","-","-","-","-","-","-","-","-","-","-","-","-","-","-","-","-","-","-","-","-","-","-","-","-","-","-","-","-","-","-","-","-","-","-","-","-","-","-","-","-","-","-","-","-","-","-","-","-","-","-","-","-","-","-","-","-","-","-","-","-","-","-","-","-","-","-","-","-",54.582500000000003,52.223500000000001,60.213999999999999,33.475999999999999,49.703499999999998,58.970500000000001,60.0015,57.491,55.067500000000003,60.863,60.057000000000002,60.005000000000003,57.3,48.103999999999999,57.529499999999999,26.702500000000001,24.278500000000001,55.116,63.646500000000003,60.3155,62.052,60.05,64.739500000000007,69.907499999999999,64.737499999999997,55.999000000000002,59.911000000000001,46.575499999999998,34.262,66.986500000000007,68.889499999999998,65.700999999999993,62.429499999999997,66.129499999999993,66.557500000000005,69.971999999999994,69.263499999999993,62.439,66.447050000000004,"-","-","-","-","-","-","-","-","-"]
[null,"Régimen especial",141.79200000000003,130.85599999999999,110.85499999999999,120.56100000000001,123.92100000000001,127.973,114.985,112.23399999999999,104.691,149.22999999999996,196.36700000000002,206.21100000000001,275.31900000000002,216.48500000000001,330.279,306.78200000000004,308.685,242.41800000000001,219.29500000000002,189.72699999999998,212.86,245.32300000000001,282.755,314.55600000000004,285.17700000000002,247.5,268.75799999999998,327.11599999999999,345.47399999999999,354.65800000000002,330.49400000000003,277.137,281.71799999999996,391.42700000000002,419.33100000000002,501.83100000000002,435.02800000000002,344.32899999999995,424.45699999999999,433.51,489.60199999999998,463.64800000000002,437.68200000000002,338.11900000000003,410.58300000000003,614.22900000000004,635.89800000000002,670.23699999999997,780.75599999999997,683.31600000000003,707.5,666.92600000000004,731.27399999999989,633.452,562.51599999999996,561.60799999999995,609.38099999999986,683.06600000000003,776.58699999999999,801.48299999999995,878.25299999999993,845.43299999999999,906.18799999999999,753.601,777.85899999999992,712.86300000000006,710.02200000000005,670.61700000000008,740.79899999999998,786.89800000000002,820.03300000000002,993.24900000000002,1162.1320000000001,1146.085,1156.348,1188.528,1146.9380000000001,1052.6459999999997,1062.9259999999999,987.04100000000005,1005.7759999999998,1110.6640000000002,1195.931,1440.752,1444.364,1274.8150000000001,1298.0549999999998,1240.75,1290.856,1258.2090000000001,1353.0540000000001,1209.009,1241.296,1363.396,1492.9119999999998,1694.2820000000002,1739.9590000000001,1521.155,1668.366,1703.8360000000002,1713.3689999999997,1529.2809999999999,1560.788,1486.4090000000001,1509.5250000000001,1726.7439999999997,1696.8150000000001,1877.0809999999997,1935.1690000000003,1893.6849999999999,2093.1260000000002,1995.1179999999999,2112.9699999999993,1963.846,1916.982,1758.6969999999999,1864.2,2095.7350000000001,2272.375,2359.3200000000002,2281.125,2087.6099999999997,2224.8949999999995,2397.0500000000002,2247.973,2215.5740000000001,2134.3539999999998,1941.982,1898.067,2183.652,2360.4690000000001,2667.78,2777.721,2583.982,2847.0219999999999,2638.6170000000002,2496.33,2343.2169999999996,2346.5549999999998,2059.681,2404.2600000000002,2516.4549999999999,2749.7919999999999,2514.8249999999998,2769.3290000000006,2782.5929999999998,3008.7979999999998,2845.49,3105.471,2718.4439999999995,2787.6880000000001,2533.5370000000003,2514.3940000000002,3184.5339999999997,3423.8519999999999,3773.848,4052.0929999999998,3372.585,3459.5360000000001,3670.7669999999998,3473.2809999999999,3005.2700000000004,3066.107,2651.7280000000001,3049.9429999999998,3635.4399999999996,3762.45,4201.009,4486.6239999999998,3606.45,4061.165,4205.6360000000004,3686.183,3422.4589999999998,3372.5169999999998,3284.3040000000001,3324.7780000000002,4017.3730000000005,4064.2809999999999,4336.518,4449.1660000000002,4141.7659999999996,4425.3990000000013,4594.518,4146.83,3645.3069999999998,3963.152,3795.1989999999996,3504.3919999999998,4115.7539999999999,4372.4039999999995,4813.0120000000006,4136.9859999999999,4354.97,5600.1589999999997,4552.1329999999998,4131.47,3571.5460000000003,3335.1880000000001,4185.7280000000001,3551.03,4704.8550000000005,4729.2420000000002,4780.0339999999997,4684.9660000000003,5290.6179999999995,5686.107,3926.5880000000002,5176.8050000000003,4326.1189999999997,4435.1310000000003,4802.5259999999998,4421.2670000000007,4478.4539999999997,5300.027,5019.518,5520.4,4766.0689999999995,6995.3640000000005,6511.8150000000005,4808.6859999999997,5157.9969999999994,5180.3989999999994,4762.165,5049.59,5582.25,6728.3320000000003,6981.8389999999999,6939.8959999999988,6710.8409999999994,6830.3380000000016,6728.4230000000007,6531.3249999999998,5964.9210000000003,6127.6260000000002,5449.7309999999998,5820.8040000000001,6651.63,8440.5329999999994,8615.2309999999998,8230.3429999999989,8244.09,8676.030999999999,6730.8899999999994,7916.2909999999993,6725.1869999999999,6996.918999999999,6482.1360000000004,6075.3789999999999,7795.7240000000011,8240.1929999999993,8711.7860000000001,8190.326,8029.1170000000002,9183.4500000000007,7795.87,7575.8050000000003,7264.0609999999997,7739.7789999999986,6592.2860000000001,6499.0079999999998,7255.6150000000007,7792.6769999999997,8741.6519999999982,7906.7839999999997,9335.7169999999987,8417.0960000000014,9766.6550000000007,8731.3009999999995,8210.5709999999999,7967.7449999999999,7453.9480000000003,8277.4499999999989,7568.4219999999987,8746.0639999999985,9915.9060000000009,10928.153999999999,9838.2579999999998,10583.358,9472.7510000000002,9300.2900000000009,9062.7089999999989,8156.0420000000004,7846.9150000000009,7676.938000000001,8225.8140000000003,10668.998,9145.1359999999986,"-","-","-","-","-","-","-","-","-","-","-","-","-","-","-","-","-","-","-","-","-","-","-","-","-","-","-","-","-","-","-","-","-","-","-","-","-","-","-","-","-","-","-","-","-","-","-","-","-","-","-","-","-","-","-","-","-","-","-","-"]
[null,"Generación",13068.148999999999,10712.420999999998,11526.93,10577.741999999998,10584.957,10924.121000000001,11576.189000000002,10205.642,10945.187000000004,11117.694000000001,11786.233000000002,12993.084000000001,13514.698999999999,12300.103999999999,11755.675000000001,11287.504999999999,11439.315999999997,11005.69,11985.769,10503.418000000001,11479.372000000003,11793.966999999997,12189.305999999997,12628.902000000002,14156.68,12984.095000000001,12650.637999999999,11288.930999999999,11148.397000000001,10639.671999999999,12196.982,10732.736000000003,11459.954,11873.681,11696.458000000001,12362.295999999998,13140.405000000001,11813.756000000001,12465.810999999996,11039.029999999997,11048.340000000002,11073.045000000002,11743.634000000002,10934.771000000001,11386.860999999999,11939.680999999999,12382.942999999996,12858.573999999997,13466.398999999999,12265.461000000001,12065.962999999996,11587.729999999998,11675.843999999997,11945.080000000002,12785.071,11534.760999999999,11819.752,11663.625,11974.652,12946.662000000004,13831.879000000003,11863.992000000002,13066.031999999999,11607.471000000005,12152.261999999997,12204.221,12851.400000000001,11855.100999999999,12021.492999999999,12106.901000000002,12398.127999999999,13367.203999999998,14632.868999999999,13945.298000000003,13471.495000000001,11789.804999999997,12359.221,12561.456999999999,13248.592999999999,11954.499999999998,12277.069000000001,13045.433000000003,13347.524000000001,14037.838,15527.942000000001,12746.785000000002,13176.473999999998,13369.68,13595.045,13407.127999999999,14362.291000000003,13603.636000000002,13935.166999999999,13886.026,14129.524000000001,15455.874,15109.875,13490.18,14087.417000000001,13538.296999999999,13540.958000000002,13971.812000000002,15202.644999999999,13813.061,14383.620999999999,14269.794000000002,14631.217000000001,16198.317000000001,16393.576000000001,14943.591999999999,15171.591,13533.998,14228.531000000001,14665.97,15959.913,14400.723999999998,15119.387999999999,15000.137000000001,15946.373,16895.771000000001,18017.434000000001,15585.119999999999,16304.345999999998,15194.267,15498.644000000002,16248.064,16637.700999999997,15672.647000000001,15915.037,15880.278,16856.034,17647.403999999999,18866.727000000003,16777.413,17710.691000000003,15284.262000000001,16326.837000000001,16839.431,17514.252,16757.473000000002,16576.550000000003,16954.269,17739.712,18941.038,19462.333000000002,16854.197,17381.063999999998,16757.014999999999,17493.512000000002,17815.728999999999,18588.489999999998,16916.016000000003,17135.423000000003,17907.848000000002,17931.371000000003,18946.023000000001,20760.522000000001,19099.053,18638.846999999998,17263.099000000002,17888.824999999997,18917.374,20237.305,19058.73,18462.04,19062.331999999999,19229.073,20636.550000000003,21054.75,20055.496999999999,21160.099000000002,19211.657999999999,19216.088000000003,20130.009999999998,21300.502999999997,19825.388999999999,19739.351000000002,19876.998000000003,20615.838,21424.022000000001,22692.537,21115.352000000003,21470.211000000003,19432.025000000001,19670.705000000002,20959.040999999997,22200.637999999999,20168.888999999999,20510.814999999999,20377.224999999999,21805.759999999995,23481.207000000002,24399.52,22365.761999999995,23141.827999999998,18945.896999999997,20667.129000000001,21482.522000000004,23929.236000000004,20940.143,21636.495999999999,21226.624,21411.327999999994,23455.364999999998,24436.344000000001,21814.576999999997,23193.162,20815.392,21756.008000000002,21659.671999999999,23475.06,21797.809999999998,22091.448,22685.046999999999,23948.771999999997,24945.221000000001,25320.773000000001,23621.495999999999,23913.153000000002,23007.167000000001,21918.263999999996,22418.224999999999,24401.398000000001,22716.502,22244.034,22523.435000000001,23406.497000000003,24556.807000000001,25160.519,21751.801000000003,21400.016000000003,20032.678,20326.695,21533.944000000003,23610.472000000002,22211.13,21366.215,21550.292999999998,21938.98,23657.671999999999,24812.236949999999,22971.826116999997,23920.343546,20967.048649999997,21245.380482,21489.927739999999,24344.854098,22445.849581999999,21899.867311999998,22140.174218,22927.362636000002,24152.540386999997,24710.124011,22054.460385999999,23847.583832,20625.836520000001,20738.566499,21285.127074,22641.276056000002,21967.066923999999,21745.583556000001,21022.203359000003,21519.593234,22745.546412,24067.309934000001,24793.077000000001,22663.235934,21290.339390999998,21518.230277999999,21735.358605999998,22622.544175999999,22527.800099,21370.043221,21641.278331000001,21532.294934000001,23045.460977999999,23724.100234000001,21845.156328000001,22785.279988000002,20870.713443999997,20115.582750000001,19999.866823,23100.184914999998,21514.794122000003,20853.566215999999,20874.065822,21807.968000000001,22835.617977999998,22982.070962999998,21582.603137999999,21758.094467999999,20006.760168000001,20255.563363000001,20336.119063999999,21997.307011999997,20794.002111999998,20960.885338,20499.429811000002,20187.982,22216.99,23543.711309999999,22227.605736999998,22159.998822999998,19640.604163,20140.069153,20653.931989000001,24003.060739,21603.896495999998,20125.944618000001,19765.073669000001,19935.460170000002,20587.992622999998,21608.572161,20694.940111,22003.625907000001,20708.251677,19549.98775,19499.467290000001,21603.321239000001,20739.453567,19945.968281000001,20606.239914000002,20717.242509,20824.601010000002,24171.45494,19995.253032000001,20084.163497000001,18184.909651000002,19100.859490999999,20886.553030000003,21455.849502000001,20352.343295000002,19103.022322000001,20286.106271000001,21636.345880000001,23167.462480000002,21758.584219999997,20782.936449000001,23222.824800000002,"-","-","-","-","-","-","-","-","-"]
[null,"Consumos en bombeo",-230.679,-122.288,-14.289,-28.145,-43.485999999999997,-13.114000000000001,-22.103999999999999,-49.978000000000002,-160.71299999999999,-155.501,-44.506999999999998,-154.46799999999999,-268.90800000000002,-218.38300000000001,-171.68600000000001,-12.201000000000001,-15.629,-41.384,-57.712000000000003,-72.09,-112.773,-80.879000000000005,-188.52699999999999,-192.56100000000001,-261.99200000000002,-144.315,-170.44,-297.59300000000002,-198.61500000000001,-246.85400000000001,-277.39299999999997,-274.77800000000002,-274.41399999999999,-292.15699999999998,-181.749,-170.405,-138.74100000000001,-112.68899999999999,-188.994,-202.54400000000001,-227.06899999999999,-134.422,-139.846,-190.28299999999999,-202.364,-190.64699999999999,-85.039000000000001,-74.921000000000006,-304.07600000000002,-125.633,-16.009,-34.588999999999999,-53.005000000000003,-40,-112.842,-29.006,-168.63399999999999,-188.04300000000001,-112.602,-160.94999999999999,-229.93299999999999,-151.828,-149.91399999999999,-139.09899999999999,-126.803,-126.251,-163.94499999999999,-157.261,-174.29900000000001,-178.249,-166.69,-317.45400000000001,-761.34500000000003,-190.41399999999999,-30.027000000000001,-33.853000000000002,-44.027999999999999,-72.870999999999995,-66.353999999999999,-12.074,-23.202999999999999,-39.189,-69.679000000000002,-179.58099999999999,-252.93600000000001,-37.277999999999999,-12.262,-21.497,-81.885999999999996,-85.456999999999994,-118.164,-176.339,-190.05099999999999,-144.696,-266.06099999999998,-374.262,-277.15499999999997,-134.83799999999999,-111.211,-214.86099999999999,-181.761,-114.55800000000001,-203.37299999999999,-319.92500000000001,-193.376,-171.72300000000001,-213.786,-451.18700000000001,-468.77199999999999,-342.76100000000002,-234.381,-215.75899999999999,-219.82599999999999,-177.636,-214.518,-260.83800000000002,-340.93099999999998,-489.76400000000001,-316.02600000000001,-385.16800000000001,-368.59199999999998,-313.25400000000002,-345.67200000000003,-513.572,-617.92600000000004,-330.21499999999997,-323.44200000000001,-246.34100000000001,-256.83199999999999,-362.529,-451.67700000000002,-776.83399999999995,-539.07299999999998,-307.35899999999998,-387.49700000000001,-200.959,-214.62100000000001,-258.66300000000001,-303.01100000000002,-291.53199999999998,-368.74900000000002,-364.09899999999999,-336.14600000000002,-559.55499999999995,-652.85199999999998,-506.24200000000002,-466.28899999999999,-443.39299999999997,-559.45699999999999,-628.45799999999997,-699.81299999999999,-572.27200000000005,-597.97400000000005,-575.56700000000001,-570.42200000000003,-683.94299999999998,-587.33500000000004,-379.733,-368.65,-218.7,-265.99099999999999,-415.71499999999997,-419.84399999999999,-472.31900000000002,-437.02499999999998,-390.30099999999999,-322.12400000000002,-400.39699999999999,-404.81700000000001,-276.12,-339.00299999999999,-328.995,-393.37799999999999,-425.60700000000003,-408.31200000000001,-386.44200000000001,-387.786,-411.48399999999998,-358.57499999999999,-484.18799999999999,-553.09,-432.93799999999999,-492.58699999999999,-450.62,-643.06799999999998,-634.52700000000004,-693.31299999999999,-446.08,-519.71799999999996,-482.77600000000001,-454.59100000000001,-553.63900000000001,-586.44100000000003,-529.91899999999998,-374.92099999999999,-305.80099999999999,-313.70299999999997,-370.08100000000002,-513.35599999999999,-400.35399999999998,-486.57299999999998,-541.52300000000002,-541.572,-384.12900000000002,-371.77600000000001,-395.87900000000002,-384.16800000000001,-293.39699999999999,-397.62200000000001,-356.25400000000002,-333.52100000000002,-371.38200000000001,-345.92500000000001,-317.00099999999998,-384.15499999999997,-481.20699999999999,-430.83600000000001,-419.30500000000001,-401.79399999999998,-219.05799999999999,-206.07300000000001,-285.255,-253.78200000000001,-190.80199999999999,-226.55600000000001,-297.14499999999998,-411.25599999999997,-460.64,-492.22699999999998,-392.03500000000003,-281.47199999999998,-255.75899999999999,-247.49799999999999,-224.59399999999999,-241.018,-245.006,-254.49299999999999,-284.12299999999999,-397.50099999999998,-478.46300000000002,-756.58548100000007,-554.72222199999999,-544.66441799999996,-303.16059899999999,-279.94919199999998,-230.155124,-199.16812999999999,-231.14395499999998,-233.69566899999998,-346.11598499999997,-322.22366899999997,-456.19813299999998,-430.91918800000002,-280.66478600000005,-347.70577100000003,-297.00992200000002,-158.92510200000001,-139.95152400000001,-173.53430600000002,-181.06439699999999,-176.06341800000001,-301.62591900000001,-325.48060800000002,-402.01487400000002,-448.91067399999997,-444.12264199999998,-429.06647600000002,-565.84194300000001,-360.20398999999998,-322.06323800000001,-285.67122799999999,-365.72605300000004,-454.578665,-397.03421900000001,-403.31192900000002,-546.01673100000005,-697.63724999999999,-562.65698600000007,-1052.4229879999998,-872.86187399999994,-452.79265899999996,-384.57999899999999,-256.57863700000001,-231.78292800000003,-211.57028500000001,-305.59618699999999,-348.25588500000003,-581.10931200000005,-858.01401699999997,-633.18831499999999,-524.05132400000002,-508.09411,-434.99119899999999,-325.47192799999999,-239.80621400000001,-218.068423,-215.90781899999999,-408.39204999999998,-518.48742099999993,-445.117231,-479.60648900000001,-543.86398299999996,-478.82839000000001,-406.19568500000003,-422.73500000000001,-154.35719500000002,-167.860691,-301.47133700000001,-245.09551099999999,-374.45159699999999,-436.89324499999998,-508.73505599999999,-897.23722699999996,-716.42767700000002,-590.25587100000007,-584.07853499999999,-474.71409,-210.517944,-141.61362500000001,-157.40858300000002,-122.319526,-229.38049699999999,-352.86669000000001,-342.59280999999999,-433.831684,-560.18740600000001,-335.17777599999999,-335.53738199999998,-229.06522200000001,-192.29135200000002,-173.37316200000001,-204.27099900000002,-165.54855699999999,-221.48029300000002,-269.55341499999997,-554.92065600000001,-390.73397899999998,-253.25366200000002,-728.75189999999998,"-","-","-","-","-","-","-","-","-"]
[null,"Enlace Península-Baleares","-","-","-","-","-","-","-","-","-","-","-","-","-","-","-","-","-","-","-","-","-","-","-","-","-","-","-","-","-","-","-","-","-","-","-","-","-","-","-","-","-","-","-","-","-","-","-","-","-","-","-","-","-","-","-","-","-","-","-","-","-","-","-","-","-","-","-","-","-","-","-","-","-","-","-","-","-","-","-","-","-","-","-","-","-","-","-","-","-","-","-","-","-","-","-","-","-","-","-","-","-","-","-","-","-","-","-","-","-","-","-","-","-","-","-","-","-","-","-","-","-","-","-","-","-","-","-","-","-","-","-","-","-","-","-","-","-","-","-","-","-","-","-","-","-","-","-","-","-","-","-","-","-","-","-","-","-","-","-","-","-","-","-","-","-","-","-","-","-","-","-","-","-","-","-","-","-","-","-","-","-","-","-","-","-","-","-","-","-","-","-","-","-","-","-","-","-","-","-","-","-","-","-","-","-","-","-","-","-","-","-","-","-","-","-","-","-","-","-","-","-","-","-","-","-","-","-","-","-","-","-","-","-","-","-","-","-","-","-","-",0,0,0,0,0,0,0,0,0,0,0,0,0,0,0,0,0,0,0,0,0,0,4.3890999999999999E-2,-0.52029999999999998,-2.681381,-25.375897000000002,-36.694078999999995,-35.112659000000001,-27.254534,-35.803857000000001,-36.379671999999999,-68.014381999999998,-74.016632999999999,-70.230888000000007,-67.437619000000012,-91.247602000000001,-108.822873,-90.838239000000002,-84.296937,-88.234445000000008,-83.69395200000001,-112.811098,-145.595967,-157.38788099999999,-113.87852599999999,-108.85674300000001,-86.136350000000007,-87.955589000000003,-98.644521999999995,-86.919696000000002,-88.247651000000005,-80.403573999999992,-85.675402000000005,-124.876598,-153.19399999999999,-165.07300000000001,-146.82962899999998,-101.059,-79.551937000000009,-87.789394999999999,-110.89759600000001,-111.884631,-100.736395,-87.606187000000006,-65.672035000000008,-123.28710700000001,-181.06009899999998,-170.38412599999998,-119.55534900000001,-99.372747000000004,-71.777664000000001,-93.54886599999999,-89.213442999999998,-91.217189000000005,-111.467448,-86.955767999999992,-105.354345,-124.74375900000001,-144.84169399999999,-152.53868,-109.260447,-90.882304000000005,-58.978756999999995,-85.128667000000007,-96.651403000000002,-64.562011999999996,-78.352012000000002,-57.068237000000003,-75.027427000000003,-114.23341499999999,-155.21145899999999,-166.87624499999998,-116.104623,-93.285021,-70.161933999999988,-91.76686500000001,-86.203828999999999,-99.993399000000011,-90.106700000000004,"-","-","-","-","-","-","-","-","-"]
[null,"Saldo intercambios internacionales",-269.29700000000003,16.550999999999998,-11.987,-20.997,159.398,0.442,-28.161000000000001,-32.036000000000001,14.863,-21.733000000000001,-139.47,-87.152000000000001,-24.533000000000001,22.888999999999999,-122.07,-226.91900000000001,-191.566,-45.838999999999999,-92.111999999999995,27.849,-99.835999999999999,-14.272,56.173999999999999,33.649000000000001,-96.052000000000007,-312.209,-213.21600000000001,188.66300000000001,271.98,371.25900000000001,87.992000000000004,216.89599999999999,131.30699999999999,-16.239000000000001,8.0229999999999997,2.72,95.905000000000001,222.43799999999999,184.267,48.24,224.11500000000001,217.79499999999999,282.58,18.097999999999999,-4.7850000000000001,-0.85399999999999998,-0.36499999999999999,-20.361999999999998,-20.454999999999998,19.067,44.103000000000002,42.116,71.337999999999994,56.383000000000003,128.05099999999999,134.20599999999999,271.50099999999998,383.18400000000003,371.48200000000003,354.12900000000002,382.27800000000002,376.39499999999998,379.125,353.88600000000002,378.61599999999999,369.63499999999999,406.47899999999998,389.68700000000001,389.56900000000002,434.89600000000002,380.024,248.45500000000001,-23.15,-228.839,95.808999999999997,234.45,175.22300000000001,297.35899999999998,337.60500000000002,288.54199999999997,53.530999999999999,-123.297,-16.169,-31.698,-483.959,-204.565,-220.011,-410.142,-439.19400000000002,-268.20999999999998,-397.76100000000002,-455.005,-103.389,13.218999999999999,65.415999999999997,-169.27099999999999,339.84100000000001,345.96100000000001,404.92,388.81900000000002,355.11399999999998,244.86199999999999,284.57,320.09500000000003,-25.49,206.148,283.52199999999999,253.50200000000001,244.11699999999999,366.79399999999998,462.85599999999999,712.678,628.45799999999997,570.85799999999995,515.62199999999996,504.84,210.995,438.75,625.31500000000005,437.96199999999999,196.386,415.9,422.24900000000002,519.16999999999996,683.53800000000001,173.875,258.827,208.52799999999999,340.72800000000001,443.80599999999998,516.19799999999998,261.39,-38.209000000000003,21.672999999999998,-83.963999999999999,447.06200000000001,578.60299999999995,504.50400000000002,431.03699999999998,282.04500000000002,283.08600000000001,139.702,402.85199999999998,489.56900000000002,532.01599999999996,648.78599999999994,721.60400000000004,705.34900000000005,259.03800000000001,187.01,575.93600000000004,236.11799999999999,428.06299999999999,298.13900000000001,490.714,245.995,26.416,50.988,247.018,-36.927,134.05699999999999,409.34500000000003,237.34800000000001,123.48699999999999,160.179,55.116,-24.058,-119.06699999999999,-318.32600000000002,-299.78699999999998,-234.03200000000001,-621.22,-303.66399999999999,-321.33600000000001,-241.46199999999999,-454.68900000000002,-53.951999999999998,-330.99,-45.66,198.1,295.54899999999998,299.65800000000002,51.222999999999999,68.78,176.042,176.29,31.582000000000001,-174.63399999999999,-495.36900000000003,-662.58799999999997,-689.60500000000002,-420.322,-365.17399999999998,-583.77499999999998,-799.06,41.878,18.827999999999999,-262.10700000000003,-377.87900000000002,63.244999999999997,-310.53500000000003,-236.93299999999999,-285.29700000000003,-175.709,94.564999999999998,-235.49199999999999,-243.36199999999999,-261.05399999999997,-494.78800000000001,-223.46299999999999,-289.77800000000002,-314.01400000000001,-846.57600000000002,-1153.7719999999999,-1052.93,-729.80100000000004,-456.80399999999997,-655.58699999999999,-1199.348,-1291.615,-761.27499999999998,-1052.3420000000001,-907.81299999999999,-796.07299999999998,-935.81,-1102.0160000000001,-948.447,-932.45600000000002,-897.62800000000004,-474.27699999999999,-192.952,-548.93399999999997,-437.37599999999998,-769.16099999999994,-944.90899999999999,-817.41700000000003,-711.16800000000001,-941.36500000000001,-897.21199999999999,-454.01499999999999,-304.71344599999998,-506.196753,-560.11404599999992,-729.095102,-542.81502899999998,-821.22575100000006,-1000.6535670000001,-758.60105700000008,-964.2554520000001,-1295.5098870000002,-593.21057400000007,-256.28839399999998,-611.33580500000005,-358.84235899999999,-762.63600899999994,-1074.8113170000001,-233.62379999999999,-404.76718699999998,-470.93457000000001,-197.10088099999999,-548.75685799999997,-381.58426100000003,-579.51663300000007,-466.21665400000001,-525.29093599999999,-1375.7932209999999,-869.96906999999999,-1211.9197819999999,-939.84038100000009,-625.32935199999997,-629.52545599999996,-646.20974899999999,-1047.302604,-1457.208903,-791.40693099999999,-1080.1572060000001,-364.45221100000003,-642.39397799999995,-430.41725799999995,-411.18220100000002,-132.05559299999999,-358.69515000000001,-1060.4316310000002,-517.67452200000002,-821.87308799999994,-679.119191,-892.91131900000005,-420.92630800000001,28.099829000000003,-490.54062400000004,-225.94670300000001,-652.23227599999996,-256.41148300000003,-285.58111300000002,-481.72024800000003,-236.69277,-336.25484,-303.54976099999999,195.372657,-360.667597,-259.102957,-558.85504600000002,-396.75677899999999,-295.55073599999997,180.77279000000001,0.88915499999999992,-184.17543000000001,-251.793361,-169.941732,436.52791200000001,453.10844900000001,911.71451000000002,847.59026500000004,960.57577300000003,174.92662100000001,-106.684112,762.50236499999994,1083.2692120000002,917.73114199999998,1034.6561139999999,1130.5906419999999,-433.77785799999998,357.21121500000004,938.722174,-531.54929799999991,541.13368700000001,1457.080766,1040.959484,1444.9856000000002,1128.8588829999999,1273.4433959999999,1827.910942,1393.3084220000001,280.22841800000003,-346.27278000000001,-339.50387699999999,1340.296642,857.10299299999997,-292.80159999999995,"-","-","-","-","-","-","-","-","-"]
[null,"Demanda transporte (b.c.)",12568.172999999999,10606.683999999997,11500.654,10528.599999999999,10700.868999999999,10911.449000000001,11525.924000000003,10123.628000000001,10799.337000000003,10940.460000000001,11602.256000000003,12751.464,13221.258,12104.609999999999,11461.919000000002,11048.385,11232.120999999996,10918.467000000001,11835.945000000002,10459.177000000001,11266.763000000004,11698.815999999995,12056.952999999998,12469.990000000002,13798.636,12527.571,12266.981999999998,11180.000999999998,11221.762000000001,10764.076999999999,12007.581,10674.854000000003,11316.847,11565.285000000002,11522.732,12194.610999999997,13097.569000000001,11923.505000000001,12461.083999999995,10884.725999999997,11045.386000000002,11156.418000000001,11886.368000000002,10762.586000000001,11179.712,11748.179999999998,12297.538999999995,12763.290999999997,13141.868,12158.895,12094.056999999995,11595.256999999998,11694.176999999998,11961.463000000002,12800.279999999999,11639.960999999999,11922.619000000001,11858.766,12233.531999999999,13139.841000000004,13984.224000000004,12088.559000000003,13295.242999999999,11822.258000000005,12404.074999999997,12447.605,13093.934000000001,12087.526999999998,12236.762999999997,12363.548000000003,12611.461999999998,13298.204999999998,13848.374,13526.045000000002,13537.277,11990.401999999998,12490.415999999999,12785.945,13519.843999999999,12230.967999999997,12307.397000000003,12882.947000000002,13261.676000000001,13826.558999999999,14791.047,12504.942000000001,12944.200999999997,12938.041000000001,13073.965,13053.460999999999,13846.366000000002,12972.292000000003,13641.727000000001,13754.548999999999,13928.879000000001,14912.340999999999,15172.561,13701.303,14381.126000000002,13712.254999999997,13714.311000000002,14102.116,15283.841999999999,13813.231,14164.754999999999,14304.219000000001,14700.953000000001,16000.632000000001,16168.921,14967.624999999998,15400.066000000001,14030.916999999999,14637.163000000002,15059.191999999999,16261.017,14644.725999999999,14989.451999999999,14949.123000000001,16255.662,16948.564999999999,17845.227999999999,15687.765999999998,16380.922999999997,15199.865,15564.256000000003,16091.724,16573.085999999999,15634.834000000001,15998.932999999999,15961.555,16920.555,17131.96,18289.445000000003,16491.726999999999,17239.230000000003,15530.365,16690.819000000003,17085.272000000001,17642.278000000002,16747.986000000001,16490.887000000002,16729.872000000003,17806.417999999998,18871.052,19341.497000000003,16996.740999999998,17636.378999999997,17018.970999999998,17193.093000000004,17374.280999999999,18464.613000000001,16579.862000000001,16965.512000000002,17630.420000000002,17851.663000000004,18508.075000000001,20199.603000000003,18770.308000000001,18517.214999999997,17007.472000000002,17756.890999999996,18911.004000000001,20054.809000000001,18709.898000000001,18185.194,18727.147000000001,18882.891,20117.086000000003,20331.607,19479.59,20587.064000000002,18261.442999999999,18519.046000000002,19383.066999999999,20650.728999999996,18984.258000000002,19297.613000000001,19134.524000000001,20211.602999999999,21137.934000000001,22434.995999999999,20982.072000000004,21028.847000000005,19050.185000000001,19203.679000000004,20500.803999999996,21538.906999999999,19548.174999999999,19495.727999999999,19231.860999999997,20661.563999999995,22507.246000000003,23447.905000000002,21252.067999999992,21967.846999999998,18681.973999999998,20372.254000000001,20850.334000000006,23038.001000000004,20603.034,20839.387999999999,20448.167999999998,20584.458999999995,22895.526999999998,24159.132999999998,21183.205999999998,22565.631999999998,20260.940999999999,20863.598000000002,21079.954999999998,22851.761000000002,21112.413999999997,20898.947,21214.273999999998,22511.686999999998,23734.213000000003,24433.133000000002,22546.603999999999,22312.010999999999,21496.493999999999,20950.915999999994,21080.627999999997,23239.803000000004,21729.627,21081.667999999998,21124.274000000001,22046.794000000002,23163.711000000003,23770.664000000001,20885.489000000005,20925.592000000001,19227.985000000001,19641.821,20540.189000000002,22424.545000000002,21148.706999999999,20400.554,20324.804999999997,20644.267,22725.194,23750.938022999999,21910.907142,22815.565081999997,19934.792949000002,20422.616260999999,20438.546864999997,23145.032401,21456.10457,20701.916191,20498.548346,22011.928392999998,23440.05386,23667.869017999998,21414.953240999999,22737.242052000001,19254.015281,20346.017596999998,20740.408363000002,21996.80718,21588.901646000002,21020.763280000003,20338.993179000001,20614.639884,21876.794583999999,23090.426942999999,22947.785239999997,21327.506309,19477.465006999999,20190.931372999999,20752.162159000003,21670.967820000002,21447.849914999999,19794.145318999999,19716.804321,20270.138454999997,21328.039439,22553.187899999997,20549.267124999998,21218.142804999999,19498.434923999997,19447.040546,19143.780576000001,21637.578679999999,20607.948791000003,19706.244317000001,19780.493701000003,20480.664445999999,21745.626769000002,22053.512252999997,20371.954502999997,20919.84879,18766.030208,19478.485279,19600.189425,21122.58655,20174.167919,20261.893050000002,19686.429,19785.315298999998,21323.415776999998,22694.104268000003,21013.002076999994,21183.677259000004,18851.251554999995,19832.434908000003,20377.176842000001,23469.964519000001,20880.247671999998,19591.352026000004,19727.777237000006,19879.897710000001,20897.423211000001,21469.711755999997,20847.871017999998,21476.829209000007,19930.533262000001,19732.421679999999,20247.474799,22234.597061999997,21464.162418000004,20844.978949999997,19852.199255000003,20662.608276999999,21335.601706999998,23109.422555000001,19911.637300999999,21127.714475000001,18833.263515999999,20241.752442000001,21708.887146000001,22400.708276999998,21809.106993000001,20214.677563999998,20251.569374999999,20950.357751,22181.271081999999,22621.943054000003,21286.792380999999,22111.1646,"-","-","-","-","-","-","-","-","-"]
[]
[null,"Balance eléctrico mensual Islas Baleares (MWh)","2006-01-01","2006-02-01","2006-03-01","2006-04-01","2006-05-01","2006-06-01","2006-07-01","2006-08-01","2006-09-01","2006-10-01","2006-11-01","2006-12-01","2007-01-01","2007-02-01","2007-03-01","2007-04-01","2007-05-01","2007-06-01","2007-07-01","2007-08-01","2007-09-01","2007-10-01","2007-11-01","2007-12-01","2008-01-01","2008-02-01","2008-03-01","2008-04-01","2008-05-01","2008-06-01","2008-07-01","2008-08-01","2008-09-01","2008-10-01","2008-11-01","2008-12-01","2009-01-01","2009-02-01","2009-03-01","2009-04-01","2009-05-01","2009-06-01","2009-07-01","2009-08-01","2009-09-01","2009-10-01","2009-11-01","2009-12-01","2010-01-01","2010-02-01","2010-03-01","2010-04-01","2010-05-01","2010-06-01","2010-07-01","2010-08-01","2010-09-01","2010-10-01","2010-11-01","2010-12-01","2011-01-01","2011-02-01","2011-03-01","2011-04-01","2011-05-01","2011-06-01","2011-07-01","2011-08-01","2011-09-01","2011-10-01","2011-11-01","2011-12-01","2012-01-01","2012-02-01","2012-03-01","2012-04-01","2012-05-01","2012-06-01","2012-07-01","2012-08-01","2012-09-01","2012-10-01","2012-11-01","2012-12-01","2013-01-01","2013-02-01","2013-03-01","2013-04-01","2013-05-01","2013-06-01","2013-07-01","2013-08-01","2013-09-01","2013-10-01","2013-11-01","2013-12-01","2014-01-01","2014-02-01","2014-03-01","2014-04-01","2014-05-01","2014-06-01","2014-07-01","2014-08-01","2014-09-01","2014-10-01","2014-11-01","2014-12-01","2015-01-01","2015-02-01","2015-03-01","2015-04-01","2015-05-01","2015-06-01","2015-07-01","2015-08-01","2015-09-01","2015-10-01","2015-11-01","2015-12-01","2016-01-01","2016-02-01","2016-03-01","2016-04-01","2016-05-01","2016-06-01","2016-07-01","2016-08-01","2016-09-01","2016-10-01","2016-11-01","2016-12-01","2017-01-01","2017-02-01","2017-03-01","2017-04-01","2017-05-01","2017-06-01","2017-07-01","2017-08-01","2017-09-01","2017-10-01","2017-11-01","2017-12-01","2018-01-01","2018-02-01","2018-03-01","2018-04-01","2018-05-01","2018-06-01","2018-07-01","2018-08-01","2018-09-01","2018-10-01","2018-11-01","2018-12-01"]
[null,"Carbón",281585,245804,280062,239665,271836,287051,292771,281322,254499,177022,201042,264651,253259,227525,220374,263500,228127,222675,278923,292687,263412,229147,201758,262468,287616,269886,265619,216223,246771,279366,294598,301838,286166,244583,217953,188207,186398,267602,230164,242090,270324,291327,298599,307579,259941,281704,254121,280614,288628.96399999998,253130.43700000001,284143.58,270785.11,229324.10800000001,279046.16200000001,292090,286753.92800000001,285293.82500000001,217296.101,192203.66699999999,222661.68400000001,271039.09399999998,222552.524,133127.45199999999,193302.56099999999,240528.49600000001,255173.84400000001,292281.72899999999,285531.25400000002,269841.23499999999,199222.62899999999,166762.40400000001,235503.62899999999,265065.64199999999,219166.837,224145.144,203970.12299999999,227618.82199999999,243421,272060,272045,234898,185556,160648,173937,182300,172763,186533,175478,187897,200607,246667,248252,229417,169690.17,168250.60200000001,182826,183089,150083,160256,174013,194494.804,206570,234613,238509,227703,156196,86830,175269,180780.08,171710.04,173706,70780.108999999997,127697.454,185477.54,218839.82199999999,250939.772,199152.05600000001,83006.979000000007,103751.19,99427.255000000005,115147.24099999999,99808.854999999996,105038.973,151496.986,197176.087,225485.47200000001,286133.93099999998,265479.10800000001,256769.33100000001,224344.495,180604.21100000001,196283.61199999999,221058.21400000001,189456.399,177641.41200000001,189508.62100000001,224832.976,269448.82400000002,273731.7,264559.049,238125.48800000001,197287.90599999999,153252.114,204441.261,198554.986,192794.891,200215.908,"-","-","-","-","-","-","-","-","-"]
[null,"Motores diesel",79209,68329,70721,64718,79303,85154,104210,101456,93527,79792,63493,74990,78135,66061,74782,71646,84385,92577,102578,105250,96624,79159,73984,80425,80489,70911,75416,72520,86002,96520,116196,118501,98449,78246,72700,81131,85013,68206,71555,74273,75820,91793,105509,106425,86067,70751,62004,74409,80487.338000000003,71127.048999999999,78081.048999999999,70171.271999999997,83167.909,94393.464000000007,113035.62,113945.387,97806.403000000006,76729.221000000005,67045.221999999994,81630.111999999994,81369.630999999994,64795.156999999999,77210.808999999994,71556.933999999994,83563.773000000001,89642.910999999993,96268.777000000002,98322.804999999993,81466.168999999994,55484.904999999999,49587.178,74506.566999999995,80432.365999999995,74636.626000000004,73731.683999999994,72451.134000000005,83642.36,94717.668000000005,104719.432,103888.321,81520.528999999995,62130.65,47317.415000000001,55581.767999999996,59201.000999999997,53145.453000000001,52697.133999999998,55012.707999999999,67405.004000000001,69930.770999999993,90133.123000000007,86504.202999999994,65992.843999999997,50254.603000000003,38564,55111,57916.595999999998,54814.648000000001,38555.430999999997,37428.254999999997,51478.368000000002,60837.201999999997,69849.784,77074.995999999999,69718.804000000004,50951.88,51297.131000000001,51325.232000000004,56436.175999999999,54370.103999999999,51246.678999999996,53388.938999999998,63795.298999999999,64962.411999999997,92963.654999999999,83680.463000000003,67767.982000000004,52976.819000000003,38052.409,50124.936999999998,38443.442000000003,63296.957000000002,77413.165999999997,75104.327000000005,87415.225999999995,92667.361999999994,107561.719,107599.22,92554.883000000002,88597.956000000006,62253.616999999998,70496.269,84317.429000000004,70875.667000000001,62401.050999999999,72729.668999999994,88030.043000000005,96848.532999999996,107030.95,88492.99,42503.578000000001,27252.944,25255,33156.188999999998,35374.103000000003,39245.296999999999,40276.341,"-","-","-","-","-","-","-","-","-"]
[null,"Turbina de gas",6947,10938,22831,13569,15378,29015,55976,40768,31591,29413.95199999999,18468,17160,23585,20894,20510,16976,36834,31757,41358,38367,21309,20978,20783,18090,17521,19944,19984,12615,13376,22615,34364,38299,31566,20899,19341,21978,18986,20558,19663,12270,24409,33876,53107,52569,37227,24608,21181,20915,23036.824000000001,25540.649000000001,22064.976999999999,16837.77,15550.541999999999,20236.732,41379.637000000002,42027.091,26953.491999999998,22516.812000000002,21406.807000000001,21863.032999999999,16995.936000000002,20869.650000000001,17680.794999999998,13200.816000000001,17102.748,28124.346000000001,49934.766000000003,59310.271000000001,47553.175000000003,38916.805999999997,31018.1,10217.727000000001,12720.373,24628.482,14603.772000000001,8007.7259999999997,12723.262000000001,29862.117999999999,42997.555,61596.516000000003,39058.875999999997,34035.275000000001,28986.828000000001,31723.758000000002,30572.664000000001,33019.775000000001,31897.867999999999,25229.128000000001,32068.698,39400.116000000002,61334.673999999999,68281.490999999995,57303.716999999997,50631.493999999999,41970.712,37596.616000000002,28446.728999999999,24552.032999999999,42849.538999999997,44140.442000000003,47118.786999999997,57803.786999999997,75697.593999999997,79161.104999999996,66060.736000000004,52001.822,27833.902999999998,36061.230000000003,36489.4,32594.472000000002,38185.656999999999,31999.216,43482.358999999997,58635.014999999999,77101.896999999997,80387.589000000007,57873.42,47588.997000000003,40863.165999999997,36936.794000000002,47667.171000000002,19844.912,13369.73,9070.5879999999997,18358.821,33002.701999999997,46443.63,55165.45,43433.79,18338.486000000001,20288.044000000002,13304.507,13253.123,10760.688,22196.99,14153.174000000001,29329.019,39526.796000000002,59315.127,82009.630999999994,81625.907999999996,74939.63,62142.019,64867.775000000001,59556.201999999997,59632.27,61588.868000000002,"-","-","-","-","-","-","-","-","-"]
[null,"Fuel + Gas",86156,79267,93552,78287,94681,114169,160186,142224,125118,109205.95199999999,81961,92150,101720,86955,95292,88622,121219,124334,143936,143617,117933,100137,94767,98515,98010,90855,95400,85135,99378,119135,150560,156800,130015,99145,92041,103109,103999,88764,91218,86543,100229,125669,158616,158994,123294,95359,83185,95324,103524.16200000001,96667.698000000004,100146.026,87009.042000000001,98718.451000000001,114630.19600000001,154415.25699999998,155972.478,124759.895,99246.03300000001,88452.028999999995,103493.14499999999,98365.566999999995,85664.807000000001,94891.603999999992,84757.75,100666.52100000001,117767.257,146203.54300000001,157633.076,129019.344,94401.710999999996,80605.277999999991,84724.293999999994,93152.739000000001,99265.108000000007,88335.455999999991,80458.86,96365.622000000003,124579.78600000001,147716.98699999999,165484.837,120579.405,96165.925000000003,76304.243000000002,87305.525999999998,89773.664999999994,86165.228000000003,84595.001999999993,80241.835999999996,99473.702000000005,109330.88699999999,151467.79700000002,154785.69399999999,123296.56099999999,100886.09700000001,80534.712,92707.616000000009,86363.324999999997,79366.680999999997,81404.97,81568.697,98597.154999999999,118640.989,145547.378,156236.101,135779.54,102953.70199999999,79131.034,87386.462,92925.576000000001,86964.576000000001,89432.335999999996,85388.154999999999,107277.658,123597.427,170065.552,164068.05200000003,125641.402,100565.81600000001,78915.574999999997,87061.731,86110.613000000012,83141.869000000006,90782.895999999993,84174.915000000008,105774.04699999999,125670.06399999998,154005.34899999999,162764.66999999998,135988.67300000001,106936.44200000001,82541.660999999993,83800.775999999998,97570.551999999996,81636.354999999996,84598.040999999997,86882.842999999993,117359.06200000001,136375.329,166346.07699999999,170502.62099999998,124129.486,102192.57400000001,87397.019,98023.964000000007,94930.304999999993,98877.566999999995,101865.209,"-","-","-","-","-","-","-","-","-"]
[null,"Ciclo combinado",115133,112851,71802,58291,79596,107515,173341,167753,132665,163572,80257,79139,109535,97337,133306,66630,113287,174631,186393,169251,141173,143962,135271,113219,92464,91614,97252,120602,114746,106773,178739,177899,121342,111682,111297,199080,206459,81850,132809,89788,70003,97131,175334,166521,120693,57370,29377,64848,83745.201000000001,90692.047000000006,69947.986000000004,35630.942999999999,87840.323999999993,61960.637999999999,159205.10999999999,145959.23199999999,74275.328999999998,107178.246,98555.293999999994,120643.372,87325.831999999995,101278.758,204244.842,87108.138999999996,89672.712,94536.337,118352.70699999999,152014.503,115098.602,118552.891,95594.106,62958.957000000002,68913.751999999993,134285.43599999999,53854.985000000001,51852.373,56400.712,94530.842999999993,109975.276,123495.86500000001,47459.366999999998,71343.37,43422,35026.341,37837,51552.052000000003,39448.04,25643.305,38630.023000000001,16346,35588.271999999997,29770,3965,53247.095000000001,34705.777999999998,46843.258999999998,33410,44603,51991.088000000003,15938.374,33331.379999999997,16418,18189.412,27263.169000000002,16977.942999999999,52913.580999999998,82131.793999999994,33756.963000000003,37290.881999999998,37658.481,38154.074999999997,110890.848,103324.583,47975.309000000001,79053.868000000002,26774.830999999998,35536.51,123453.66899999999,75824.937000000005,93301.375,92999.952000000005,108546.993,109982.738,51876.43,19259.797999999999,12974.432000000001,15678.454,25123.045999999998,27082.419000000002,16743.469000000001,35138.470999999998,27146.894,37932.815999999999,35459.597999999998,32702.778999999999,37339.868999999999,26810.832999999999,13028.306,35387.375,56263.61,13675.324000000001,40854.671999999999,60509.489000000001,36224,31199.050999999999,48598.584000000003,38884.349000000002,"-","-","-","-","-","-","-","-","-"]
[null,"Generación auxiliar",0,0,0,0,0,0,213,3531,2469,1,0,136.219999999972,0,0,0,0,0,0,2447,8618,1547,0,0,0,0,0,0,0,0,0,2048,2600,1282,1,0,0,0,0,0,0,0,0,1489,3042,1037,-2,0,0,0,0,0,0,0,45.686,2619.5369999999998,2927.97,1100.336,0.80300000000000005,0,0,0,0,0,0,0,1061.171,2481.41,3645.4070000000002,1536.693,0,0,0,0,0,0,0,0,984.28700000000003,2564,3950.4380000000001,1310,1,0,0,0,0,0,0,1,625,2313.25,3044.55,917,2E-3,0,0,0,0,0,0,0,0,2542,3212.201,1940,1,0,0,0,0,0,0,0,337,3682.482,4194.6139999999996,2367.759,0,0,0,0,0,0,0,0,1214,2921.6309999999999,3386.1239999999998,2144,426,0,0,0,0,0,0,1338,1706,3128,4554.8469999999998,2377,1642,0,0,0,0,0,"-","-","-","-","-","-","-","-","-"]
[null,"Régimen ordinario",482874,437922,445416,376243,446113,508735,626511,594830,514751,449800.95199999999,363260,436076.22,464514,411817,448972,418752,462633,521640,611699,614173,524065,473246,431796,474202,478090,452355,458271,421960,460895,505274,625945,639137,538805,455411,421291,490396,496856,438216,454191,418421,440556,514127,634038,636136,504965,434431,366683,440786,475898.32699999999,440490.18200000003,454237.59200000006,393425.09499999997,415882.88300000003,455682.68199999997,608329.90399999998,591613.60800000001,485429.38500000001,423721.18300000002,379210.99,446798.201,456730.49299999996,409496.08900000004,432263.89799999999,365168.44999999995,430867.72899999999,468538.609,559319.38900000008,598824.24,515495.87400000001,412177.23099999997,342961.788,383186.87999999995,427132.13299999997,452717.38099999999,366335.58499999996,336281.35600000003,380385.15600000002,463515.91600000003,532316.26299999992,564976.14,404246.772,353066.29499999998,280374.24300000002,296268.86700000003,309910.66499999998,310480.28000000003,310576.04199999996,281363.141,326001.72499999998,326908.88699999999,436036.31900000002,435852.24400000001,357595.56099999999,323823.36399999994,283491.092,322376.87500000006,"-","-","-","-","-","-","-","-","-","-","-","-","-","-","-","-","-","-","-","-","-","-","-","-","-","-","-","-","-","-","-","-","-","-","-","-","-","-","-","-","-","-","-","-","-","-","-","-","-","-","-","-","-","-","-","-","-","-","-","-"]
[null,"Eólica",514.35,371.37400000000002,548.18799999999999,366.096,438.988,366.65,202.55,548.33199999999999,264.46800000000002,347.64699999999999,407.40800000000002,501.30500000000001,402,480,585,246,392,334,358,444,320,541,784,770,415,420,575,741,212,290,272,328,462,470,620,692,472,688,529,482,477,383,126,147,346,531,538,824,599,689,590,377,312,275,322,395,303,477,529,703,472,638,627,553,435,359,432,356,229,587,549,592,479,1092,557,570,377,358,430,261,666,424,540,751,687,674,767,552,439,391,211,355,349,477,772,486,587,635,749,441,509,342,354,302,236,371,552,761,600,696,580,434.88,636,253,309,231,509,555.89,415.25,97,530,661,708,665.25,486,239,471.2,478,222,292.19,402,260,469,283,227,238,127,130,176,172,183,195,343,382,253,324,368.49,"-","-","-","-","-","-","-","-","-"]
[null,"Solar fotovoltaica",43.972999999999999,50.86,83.445999999999998,87.706999999999994,102.911,110.639,126.145,120.86799999999999,111.756,105.83499999999999,84.200999999999993,72.453999999999994,95,122,165,156,211,207,226,209,180,139,119,123,134,194,416,664,955,1807,2659,4719,4821,4337,3391,4283,3838,5190,7556,7099,8802,9040,8898,8709,6680,6538,5096,3487,3845,4810,6958,8061,9047,8957,10437,10003,8360,6793,5600,4886,5358,6378,8047,9928,10914,10324,10211,11535,9702,8434,4998,5392,6183,6956,10152,10230,12309,11697,12533,12420,10873,9500,6016,6725,7273,7404,11494,11209,12639,13817,14316,12847,10745,8781,5602,5971,5828,8461,11098,12721,12507,13247,13533,12560,10352,10338,6491,5637,6880,7213,10111,12577.61,13499,13458,13857,12164,9669.8700000000008,8932,8008,6276,7084,7540,10664.3,11177.5,12596,13172,13850,13342,10360,8448,6552,5748,5799,7159,12166,12672,13655,13302,13300,12437,10180,9721,7258,5556,7015,5358,9721,"-","-","-","-","-","-","-","-","-"]
[null,"Térmica renovable/Otras renovables","-","-","-","-","-","-","-","-","-","-","-","-","-","-","-","-","-","-","-","-","-","-","-","-","-","-","-","-","-","-","-","-","-","-","-","-","-","-","-","-","-","-","-","-","-","-","-","-","-","-","-","-","-","-","-","-","-","-","-","-","-","-","-","-","-","-","-","-","-","-","-","-",45,23,79,49,42,39,36,47,53,57,55,44,73,47,75,93,16,73,75,30,44,65,60,92,123,172,228,199,261,167,89,121,92,132,185,175,229.29,171.29,164,221,173,100,181,109,119,130.97,148,226,176,164.92,176.14,153.4,126,32,35,42.72,33,93.34,139,138,159,170,104,198,224,164,76,73,87,106,127,137,219,166,221.07,"-","-","-","-","-","-","-","-","-"]
[null,"Térmica no renovable/Cogeneración y resto/Cogeneración",13134.677,11651.766,12757.366,12126.197,9241.1010000000006,11667.710999999999,11282.305,11336.8,10957.776,11996.518,10537.391,12423.241,10231,11272,12861,12018,8170,9987,8947,9642,9504,1019,8067,12215,11005,12227,12415,11349,11758,11450,11883,11405,10678,11820,11914,12428,12679,9600,972,11178,12259,11199,11190,10723,11294,11475,11970,12503,10815,9246,11253,11204,10903,10391,11522,22957,25904,13766,17545,20738,15300,13950,13834,17844,12581,24337,27559,28922,29380,27852,22326,26863,23089,18830,21757,18602,25063,22209,29853,28907,23443,16726,16004,27593,19631,14416,18168,15890,19024,26233,24865,25589,30297,19897,17598,20007,17963,14698,20661,23967,11904,28025,32114,24993,30718,30760,19807,25780,3123,2527,2771,1697.16,2205,1133.1600000000001,2922,2816,2464,3140,3260,3461,3302,3209.64,3098.93,3052.58,2121,3355,2924.9,2930.8,2901,2744,2387,2672,3018,3106,3515,1953,1988,2777,3059,3488,3216,3350,3099,3600,3183,3084,2395.4899999999998,"-","-","-","-","-","-","-","-","-"]
[null,"Residuos no renovables","-","-","-","-","-","-","-","-","-","-","-","-","-","-","-","-","-","-","-","-","-","-","-","-","-","-","-","-","-","-","-","-","-","-","-","-","-","-","-","-","-","-","-","-","-","-","-","-","-","-","-","-","-","-","-","-","-","-","-","-","-","-","-","-","-","-","-","-","-","-","-","-","-","-","-","-","-","-","-","-","-","-","-","-","-","-","-","-","-","-","-","-","-","-","-","-","-","-","-","-","-","-","-","-","-","-","-","-",9163.5,6908.5,11394,13639,14790,13704.5,12853,12487.5,14777,14664.5,14318,12398.5,8564.5,4968,8612,12110,14510,13617,11266.5,12685,12613.5,13662.5,9271,8925.5,7544,7222,10518,14686,11210,14046.5,14056,14325.5,15026.5,13983,11279,9982,7481.5,4456,11877,"-","-","-","-","-","-","-","-","-"]
[null,"Residuos renovables","-","-","-","-","-","-","-","-","-","-","-","-","-","-","-","-","-","-","-","-","-","-","-","-","-","-","-","-","-","-","-","-","-","-","-","-","-","-","-","-","-","-","-","-","-","-","-","-","-","-","-","-","-","-","-","-","-","-","-","-","-","-","-","-","-","-","-","-","-","-","-","-","-","-","-","-","-","-","-","-","-","-","-","-","-","-","-","-","-","-","-","-","-","-","-","-","-","-","-","-","-","-","-","-","-","-","-","-",9163.5,6908.5,11394,13639,14790,13704.5,12853,12487.5,14777,14664.5,14318,12398.5,8564.5,4968,8612,12110,14510,13617,11266.5,12685,12613.5,13662.5,9271,8925.5,7544,7222,10518,14686,11210,14046.5,14056,14325.5,15026.5,13983,11279,9982,7481.5,4456,11877,"-","-","-","-","-","-","-","-","-"]
[null,"Régimen especial",13693,12074,13389,12580,9783,12145,11611,12006,11334,12450,11029,12997,10728,11874,13611,12420,8773,10528,9531,10295,10004,1699,8970,13108,11554,12841,13406,12754,12925,13547,14814,16452,15961,16627,15925,17403,16989,15478,9057,18759,21538,20622,20214,19579,18320,18544,17604,16814,15259,14745,18801,19642,20262,19623,22281,33355,34567,21036,23674,26327,21130,20966,22508,28325,23930,35020,38202,40813,39311,36873,27873,32847,29796,26901,32545,29451,37791,34303,42852,41635,35035,26707,22615,35113,27664,22541,30504,27744,32118,40514,39467,38821,41435,29220,24032,26556,"-","-","-","-","-","-","-","-","-","-","-","-","-","-","-","-","-","-","-","-","-","-","-","-","-","-","-","-","-","-","-","-","-","-","-","-","-","-","-","-","-","-","-","-","-","-","-","-","-","-","-","-","-","-","-","-","-","-","-","-"]
[null,"Generación",496567,449996,458805,388823,455896,520880,638122,606836,526085,462250.95199999999,374289,449073.22,475242,423691,462583,431172,471406,532168,621230,624468,534069,474945,440766,487310,489644,465196,471677,434714,473820,518821,640759,655589,554766,472038,437216,507799,513845,453694,463248,437180,462094,534749,654252,655715,523285,452975,384287,457600,491157.32699999999,455235.18199999997,473038.592,413067.09499999997,436144.88299999997,475305.68199999997,630610.90399999998,624968.60800000001,519996.38500000001,444757.18300000002,402884.99,473125.201,477860.49300000002,430462.08899999998,454771.89799999999,393493.45,454797.72899999999,503558.609,597521.38899999997,639637.24,554806.87399999995,449050.23100000003,370834.788,416033.88,456928.13299999997,479618.38099999999,398880.58500000002,365732.35600000003,418176.15600000002,497818.91600000003,575168.26300000004,606611.14,439281.772,379773.29499999998,302989.24300000002,331381.86700000003,337574.66499999998,333021.28000000003,341080.04200000002,309107.141,358119.72499999998,367422.88699999999,475503.31900000002,474673.24400000001,399030.56099999999,353043.364,307523.092,348932.875,327363.32500000001,298018.68099999998,326388.05800000002,308848.071,351604.33899999998,383409.989,446981.79,463196.47100000002,423798.48300000001,353665.283,275127.82799999998,328765.42499999999,340155.82799999998,320757.38699999999,337706.41100000002,309267.76199999999,384392.69500000001,399740.43599999999,514616.72399999999,486272.26899999997,405013.59700000001,349114.32400000002,298958.95199999999,314647.36099999998,322478.80599999998,313009.277,337675.97700000001,326817.06099999999,366558.93199999997,409375.96799999999,498553.46500000003,498916.46799999999,460727.42300000001,387352.93599999999,326306.34299999999,333900.28200000001,381094.58199999999,331714.35200000001,331990.23200000002,358164.33299999998,408754.87099999998,465024.45899999997,523316.152,540701.12699999998,422026.29800000001,383315.152,334543.62199999997,368328.22499999998,350317.342,358115.04200000002,377425.516,"-","-","-","-","-","-","-","-","-"]
[null,"Enlace Península-Baleares","-","-","-","-","-","-","-","-","-","-","-","-","-","-","-","-","-","-","-","-","-","-","-","-","-","-","-","-","-","-","-","-","-","-","-","-","-","-","-","-","-","-","-","-","-","-","-","-",0,0,0,0,0,0,0,0,0,0,0,0,0,0,0,0,0,0,0,0,0,0,-43.890999999999998,520.29999999999995,2681.3809999999999,25375.897000000001,36694.078999999998,35112.659,27254.534,35803.857000000004,36379.671999999999,68014.381999999998,74016.633000000002,70230.888000000006,67437.619000000006,91247.601999999999,108822.87300000001,90838.239000000001,84296.937000000005,88234.445000000007,83693.952000000005,112811.098,145595.967,157387.88099999999,113878.526,108856.743,86136.35,87955.589000000007,98644.521999999997,86919.695999999996,88249.650999999998,80404.573999999993,85669.402000000002,124876.598,153191.78599999999,165070.70499999999,146829.62899999999,101058.571,79551.937000000005,87790.395000000004,110897.59600000001,111884.63099999999,100736.395,87606.187000000005,65670.035000000003,123291.107,181060.09899999999,170384.12599999999,119558.349,99376.747000000003,71777.664000000004,93548.865999999995,89213.442999999999,91217.188999999998,111467.448,86955.767999999996,105354.345,124743.75900000001,144841.69399999999,152538.68,109260.447,90882.304000000004,58978.756999999998,85128.667000000001,96651.403000000006,64562.012000000002,78352.012000000002,57068.237000000001,75027.426999999996,114233.41499999999,155211.459,166876.245,116104.62300000001,93285.020999999993,70161.933999999994,91766.865000000005,86203.828999999998,99993.399000000005,90106.7,"-","-","-","-","-","-","-","-","-"]
[null,"Demanda transporte (b.c.)",496567,449996,458805,388823,455896,520880,638122,606836,526085,462250.95199999999,374289,449073.22,475242,423691,462583,431172,471406,532168,621230,624468,534069,474945,440766,487310,489644,465196,471677,434714,473820,518821,640759,655589,554766,472038,437216,507799,513845,453694,463248,437180,462094,534749,654252,655715,523285,452975,384287,457600,491157.32699999999,455235.18199999997,473038.592,413067.09499999997,436144.88299999997,475305.68199999997,630610.90399999998,624968.60800000001,519996.38500000001,444757.18300000002,402884.99,473125.201,477860.49300000002,430462.08899999998,454771.89799999999,393493.45,454797.72899999999,503558.609,597521.38899999997,639637.24,554806.87399999995,449050.23100000003,370790.897,416554.18,459609.51400000002,504994.27799999999,435574.66399999999,400845.01500000001,445430.69,533622.77300000004,611547.93500000006,674625.522,513298.40500000003,450004.18300000002,370426.86200000002,422629.46899999998,446397.538,423859.51899999997,425376.97899999999,397341.58600000001,441813.67700000003,480233.98499999999,621099.28599999996,632061.125,512909.087,461900.10700000002,393659.44199999998,436888.46399999998,426007.84700000001,384938.37699999998,414637.70899999997,389252.64500000002,437273.74099999998,508286.587,600173.576,628267.17599999998,570628.11199999996,454723.85399999999,354679.76500000001,416555.82,451053.424,432642.01799999998,438442.80599999998,396873.94900000002,450062.73,523031.54300000001,695676.82299999997,656656.39500000002,524571.946,448491.071,370736.61599999998,408196.22700000001,411692.24900000001,404226.46600000001,449143.42499999999,413772.82900000003,471913.277,534119.72699999996,643395.15899999999,651455.14800000004,569987.87,478235.24,385285.1,419028.94900000002,477745.98499999999,396276.364,410342.24400000001,415232.57,483782.29800000001,579257.87399999995,678527.61100000003,707577.37199999997,538130.92099999997,476600.17300000001,404705.55599999998,460095.09,436521.17099999997,458108.44099999999,467532.21600000001,"-","-","-","-","-","-","-","-","-"]
[]
[null,"Balance eléctrico mensual Islas Canarias (MWh)","2006-01-01","2006-02-01","2006-03-01","2006-04-01","2006-05-01","2006-06-01","2006-07-01","2006-08-01","2006-09-01","2006-10-01","2006-11-01","2006-12-01","2007-01-01","2007-02-01","2007-03-01","2007-04-01","2007-05-01","2007-06-01","2007-07-01","2007-08-01","2007-09-01","2007-10-01","2007-11-01","2007-12-01","2008-01-01","2008-02-01","2008-03-01","2008-04-01","2008-05-01","2008-06-01","2008-07-01","2008-08-01","2008-09-01","2008-10-01","2008-11-01","2008-12-01","2009-01-01","2009-02-01","2009-03-01","2009-04-01","2009-05-01","2009-06-01","2009-07-01","2009-08-01","2009-09-01","2009-10-01","2009-11-01","2009-12-01","2010-01-01","2010-02-01","2010-03-01","2010-04-01","2010-05-01","2010-06-01","2010-07-01","2010-08-01","2010-09-01","2010-10-01","2010-11-01","2010-12-01","2011-01-01","2011-02-01","2011-03-01","2011-04-01","2011-05-01","2011-06-01","2011-07-01","2011-08-01","2011-09-01","2011-10-01","2011-11-01","2011-12-01","2012-01-01","2012-02-01","2012-03-01","2012-04-01","2012-05-01","2012-06-01","2012-07-01","2012-08-01","2012-09-01","2012-10-01","2012-11-01","2012-12-01","2013-01-01","2013-02-01","2013-03-01","2013-04-01","2013-05-01","2013-06-01","2013-07-01","2013-08-01","2013-09-01","2013-10-01","2013-11-01","2013-12-01","2014-01-01","2014-02-01","2014-03-01","2014-04-01","2014-05-01","2014-06-01","2014-07-01","2014-08-01","2014-09-01","2014-10-01","2014-11-01","2014-12-01","2015-01-01","2015-02-01","2015-03-01","2015-04-01","2015-05-01","2015-06-01","2015-07-01","2015-08-01","2015-09-01","2015-10-01","2015-11-01","2015-12-01","2016-01-01","2016-02-01","2016-03-01","2016-04-01","2016-05-01","2016-06-01","2016-07-01","2016-08-01","2016-09-01","2016-10-01","2016-11-01","2016-12-01","2017-01-01","2017-02-01","2017-03-01","2017-04-01","2017-05-01","2017-06-01","2017-07-01","2017-08-01","2017-09-01","2017-10-01","2017-11-01","2017-12-01","2018-01-01","2018-02-01","2018-03-01","2018-04-01","2018-05-01","2018-06-01","2018-07-01","2018-08-01","2018-09-01","2018-10-01","2018-11-01","2018-12-01"]
[null,"Hidráulica",0,0,0,0,0,0,0,0,0,0,0,0,0,0,0,0,0,0,0,0,0,0,0,0,0,0,0,0,0,0,0,0,0,0,0,0,0,0,0,0,0,0,0,0,0,0,0,0,0,0,0,0,0,0,0,0,0,0,0,0,0,0,0,0,0,0,0,0,0,0,0,0,0,0,0,0,0,0,0,0,0,0,0,0,0,0,0,0,0,0,0,0,0,0,0,0,0,0,0,0,0,0,0,0,0,0,0,0,303.60000000000002,270,304.60000000000002,292,295,296,304,303,296,311,301,309,309,282,311,299,308,301,313,266,282,271,260,270,264,239,265,262,271,271,275,288,267,294,274,312,279,35,0,"-","-","-","-","-","-","-","-","-"]
[null,"Motores diesel",165513,148359,156468,143502,170858,177722,176016,179233,182517,179648,157979,169849,187608,153155,170227,158998,161066,167755,183062,178646,169801,172067,170171,169446,169904,169953,164609,171005,184619,170736,180381,181406,184435,177595,169810,179313,175499,161432,167927,161723,174920,177098,181952,183950,185161,193478,183078,194481,187860.42600000001,166955.34899999999,187977.302,173369.21400000001,162133.90599999999,164800.02900000001,181346.47099999999,198336.867,189919.53599999999,200384.633,184885.12599999999,185418.913,188502.864,169922.07500000001,187482.117,176962.42800000001,170170.94399999999,179381.94099999999,187314.6,185824.93599999999,188071.837,178369.31599999999,172999.69399999999,178373.34299999999,179500.23499999999,176820.42600000001,179805.49600000001,178161.291,179655.16699999999,163882.432,172623.93900000001,197998.946,172035.13200000001,174704.734,163848.48800000001,171094.64300000001,179868.34,166432.49600000001,179991.954,156656.79,166958.14600000001,161808.769,167404.83799999999,183067.236,171801.899,179535.08100000001,180393.31200000001,184639.32500000001,182041.55900000001,166724.26,184161.93100000001,173494.46100000001,173886.989,175680.00399999999,177884.16800000001,192713.80300000001,182878.91,182334.08799999999,165752.552,187559.179,183398.663,167418.43700000001,185448.82,175172.701,184138.62400000001,162753.29800000001,184557.63500000001,199833.99400000001,198140.223,191165.39300000001,181351.79800000001,194312.774,191382.783,171121.66500000001,189600.554,179374.39799999999,182068.07199999999,175199.829,195773.45699999999,199399.29,172730.772,198093.171,184851.45199999999,188070.08300000001,188283.13200000001,166413.076,199642.38800000001,210397.63500000001,214526.66099999999,195945.864,212740.62599999999,224846.72200000001,211955.03899999999,232636.30900000001,209595.62100000001,201731.16099999999,213634.49900000001,192487.90700000001,181035.595,"-","-","-","-","-","-","-","-","-"]
[null,"Turbina de gas",52857,58444,91260,61071,57809,75033,67196,68751,76471.12,83282,74117,58140,64149,63769,68930,63759,61840,50272,47789,55948,62897,57361,55111,47645,49303,38729,28799,32804,40343,47105,47074,42237,50914,36660,29392,30166,34805,21886,30042,11292,38398,37443,25400,29481,39778.542000000016,31205,25237.511999999988,17204,13491.04,18753.394,20108.357,13928.882,30855.155999999999,31941.35,29817.828000000001,24986.524000000001,28373.723999999998,46582.514999999999,44841.277999999998,39601.608999999997,34501.046999999999,37022.040999999997,48996.798000000003,30090.472000000002,33696.629000000001,29253.317999999999,46053.292999999998,43711.142,56663.614000000001,57351.207000000002,58097.326999999997,53609.258999999998,49954.794000000002,46945.324000000001,50673.428999999996,43039.485999999997,43644.055,41616.254000000001,41444.798000000003,49387.207999999999,59150.887000000002,62477.417999999998,48260.309000000001,53988.732000000004,33759.934000000001,27745.124,31738.947,35768.232000000004,25760.225999999999,22539.748,31573.401000000002,33220.502,28044.227999999999,35123.300999999999,32417.243999999999,28837.824000000001,26534.567999999999,32861.773999999998,19596.028999999999,21361.484,24865.670999999998,29044.708999999999,26256.525000000001,19704.468000000001,50295.97,36660.589,36644.1,39940.959000000003,28149.965,28792.431,24246.495999999999,23841.564999999999,37191.684999999998,35424.377999999997,28336.128000000001,25334.37,32683.006000000001,24129.387999999999,22541.904999999999,20232.469000000001,18719.830000000002,21856.048999999999,18621.348999999998,19322.266,17715.981,14422.895,15882.528,31498.591,37833.684000000001,27452.880000000001,26044.13,29769.361000000001,31339.258000000002,23523.017,18987.773000000001,12640.722,17181.505000000001,14314.57,22105.947,21770.813999999998,23422.579000000002,22577.284,20472.2,18992.006000000001,16383.045,17868.261999999999,16518.832999999999,"-","-","-","-","-","-","-","-","-"]
[null,"Turbina de vapor",348359,305913,351244,298246,274223,249935,254565,265884,284703,261074,270998,264847,267716,244594,270944,295087,222900,280003,253974,300035,289769,297640,280624,303519,325375,311290,288853,271239,285962,228474,273542,273013,285098,298907,282718,289770,283886,246215,277471,250511,289749,254556,266775,281781,281193,297557,249395,264539,275233.60499999998,239085.291,258003.02499999999,233931.054,254626.209,255627.035,246393.45,264783.53899999999,255925.19500000001,219068.06,221691.14600000001,248219.49600000001,239152.19,224589.21100000001,264589.24699999997,228431.98499999999,220646.28899999999,180534.772,228077.55900000001,216593.97700000001,207647.78599999999,232308.245,184270.27900000001,210977.70300000001,234910.72899999999,199336.31400000001,227404.86499999999,205202.234,198111.728,221665.34599999999,237362.986,233682.87599999999,221969.495,235563.274,244573.82199999999,226155.13399999999,194241.535,194878.78899999999,217861,205723.48800000001,195840,176159.163,213945.36199999999,213545,203418,222976.21599999999,206361,220100,216734.185,176820.28400000001,150580.23300000001,152882.11199999999,146331.71,168933.78899999999,183295.43400000001,180439.144,162676.41099999999,170399.29300000001,169086.92,195856.557,202078.565,176220.30100000001,182024.82699999999,159738.79300000001,150618.451,185584.929,204266.86600000001,206409.50700000001,216761.283,163670.58600000001,156374.23000000001,221565.19099999999,229365.61300000001,206627.829,219237.899,193798.73,173434.728,204683.361,222433.549,236381.93400000001,224084.522,208666.932,172369.114,245579.43599999999,210604.08499999999,197055,204998.98699999999,218563.31599999999,191062.65100000001,236220.38200000001,222604.91899999999,223524.22500000001,208860.49,203117.30100000001,191091.44500000001,216134.106,212818.00399999999,190979.33799999999,193576.76699999999,"-","-","-","-","-","-","-","-","-"]
[null,"Fuel + Gas",566729,512716,598972,502819,502890,502690,497777,513868,543691.12,524004,503094,492836,519473,461518,510101,517844,445806,498030,484825,534629,522467,527068,505906,520610,544582,519972,482261,475048,510924,446315,500997,496656,520447,513162,481920,499249,494190,429533,475440,423526,503067,469097,474127,495212,506132.54200000002,522240,457710.51199999999,476224,476585.071,424794.03399999999,466088.68400000001,421229.15,447615.27099999995,452368.41399999999,457557.74900000001,488106.93,474218.45499999996,466035.20799999998,451417.55,473240.01800000004,462156.10100000002,431533.32700000005,501068.16200000001,435484.88500000001,424513.86199999996,389170.03099999996,461445.45200000005,446130.05499999999,452383.23699999996,468028.76799999998,415367.3,442960.30499999999,464365.75799999997,423102.06400000001,457883.79000000004,426403.011,421410.94999999995,427164.03200000001,451431.723,481069.02999999997,453155.51400000002,472745.42599999998,456682.61900000001,451238.50899999996,407869.80900000001,389056.40899999999,429591.90100000001,398148.51,388558.37199999997,360507.68,412923.60100000002,429832.73800000001,403264.12699999998,437634.598,419171.55599999998,433577.14899999998,425310.31200000003,376406.31800000003,354338.19300000003,347738.05700000003,345084.37,373658.50199999998,387436.12699999998,392857.41500000004,395851.29099999997,389393.97,371483.57200000004,423356.69500000001,413627.19299999997,372431.16899999999,391720.14299999998,358753.05900000001,371948.76,383762.60499999998,417160.62900000002,431577.87100000004,447584.51199999999,378965.36700000003,360267.93300000002,436110.43400000001,439468.22600000002,399605.54300000001,427459.80200000003,392495.39399999997,373218.78099999996,394306.08499999996,434089.53399999999,467279.815,434648.978,434212.98300000001,383264.696,463418.88,430226.47499999998,386991.09299999999,423629.14800000004,441601.67300000001,422770.81700000004,446480.81599999999,457451.49199999997,470141.76100000006,444238.10800000001,458330.89399999997,421159.26600000006,436857.27299999999,442835.54800000001,401335.50699999998,391131.19500000001,"-","-","-","-","-","-","-","-","-"]
[null,"Ciclo combinado",125939,107765,79372,139320,154766,168017,187960,206155,200181,216209,204172,217541,203577,170340,199354,152118,243924,185380,229495,189228,195544,230632,226835,216848,199787,167592,219679,215393,194309,240047,218649,221342,228900,217782,219404,230433,218103,205178,222643,198070,148582,202502,234690,211977,201745,231922,241597,235319,230101.864,203031.70800000001,228450.67800000001,216494.734,193292.74799999999,190320.30900000001,218682.10200000001,224299.34099999999,235057.37,266936.90600000002,253781.81899999999,247960.606,252928.86600000001,190920.098,187526.745,212566.242,245524.253,275132.26,221773.29199999999,252862.68299999999,256339.48699999999,268452.36700000003,290455.41499999998,264393.52899999998,258410.93100000001,234103.44699999999,227913.742,212401.38500000001,248853.609,229398.86900000001,233205.38,233457.065,272722.63900000002,254754.65100000001,229874.65900000001,242675.19699999999,278031.61300000001,223389,245774,243841,250123,244898,263512.41499999998,270469,270577,264188,246468,251409,248686.91099999999,228402.05799999999,280046.83,274981.90600000002,280289.39600000001,252045.92199999999,271160.34499999997,264740.07900000003,318190.978,336165.95299999998,298564.98200000002,258173.584,256340.41899999999,226895.34400000001,255027.685,261373.916,260976.97200000001,242886.79,257449.17300000001,257210.08600000001,261505.807,350690.36800000002,311693.576,270991.93400000001,247044.88200000001,217849.75099999999,233400.21299999999,247033.402,271015.08100000001,238084.59599999999,241073.81,247232.45699999999,240643.52799999999,294696.65299999999,304199.90299999999,249425.23499999999,282319.56300000002,235324,250923.37599999999,219690.93400000001,255536.929,214873.89199999999,231391.76800000001,261576.27100000001,236369.61300000001,290262.84999999998,281882.196,255620.62400000001,235479.92300000001,216348.33600000001,266353.99099999998,"-","-","-","-","-","-","-","-","-"]
[null,"Generación auxiliar",0,0,0,0,0,0,0,0,0,0,0,0,12171,11523,11651,11641,10919,9438,10685,12461,11325,11933,10055,9038,10202,9659,10861,10032,6829,6410,7670,7858,5141,4729,5487,4869,4385,3909,4661,2586,2823,3208,5305,3351,1680,811,899,170,0,0,0,0,0,0,0,0,0,0,0,0,0,0,null,null,null,null,null,null,null,null,null,null,null,null,null,null,null,null,null,null,null,null,null,null,null,null,null,null,null,null,null,null,null,null,null,null,null,null,null,null,null,null,null,null,null,null,null,null,null,null,null,null,null,null,null,null,null,null,null,null,null,null,null,null,null,null,null,null,null,null,null,null,null,null,null,null,null,null,null,null,null,null,null,null,null,null,null,"-","-","-","-","-","-","-","-","-"]
[null,"Régimen ordinario",692668,620481,678344,642139,657656,670707,685737,720023,743872.12,740213,707266,710377,735221,643381,721106,681603,700649,692848,725005,736318,729336,769633,742796,746496,754571,697223,712801,700473,712062,692772,727316,725856,754488,735673,706811,734551,716678,638620,702744,624182,654472,674807,714122,710540,709557.54200000002,754973,700206.51199999999,711713,706686.93500000006,627825.74199999997,694539.36199999996,637723.88400000008,640908.01899999997,642688.723,676239.85100000002,712406.27099999995,709275.82499999995,732972.11400000006,705199.36899999995,721200.62400000007,715084.96700000006,622453.42500000005,688594.90700000001,648051.12699999998,670038.11499999999,664302.29099999997,683218.74400000006,698992.73800000001,708722.72399999993,736481.13500000001,705822.71499999997,707353.83400000003,722776.68900000001,657205.51099999994,685797.53200000001,638804.39599999995,670264.55899999989,656562.90100000007,684637.103,714526.09499999997,725878.15300000005,727500.07700000005,686557.27800000005,693913.70600000001,685901.42200000002,612445.40899999999,675365.90100000007,641989.51,638681.37199999997,605405.67999999993,676436.01600000006,700301.73800000001,673841.12699999998,701822.598,665639.55599999998,684986.14899999998,"-","-","-","-","-","-","-","-","-","-","-","-","-","-","-","-","-","-","-","-","-","-","-","-","-","-","-","-","-","-","-","-","-","-","-","-","-","-","-","-","-","-","-","-","-","-","-","-","-","-","-","-","-","-","-","-","-","-","-","-"]
[null,"Hidroeólica",0,0,0,0,0,0,0,0,0,0,0,0,0,0,0,0,0,0,0,0,0,0,0,0,0,0,0,0,0,0,0,0,0,0,0,0,0,0,0,0,0,0,0,0,0,0,0,0,0,0,0,0,0,0,0,0,0,0,0,0,0,0,0,0,0,0,0,0,0,0,0,0,0,0,0,0,0,0,0,0,0,0,0,0,0,0,0,0,0,0,0,0,0,0,0,0,0,0,0,0,0,0,0.311,314.81299999999999,161.52500000000001,195.471,201.01499999999999,198.726,416.17599999999999,374.87299999999999,243.78399999999999,125.636,242.05799999999999,362.42099999999999,2082.991,1928.8240000000001,742,484.64600000000002,882.971,670.68600000000004,814.1,1779.5260000000001,1522.376,1303.018,923.46299999999997,2002.62,2580.2730000000001,2223.9,2171.9670000000001,733.35400000000004,1012.851,1035.191,1084.578,1447.992,2129.7550000000001,994.51599999999996,1495.018,2229.1950000000002,3114.3130000000001,2458.3380000000002,2340.8780000000002,990.89499999999998,811.37,1301.6679999999999,2262.8510000000001,1768.028,1685.079,"-","-","-","-","-","-","-","-","-"]
[null,"Hidráulica/Resto hidráulica",0,0,0,0,0,0,0,0,0,0,0,0,0,0,0,0,0,0,82,190,247,92,278,287,287,244,240,0,185,315,305,97,0,0,0,0,9,164,175,50,0,0,0,0,0,0,0,0,0,0,0,0,0,0,0,0,0,0,0,0,0,0,2,239,165,131,245,179,201,238,164,111.408,116.43899999999999,7.4999999999999997E-2,163.001,246.87899999999999,218.845,207.49700000000001,62.734999999999999,231.00200000000001,221.7,205.726,40.073,75.364000000000004,222.602,204.523,136.68199999999999,136.99,292.267,286.38799999999998,286.267,286.37400000000002,292.33800000000002,303.71199999999999,293.16300000000001,306,305,276,301,290,300,283,308,310.02100000000002,296,272,261,277,"-","-","-","-","-","-","-","-","-","-","-","-","-","-","-","-","-","-","-","-","-","-","-","-","-","-","-","-","-","-","-","-","-","-","-","-","-","-","-","-","-","-","-","-","-","-","-","-"]
[null,"Eólica",17431.845000000001,18906.552,22433.485000000001,28613.578000000001,35233.5,25590.253000000001,56231.544000000002,38386.534,22680.768,19552.138999999999,15309.171,25694.21,17536,22919,37045,26057,34949,31706,57951,48557,26273,19181,16085,18581,12697,16352,39237,36025,31842,39889,59648,61491,17713,33991,22016,25574,23706,17290,24349,46455,32116,20734,55995,57105,22914,12762,24732,20549,11740,14778,23015,32147,36251,38838,47304,42622,35769,14015,17956,16928,11345,24277,22847,23944,19554,37648,55422,51939,31495,25599,15790,34295,18963.88,33726.285000000003,33681.697,30021.198,26774.771000000001,44057.214,57535.39,54601,12813.212,17087.317999999999,16904.712,15601.111999999999,24542.069,28387.059000000001,13294,27647.999,38088.171000000002,48342,41479,42314,24540,24190,27763,22147,29456,32606,45694,27506,42525,35026,45220,59362,12482,15750,20599,23738,41442,43677,41792.052000000003,28967,40094,30389,59611,49740,17421,10614,24303,8611,19204,40727,33663,25978,30431,44239,56792,48605,46717,13315,17702,15713,15115.174000000001,22686,36312,18569,25520,40162,50389,47397,54584,21312,24044,39853,57039,46216,54166.252,"-","-","-","-","-","-","-","-","-"]
[null,"Solar fotovoltaica",36.402000000000001,46.195999999999998,66.179000000000002,67.328000000000003,76.62,77.052999999999997,98.995000000000005,430.70800000000003,484.04,533.36199999999997,462.50200000000001,536.16499999999996,610,833,1268,1459,1737,1692,2046,2433,2017,2022,1635,1621,2022,2658,3713,4145,4312,4894,5548,5693,6152,9825,7689,6849,8709,10847,12492,16156,16219,16256,17530,17568,12555,13377,11497,9124,10698,10306,16328,16499,19138,19607,22480,21526,17621,15830,12519,12614,15178,16843,19656,19729,20773,23349,23817,24739,20929,17684,14494,14948,15819,17853,23039,20676,24978,25023,26449,26299,23158,19232,16071,17914,20253,19458,23739,27152,27710,30875,30903,26948,24098,22190,17740,15636,18995,20132,27162,25919,29372,27594,27933,29920,21433,20634,16824,16373,18338.863000000001,17768,25470.297999999999,25100,29874,27309,30356,26058,20796,17895,18495,18094,19687,20003,24028,24143,25216,29415,29166,27400,25684,20209,17007,15716,18014,18976,25350,25781,25232,27578,29026,26878,22960,19759,16476,17509,18989,17868,24642.07,"-","-","-","-","-","-","-","-","-"]
[null,"Térmica renovable/Otras renovables",8687.5660000000044,11201.251999999999,21105.335999999999,20726.093999999997,19570.879999999997,20816.694,21169.460999999999,19156.758000000002,13239.191999999999,22026.499000000003,17532.326999999997,22967.625,21162,19576,5693,17196,15807,15288,19273,20695,19120,18295,18031,23147,22239,19665,20200,19685,21462,14780,144,21585,13957,17447,22889,23166,23472,22220,12230,24755,22920,23920,24575,24604,23900,22497,23578,24384,23902,18935,16313,24282,25112,19550,10072,5987,5025,5016,3979,2388,3274,5746,5969,5585,6959,1329,735,722,702,703,749,675.36300000000006,612.11,489.72300000000001,585.19799999999998,682.91600000000005,647.63499999999999,645.86599999999999,716.72299999999996,723.62,743.06100000000004,760.45899999999995,617.47500000000002,825.66800000000001,628.67399999999998,697.577,800.20100000000002,747.98099999999999,798.7,697.58100000000002,798.74400000000003,711.54100000000005,628.87699999999995,722.197,511,644,787,707,778,663,669,643,797,820.72199999999998,629,747,835,731,378,350,448,494,606,795.298,837.91800000000001,841,865,810,840,788,862,735,824,817,884,679,761,696,738,786,765,789,811,720,831,836,813,823,831,682,802,831,803,782,762,647,0,"-","-","-","-","-","-","-","-","-"]
[null,"Térmica no renovable/Cogeneración y resto/Cogeneración",2832.1869999999999,0,0,0,0,0,0,0,0,0,0,0,0,0,0,0,0,0,0,0,0,0,0,0,0,0,0,0,0,0,0,0,0,0,0,0,0,0,0,0,10,10,0,0,0,0,0,0,0,0,0,0,0,0,0,0,0,0,0,0,0,0,0,0,0,0,0,0,0,0,0,0,0,0,0,0,0,0,0,0,0,0,0,0,0,0,0,0,0,0,0,0,0,0,0,0,0,0,0,0,0,0,0,0,0,0,0,0,0,0,0,0,0,0,0,0,0,0,0,0,0,0,0,0,0,0,0,0,0,0,0,0,0,0,0,0,0,0,0,0,0,0,0,0,0,0,0,"-","-","-","-","-","-","-","-","-"]
[null,"Régimen especial",28988,30154,43605,49407,54881,46484,77500,57974,36404,42112,33304,49198,39308,43328,44006,44712,52493,48686,79352,71875,47657,39590,36029,43636,37245,38919,63390,59855,57801,59878,65645,88866,37822,61263,52594,55589,55896,50521,49246,87416,71265,60920,98100,99277,59369,48636,59807,54057,46340,44019,55656,72928,80501,77995,79856,70135,58415,34861,34454,31930,29797,46866,48474,49497,47451,62457,80219,77579,53327,44224,31197,50029.771000000001,35511.429000000004,52069.082999999999,57468.895999999993,51626.993000000002,52619.251000000004,69933.577000000005,84763.847999999998,81854.622000000003,36935.972999999998,37285.502999999997,33633.26,34416.143999999993,45646.345000000001,48747.159,37969.883000000002,55684.97,66889.137999999992,80200.969000000012,73467.010999999999,70259.915000000008,49559.215000000004,47405.909,46307.163,38733,"-","-","-","-","-","-","-","-","-","-","-","-","-","-","-","-","-","-","-","-","-","-","-","-","-","-","-","-","-","-","-","-","-","-","-","-","-","-","-","-","-","-","-","-","-","-","-","-","-","-","-","-","-","-","-","-","-","-","-","-"]
[null,"Generación",721656,650635,721949,691546,712537,717191,763237,777997,780276.12,782325,740570,759575,774529,686709,765112,726315,753142,741534,804357,808193,776993,809223,778825,790132,791816,736142,776191,760328,769863,752650,792961,814722,792310,796936,759405,790140,772574,689141,751990,711598,725737,735727,812222,809817,768926.54200000002,803609,760013.51199999999,765770,753026.93500000006,671844.74199999997,750195.36199999996,710651.88399999996,721409.01899999997,720683.723,756095.85100000002,782541.27099999995,767690.82499999995,767833.11400000006,739653.36899999995,753130.62400000007,744881.96700000006,669319.42500000005,737068.90700000001,697548.12699999998,717489.11499999999,726759.29099999997,763437.74400000006,776571.73800000001,762049.72399999993,780705.13500000001,737019.71499999997,757383.60499999998,758288.11800000002,709274.59399999992,743266.42799999996,690431.38899999997,722883.80999999994,726496.47800000012,769400.951,796380.71699999995,762814.12600000005,764785.58000000007,720190.53800000006,728329.85,731547.76699999999,661192.56799999997,713335.7840000001,697674.48,705570.51,685606.64899999998,749903.027,770561.65300000005,723400.34199999995,749228.50699999998,711946.71900000004,723719.14899999998,723540.223,658529.37600000005,708320.02300000004,677097.96299999999,698239.76599999995,689250.424,732854.78300000005,748325.05,749043.79399999999,763158.39399999997,708768.56900000002,722848.005,730846.25100000005,661766.38600000006,715006.56200000003,675105.61100000003,704036.79,685801.11399999994,767801.71100000001,767658.78099999996,749210.31900000002,759770.38100000005,716783.48,735575.054,727389.20799999998,680981.82,721208.39099999995,692068.81400000001,701996.32499999995,709027.30099999998,764775.61699999997,793703.17200000002,750885.473,764223.99,724211.45,746367.30599999998,747834.79,666384.08499999996,739440.27899999998,707735.12300000002,731638.76399999997,732417.90300000005,772478.57299999997,809421.37,761561.59900000005,791780.63899999997,745449.83200000005,752235.56499999994,757647.32200000004,684217.87100000004,737978.58700000006,"-","-","-","-","-","-","-","-","-"]
[null,"Demanda transporte (b.c.)",721656,650635,721949,691546,712537,717191,763237,777997,780276.12,782325,740570,759575,774529,686709,765112,726315,753142,741534,804357,808193,776993,809223,778825,790132,791816,736142,776191,760328,769863,752650,792961,814722,792310,796936,759405,790140,772574,689141,751990,711598,725737,735727,812222,809817,768926.54200000002,803609,760013.51199999999,765770,753026.93500000006,671844.74199999997,750195.36199999996,710651.88399999996,721409.01899999997,720683.723,756095.85100000002,782541.27099999995,767690.82499999995,767833.11400000006,739653.36899999995,753130.62400000007,744881.96700000006,669319.42500000005,737068.90700000001,697548.12699999998,717489.11499999999,726759.29099999997,763437.74400000006,776571.73800000001,762049.72399999993,780705.13500000001,737019.71499999997,757383.60499999998,758288.11800000002,709274.59399999992,743266.42799999996,690431.38899999997,722883.80999999994,726496.47800000012,769400.951,796380.71699999995,762814.12600000005,764785.58000000007,720190.53800000006,728329.85,731547.76699999999,661192.56799999997,713335.7840000001,697674.48,705570.51,685606.64899999998,749903.027,770561.65300000005,723400.34199999995,749228.50699999998,711946.71900000004,723719.14899999998,723540.223,658529.37600000005,708320.02300000004,677097.96299999999,698239.76599999995,689250.424,732854.78300000005,748325.05,749043.79399999999,763158.39399999997,708768.56900000002,722848.005,730846.25100000005,661766.38600000006,715006.56200000003,675105.61100000003,704036.79,685801.11399999994,767801.71100000001,767658.78099999996,749210.31900000002,759770.38100000005,716783.48,735575.054,727389.20799999998,680981.82,721208.39099999995,692068.81400000001,701996.32499999995,709027.30099999998,764775.61699999997,793703.17200000002,750885.473,764223.99,724211.45,746367.30599999998,747834.79,666384.08499999996,739440.27899999998,707735.12300000002,731638.76399999997,732417.90300000005,772478.57299999997,809421.37,761561.59900000005,791780.63899999997,745449.83200000005,752235.56499999994,757647.32200000004,684217.87100000004,737978.58700000006,"-","-","-","-","-","-","-","-","-"]
[]
[null,"Balance eléctrico mensual Ceuta (MWh)","2007-01-01","2007-02-01","2007-03-01","2007-04-01","2007-05-01","2007-06-01","2007-07-01","2007-08-01","2007-09-01","2007-10-01","2007-11-01","2007-12-01","2008-01-01","2008-02-01","2008-03-01","2008-04-01","2008-05-01","2008-06-01","2008-07-01","2008-08-01","2008-09-01","2008-10-01","2008-11-01","2008-12-01","2009-01-01","2009-02-01","2009-03-01","2009-04-01","2009-05-01","2009-06-01","2009-07-01","2009-08-01","2009-09-01","2009-10-01","2009-11-01","2009-12-01","2010-01-01","2010-02-01","2010-03-01","2010-04-01","2010-05-01","2010-06-01","2010-07-01","2010-08-01","2010-09-01","2010-10-01","2010-11-01","2010-12-01","2011-01-01","2011-02-01","2011-03-01","2011-04-01","2011-05-01","2011-06-01","2011-07-01","2011-08-01","2011-09-01","2011-10-01","2011-11-01","2011-12-01","2012-01-01","2012-02-01","2012-03-01","2012-04-01","2012-05-01","2012-06-01","2012-07-01","2012-08-01","2012-09-01","2012-10-01","2012-11-01","2012-12-01","2013-01-01","2013-02-01","2013-03-01","2013-04-01","2013-05-01","2013-06-01","2013-07-01","2013-08-01","2013-09-01","2013-10-01","2013-11-01","2013-12-01","2014-01-01","2014-02-01","2014-03-01","2014-04-01","2014-05-01","2014-06-01","2014-07-01","2014-08-01","2014-09-01","2014-10-01","2014-11-01","2014-12-01","2015-01-01","2015-02-01","2015-03-01","2015-04-01","2015-05-01","2015-06-01","2015-07-01","2015-08-01","2015-09-01","2015-10-01","2015-11-01","2015-12-01","2016-01-01","2016-02-01","2016-03-01","2016-04-01","2016-05-01","2016-06-01","2016-07-01","2016-08-01","2016-09-01","2016-10-01","2016-11-01","2016-12-01","2017-01-01","2017-02-01","2017-03-01","2017-04-01","2017-05-01","2017-06-01","2017-07-01","2017-08-01","2017-09-01","2017-10-01","2017-11-01","2017-12-01","2018-01-01","2018-02-01","2018-03-01","2018-04-01","2018-05-01","2018-06-01","2018-07-01","2018-08-01","2018-09-01","2018-10-01","2018-11-01","2018-12-01"]
[null,"Motores diesel",17987,16069,16710,15678,16366,16225,17421,17411,16812,17279,16847,17839,18351,17181,16737,16313,16713,16662,18076,18122,17406,17168,17471,19471,19477,16819,17213,15436,16246,17311,18716,16715,17948,18184,16095,18156,16835.431,16928.368999999999,17444.607,16234.076999999999,17320.935000000001,17763.089,19394.422999999999,20221.285,18911.028999999999,18433.375,17839.231,17340.393,16727.881000000001,15217.21,16429.356,14974.758,15954.127,17325.873,18625.857,18453.02,16688.655999999999,17719.741999999998,16751.113000000001,17804.328000000001,18519.808000000001,17894.414000000001,17521.669000000002,16664.298999999999,17367.828000000001,17463.541000000001,17737.678,18518.044000000002,17121.613000000001,17633.501,17338.467000000001,17742.492999999999,17871.498,15517.114,15413.289000000001,14540.856,15588.026,15754.197,17866.71,18953.246999999999,17325.048999999999,16943.32,17475.432000000001,18463.232,18803.363000000001,17215.982,17659.373,14795.035,17087.592000000001,17314.243999999999,18277.513999999999,18625.962,18513.111000000001,18195.284,17359.330999999998,18317.776000000002,19053.228999999999,16016.588,16277.81,15464.3,16941.84,16886,19016,18610.287,16586.142,16965.087,15808.663,17089.672999999999,17310.635999999999,16980.969000000001,16401.867999999999,16859.536,16947,16955.065999999999,18292,19186,18115.226999999999,17861.330000000002,17439.016,18263.341,18539.718000000001,15709.319,15827.683000000001,15468.891,16502.376,17164.786,17578.633000000002,18673.096000000001,17051.202000000001,15957.268,16330,17862.035,18543,17094.365000000002,18159.037,"-","-","-","-","-","-","-","-","-"]
[null,"Turbina de gas",0,0,0,0,0,0,0,0,0,0,0,0,0,0,0,0,0,0,0,0,0,0,0,0,0,0,0,0,0,0,159,1859,0,0,1026,209,2043.2850000000001,554.101,0,147.30500000000001,121.071,0,0,0,0,0,0,3.105,26.117999999999999,31.277000000000001,0,0,171.80099999999999,31.510999999999999,20.882000000000001,0.93100000000000005,0,3.8050000000000002,6.5309999999999997,8.1189999999999998,0,140.90799999999999,107.63500000000001,9.984,132.47800000000001,24.65,16.8,38.817999999999998,2.2269999999999999,55.817999999999998,19.222999999999999,0,34.442,39.906999999999996,0.03,31.384,112.964,8.6,0,0,0,0,10.622999999999999,10.144,2.427,0,76.222999999999999,0,0.24299999999999999,0.21,0,0.216,0.24299999999999999,0.29399999999999998,9.2989999999999995,0,0.16200000000000001,220,-0.16,0.25,65,9,139,0.93300000000000005,0.48799999999999999,0,289.024,0.28399999999999997,0.51500000000000001,0.64100000000000001,0.5,0.41199999999999998,0.504,0.17899999999999999,0.60299999999999998,0.52300000000000002,92.182000000000002,3.8860000000000001,15.701000000000001,0.51200000000000001,0.35199999999999998,14.589,0.41499999999999998,0.55500000000000005,0.54500000000000004,5.6769999999999996,3.3690000000000002,0.40200000000000002,125.71599999999999,7.3360000000000003,41.603999999999999,0,0.52300000000000002,5.0030000000000001,1.367,"-","-","-","-","-","-","-","-","-"]
[null,"Fuel + Gas",17987,16069,16710,15678,16366,16225,17421,17411,16812,17279,16847,17839,18351,17181,16737,16313,16713,16662,18076,18122,17406,17168,17471,19471,19477,16819,17213,15436,16246,17311,18875,18574,17948,18184,17121,18365,18878.716,17482.469999999998,17444.607,16381.382,17442.006000000001,17763.089,19394.422999999999,20221.285,18911.028999999999,18433.375,17839.231,17343.498,16753.999,15248.486999999999,16429.356,14974.758,16125.928,17357.383999999998,18646.739000000001,18453.951000000001,16688.655999999999,17723.546999999999,16757.644,17812.447,18519.808000000001,18035.322,17629.304,16674.282999999999,17500.306,17488.191000000003,17754.477999999999,18556.862000000001,17123.84,17689.319,17357.690000000002,17742.492999999999,17905.939999999999,15557.020999999999,15413.319000000001,14572.24,15700.99,15762.797,17866.71,18953.246999999999,17325.048999999999,16943.32,17486.055,18473.376,18805.79,17215.982,17735.596000000001,14795.035,17087.834999999999,17314.453999999998,18277.513999999999,18626.178,18513.353999999999,18195.578000000001,17368.629999999997,18317.776000000002,19053.391,16236.588,16277.65,15464.55,17006.84,16895,19155,18611.22,16586.63,16965.087,16097.687,17089.956999999999,17311.150999999998,16981.61,16402.367999999999,16859.948,16947.504000000001,16955.244999999999,18292.602999999999,19186.523000000001,18207.409,17865.216,17454.717000000001,18263.852999999999,18540.07,15723.907999999999,15828.098000000002,15469.446,16502.920999999998,17170.463,17582.002,18673.498,17176.918000000001,15964.603999999999,16371.603999999999,17862.035,18543.523000000001,17099.368000000002,18160.403999999999,"-","-","-","-","-","-","-","-","-"]
[null,"Régimen ordinario",17987,16069,16710,15678,16366,16225,17421,17411,16812,17279,16847,17839,18351,17181,16737,16313,16713,16662,18076,18122,17406,17168,17471,19471,19477,16819,17213,15436,16246,17311,18875,18574,17948,18184,17121,18365,18878.716,17482.469999999998,17444.607,16381.382,17442.006000000001,17763.089,19394.422999999999,20221.285,18911.028999999999,18433.375,17839.231,17343.498,16753.999,15248.486999999999,16429.356,14974.758,16125.928,17357.383999999998,18646.739000000001,18453.951000000001,16688.655999999999,17723.546999999999,16757.644,17812.447,18519.808000000001,18035.322,17629.304,16674.282999999999,17500.306,17488.191000000003,17754.477999999999,18556.862000000001,17123.84,17689.319,17357.690000000002,17742.492999999999,17905.939999999999,15557.020999999999,15413.319000000001,14572.24,15700.99,15762.797,17866.71,18953.246999999999,17325.048999999999,16943.32,17486.055,18473.376,"-","-","-","-","-","-","-","-","-","-","-","-","-","-","-","-","-","-","-","-","-","-","-","-","-","-","-","-","-","-","-","-","-","-","-","-","-","-","-","-","-","-","-","-","-","-","-","-","-","-","-","-","-","-","-","-","-","-","-","-"]
[null,"Generación",17987,16069,16710,15678,16366,16225,17421,17411,16812,17279,16847,17839,18351,17181,16737,16313,16713,16662,18076,18122,17406,17168,17471,19471,19477,16819,17213,15436,16246,17311,18875,18574,17948,18184,17121,18365,18878.716,17482.469999999998,17444.607,16381.382,17442.006000000001,17763.089,19394.422999999999,20221.285,18911.028999999999,18433.375,17839.231,17343.498,16753.999,15248.486999999999,16429.356,14974.758,16125.928,17357.383999999998,18646.739000000001,18453.951000000001,16688.655999999999,17723.546999999999,16757.644,17812.447,18519.808000000001,18035.322,17629.304,16674.282999999999,17500.306,17488.191000000003,17754.477999999999,18556.862000000001,17123.84,17689.319,17357.690000000002,17742.492999999999,17905.939999999999,15557.020999999999,15413.319000000001,14572.24,15700.99,15762.797,17866.71,18953.246999999999,17325.048999999999,16943.32,17486.055,18473.376,18805.79,17215.982,17735.596000000001,14795.035,17087.834999999999,17314.453999999998,18277.513999999999,18626.178,18513.353999999999,18195.578000000001,17368.629999999997,18317.776000000002,19053.391,16236.588,16277.65,15464.55,17006.84,16895,19155,18611.22,16586.63,16965.087,16097.687,17089.956999999999,17311.151000000002,16981.61,16402.367999999999,16859.948,16947.504000000001,16955.244999999999,18292.602999999999,19186.523000000001,18207.409,17865.216,17454.717000000001,18263.852999999999,18540.07,15723.907999999999,15828.098,15469.446,16502.920999999998,17170.463,17582.002,18673.498,17176.918000000001,15964.603999999999,16371.603999999999,17862.035,18543.523000000001,17099.368000000002,18160.403999999999,"-","-","-","-","-","-","-","-","-"]
[null,"Demanda transporte (b.c.)",17987,16069,16710,15678,16366,16225,17421,17411,16812,17279,16847,17839,18351,17181,16737,16313,16713,16662,18076,18122,17406,17168,17471,19471,19477,16819,17213,15436,16246,17311,18875,18574,17948,18184,17121,18365,18878.716,17482.469999999998,17444.607,16381.382,17442.006000000001,17763.089,19394.422999999999,20221.285,18911.028999999999,18433.375,17839.231,17343.498,16753.999,15248.486999999999,16429.356,14974.758,16125.928,17357.383999999998,18646.739000000001,18453.951000000001,16688.655999999999,17723.546999999999,16757.644,17812.447,18519.808000000001,18035.322,17629.304,16674.282999999999,17500.306,17488.191000000003,17754.477999999999,18556.862000000001,17123.84,17689.319,17357.690000000002,17742.492999999999,17905.939999999999,15557.020999999999,15413.319000000001,14572.24,15700.99,15762.797,17866.71,18953.246999999999,17325.048999999999,16943.32,17486.055,18473.376,18805.79,17215.982,17735.596000000001,14795.035,17087.834999999999,17314.453999999998,18277.513999999999,18626.178,18513.353999999999,18195.578000000001,17368.629999999997,18317.776000000002,19053.391,16236.588,16277.65,15464.55,17006.84,16895,19155,18611.22,16586.63,16965.087,16097.687,17089.956999999999,17311.151000000002,16981.61,16402.367999999999,16859.948,16947.504000000001,16955.244999999999,18292.602999999999,19186.523000000001,18207.409,17865.216,17454.717000000001,18263.852999999999,18540.07,15723.907999999999,15828.098,15469.446,16502.920999999998,17170.463,17582.002,18673.498,17176.918000000001,15964.603999999999,16371.603999999999,17862.035,18543.523000000001,17099.368000000002,18160.403999999999,"-","-","-","-","-","-","-","-","-"]
[]
[null,"Balance eléctrico mensual Melilla (MWh)","2007-01-01","2007-02-01","2007-03-01","2007-04-01","2007-05-01","2007-06-01","2007-07-01","2007-08-01","2007-09-01","2007-10-01","2007-11-01","2007-12-01","2008-01-01","2008-02-01","2008-03-01","2008-04-01","2008-05-01","2008-06-01","2008-07-01","2008-08-01","2008-09-01","2008-10-01","2008-11-01","2008-12-01","2009-01-01","2009-02-01","2009-03-01","2009-04-01","2009-05-01","2009-06-01","2009-07-01","2009-08-01","2009-09-01","2009-10-01","2009-11-01","2009-12-01","2010-01-01","2010-02-01","2010-03-01","2010-04-01","2010-05-01","2010-06-01","2010-07-01","2010-08-01","2010-09-01","2010-10-01","2010-11-01","2010-12-01","2011-01-01","2011-02-01","2011-03-01","2011-04-01","2011-05-01","2011-06-01","2011-07-01","2011-08-01","2011-09-01","2011-10-01","2011-11-01","2011-12-01","2012-01-01","2012-02-01","2012-03-01","2012-04-01","2012-05-01","2012-06-01","2012-07-01","2012-08-01","2012-09-01","2012-10-01","2012-11-01","2012-12-01","2013-01-01","2013-02-01","2013-03-01","2013-04-01","2013-05-01","2013-06-01","2013-07-01","2013-08-01","2013-09-01","2013-10-01","2013-11-01","2013-12-01","2014-01-01","2014-02-01","2014-03-01","2014-04-01","2014-05-01","2014-06-01","2014-07-01","2014-08-01","2014-09-01","2014-10-01","2014-11-01","2014-12-01","2015-01-01","2015-02-01","2015-03-01","2015-04-01","2015-05-01","2015-06-01","2015-07-01","2015-08-01","2015-09-01","2015-10-01","2015-11-01","2015-12-01","2016-01-01","2016-02-01","2016-03-01","2016-04-01","2016-05-01","2016-06-01","2016-07-01","2016-08-01","2016-09-01","2016-10-01","2016-11-01","2016-12-01","2017-01-01","2017-02-01","2017-03-01","2017-04-01","2017-05-01","2017-06-01","2017-07-01","2017-08-01","2017-09-01","2017-10-01","2017-11-01","2017-12-01","2018-01-01","2018-02-01","2018-03-01","2018-04-01","2018-05-01","2018-06-01","2018-07-01","2018-08-01","2018-09-01","2018-10-01","2018-11-01","2018-12-01"]
[null,"Motores diesel",14250,12593,13459,13734.55,15030,15717.05,17790.86,17035.759999999998,16233.4,16172.12,14199,15653,15536,14623,14355,14494,14972,16029,18094,19226,16880,15757,15458,17701,17753,15189,15459,14176,15222,16183,18807,19379,16442,17363,15428,16152,16952.252,15255.491,16387.781999999999,15007.841,15685.419,16778.191999999999,18965.345000000001,20588.25,17840.763999999999,16821.623,16795.423999999999,17639.588,17153.75,15687.581,16335.433000000001,14891.459000000001,16230.351000000001,17378.183000000001,18744.133999999998,20150.581999999999,18022.712,17479.501,16862.537,18360.63,18982.949000000001,18439.042000000001,17598.366000000002,16008.083000000001,17071.491000000002,18279.878000000001,20047.005000000001,20975.616999999998,17694.951000000001,17457.093000000001,15636.494000000001,16659.874,17115.314999999999,15530.096,15812.071,15148.964,16036.971,15760.647999999999,18177.462,19692.631000000001,17663.716,16819.196,16654.163,17052.628000000001,17118.326000000001,15201.501,16103.739,14934.156000000001,15882.369000000001,16465.359,18018.314999999999,19102.751,17938.815999999999,16800.553,16113.986999999999,16483.738000000001,17344.713,16116.182000000001,15853.05,15037.97,15928.74,16467.5,20942,20511.47,17059.901999999998,16541.39,16050.43,16374.786,16091.574000000001,15296.040999999999,15130.281999999999,15195.992,15696.293,16469.571,17928.629000000001,19658.901000000002,17864.674999999999,16595.343000000001,16240.307000000001,16158.705,17669.7,14726.86,15100.528,14749.365,15554.276,17144.972000000002,18838.244999999999,20111.11,16939.069,16546.673999999999,16230.982,16880.162,17107.228999999999,16055.701999999999,17014.526000000002,"-","-","-","-","-","-","-","-","-"]
[null,"Turbina de gas",389,201,257,105.44999999999999,69,0.95,123.13999999999999,231.23999999999998,37.599999999999994,48.879999999999995,484,465,838,433,488,171,45,136,205,76,213,250,217,9,10,11,77,53,2,63,0,61,78,7,126,57,16.721,21.806999999999999,3.2509999999999999,24.138000000000002,34.966000000000001,92.513000000000005,106.417,34.25,37.728999999999999,33.689,53.722999999999999,39.252000000000002,32.543999999999997,2.2170000000000001,6.0549999999999997,42.744,23.423999999999999,34.478000000000002,134.26499999999999,34.911000000000001,9.9920000000000009,126.021,46.3,10.09,4.4249999999999998,0,0,1.526,4.5659999999999998,8.4990000000000006,21.271000000000001,0,70.233000000000004,0,1.829,0,0,0.875,0,0,1.1830000000000001,0.33400000000000002,0.35899999999999999,0,0,67.254999999999995,0,14.781000000000001,3.0590000000000002,44.712000000000003,9.57,0,0,64.411000000000001,29.164999999999999,0,52.308999999999997,92.685000000000002,202,226.292,310,0,49.45,0,0,1.73,124,0.88900000000000001,0,0,99.494,2.2949999999999999,0,0.254,0.52900000000000003,108,12.135,28.161999999999999,58.256,15,16.379000000000001,0,0,2.8180000000000001,0,3.8260000000000001,0.42599999999999999,0,0,0.12,0,0,0,0,9.3729999999999993,59.484000000000002,41.656999999999996,8.0890000000000004,0.51700000000000002,"-","-","-","-","-","-","-","-","-"]
[null,"Fuel + gas",14639,12794,13716,13840,15099,15718,17914,17267,16271,16221,14683,16118,16374,15056,14843,14665,15017,16165,18299,19302,17093,16007,15675,17710,17763,15200,15536,14229,15224,16246,18807,19440,16520,17370,15554,16209,16968.973000000002,15277.298000000001,16391.032999999999,15031.979000000001,15720.385,16870.704999999998,19071.762000000002,20622.5,17878.492999999999,16855.311999999998,16849.147000000001,17678.84,17186.294000000002,15689.798000000001,16341.488000000001,14934.203000000001,16253.775000000001,17412.661,18878.398999999998,20185.492999999999,18032.703999999998,17605.522000000001,16908.837,18370.72,18987.374,18439.042000000001,17598.366000000002,16009.609,17076.057000000001,18288.377,20068.276000000002,20975.616999999998,17765.184000000001,17457.093000000001,15638.323,16659.874,17115.314999999999,15530.971,15812.071,15148.964,16038.154,15760.982,18177.821,19692.631000000001,17663.716,16886.451000000001,16654.163,17067.409,17121.385000000002,15246.213,16113.308999999999,14934.156000000001,15882.369000000001,16529.77,18047.48,19102.751,17991.125,16893.238000000001,16315.986999999999,16710.030000000002,17654.713,16116.182000000001,15902.5,15037.97,15928.74,16469.23,21066,20512.359,17059.901999999998,16541.39,16149.924000000001,16377.081,16091.574000000001,15296.295,15130.811,15303.992,15708.428,16497.733,17986.885000000002,19673.901000000002,17881.054,16595.343000000001,16240.307000000001,16161.522999999999,17669.7,14730.686,15100.954,14749.365,15554.276,17145.092000000001,18838.244999999999,20111.11,16939.069,16546.673999999999,16240.355,16939.646000000001,17148.885999999999,16063.790999999999,17015.043000000001,"-","-","-","-","-","-","-","-","-"]
[null,"Régimen ordinario",14639,12794,13716,13840,15099,15718,17914,17267,16271,16221,14683,16118,16374,15056,14843,14665,15017,16165,18299,19302,17093,16007,15675,17710,17763,15200,15536,14229,15224,16246,18807,19440,16520,17370,15554,16209,16968.973000000002,15277.298000000001,16391.032999999999,15031.979000000001,15720.385,16870.704999999998,19071.762000000002,20622.5,17878.492999999999,16855.311999999998,16849.147000000001,17678.84,17186.294000000002,15689.798000000001,16341.488000000001,14934.203000000001,16253.775000000001,17412.661,18878.398999999998,20185.492999999999,18032.703999999998,17605.522000000001,16908.837,18370.72,18987.374,18439.042000000001,17598.366000000002,16009.609,17076.057000000001,18288.377,20068.276000000002,20975.616999999998,17765.184000000001,17457.093000000001,15638.323,16659.874,17115.314999999999,15530.971,15812.071,15148.964,16038.154,15760.982,18177.821,19692.631000000001,17663.716,16886.451000000001,16654.163,17067.409,"-","-","-","-","-","-","-","-","-","-","-","-","-","-","-","-","-","-","-","-","-","-","-","-","-","-","-","-","-","-","-","-","-","-","-","-","-","-","-","-","-","-","-","-","-","-","-","-","-","-","-","-","-","-","-","-","-","-","-","-"]
[null,"Solar fotovoltaica",0,0,0,0,0,0,0,0,0,0,0,0,1,0,0,0,0,1,1,1,1,0,1,0,8,17,22,28,9,8,8,8,7,6,0,1,1,5,6,7,9,1,8,9,7,6,5,3,4,7,7,7,8,8,7,6,5,5,4,4,5,7,7,9,9,9,9,8,7,6,4,4,5,5,7,7,9,9,8,8,7,7,5,4,4,6,8,9,9,9,9,9,7,7,4,4,5,5,8,6,8,8,9,7,7,6,5,4,4,6,8,9,9,8,7,8,7,5,4,3,4,4,6,7,8,8,8,7,8,7,5,4,4,6,0,"-","-","-","-","-","-","-","-","-"]
[null,"Térmica no renovable/Cogeneración y resto/Cogeneración",747,694,836,656,886,845,733,805,275,611,799,853,937,797,849,810,755,694,0,0,0,0,0,0,819,726,782,888,819,747,783,727,707,1,0,736,699,606,781,808,921,710,772,797,897,486,0,551,929,796,861,747,674,670,765,676,693,209,16,0,0,0,0,63,0,0,0,171,552,47,672,804,781,648,605,726,627,794,679,647,611,893,165,863,878,853,900,784,684,655,775,700,720,789,179,981,0,0,0,0,0,0,0,0,0,0,0,0,0,0,0,0,0,0,0,0,0,0,0,0,0,0,0,0,0,0,0,0,0,0,0,0,0,0,0,"-","-","-","-","-","-","-","-","-"]
[null,"Residuos no renovables","-","-","-","-","-","-","-","-","-","-","-","-","-","-","-","-","-","-","-","-","-","-","-","-","-","-","-","-","-","-","-","-","-","-","-","-","-","-","-","-","-","-","-","-","-","-","-","-","-","-","-","-","-","-","-","-","-","-","-","-","-","-","-","-","-","-","-","-","-","-","-","-","-","-","-","-","-","-","-","-","-","-","-","-","-","-","-","-","-","-","-","-","-","-","-","-",406,384.5,399.5,384.5,399.5,362.5,306,330.5,349.5,424,110.5,438.5,487,413,388,450,371.5,406.5,395,402.5,414.5,504.5,111,506.5,452,426,438,421,450.5,434.5,425.5,341,449,497.5,87.5,555,521,484.5,395.45,"-","-","-","-","-","-","-","-","-"]
[null,"Residuos renovables","-","-","-","-","-","-","-","-","-","-","-","-","-","-","-","-","-","-","-","-","-","-","-","-","-","-","-","-","-","-","-","-","-","-","-","-","-","-","-","-","-","-","-","-","-","-","-","-","-","-","-","-","-","-","-","-","-","-","-","-","-","-","-","-","-","-","-","-","-","-","-","-","-","-","-","-","-","-","-","-","-","-","-","-","-","-","-","-","-","-","-","-","-","-","-","-",406,384.5,399.5,384.5,399.5,362.5,306,330.5,349.5,424,110.5,438.5,487,413,388,450,371.5,406.5,395,402.5,414.5,504.5,111,506.5,452,426,438,421,450.5,434.5,425.5,341,449,497.5,87.5,555,521,484.5,395.45,"-","-","-","-","-","-","-","-","-"]
[null,"Régimen especial",747,694,836,656,886,845,733,805,275,611,799,853,938,797,849,810,755,695,1,1,1,0,1,0,827,743,804,916,828,755,791,735,714,7,0,737,700,611,787,815,930,711,780,806,904,492,5,554,933,803,868,754,682,678,772,682,698,214,20,4,5,7,7,72,9,9,9,179,559,53,676,808,786,653,612,733,636,803,687,655,618,900,170,867,"-","-","-","-","-","-","-","-","-","-","-","-","-","-","-","-","-","-","-","-","-","-","-","-","-","-","-","-","-","-","-","-","-","-","-","-","-","-","-","-","-","-","-","-","-","-","-","-","-","-","-","-","-","-","-","-","-","-","-","-"]
[null,"Generación",15386,13488,14552,14496,15985,16563,18647,18072,16546,16832,15482,16971,17312,15853,15692,15475,15772,16860,18300,19303,17094,16007,15676,17710,18590,15943,16340,15145,16052,17001,19598,20175,17234,17377,15554,16946,17668.973000000002,15888.298000000001,17178.032999999999,15846.978999999999,16650.384999999998,17581.705000000002,19851.761999999999,21428.5,18782.492999999999,17347.312000000002,16854.147000000001,18232.84,18119.294000000002,16492.797999999999,17209.488000000001,15688.203,16935.775000000001,18090.661,19650.399000000001,20867.492999999999,18730.704000000002,17819.522000000001,16928.837,18374.72,18992.374,18446.042000000001,17605.366000000002,16081.609,17085.057000000001,18297.377,20077.276000000002,21154.616999999998,18324.184000000001,17510.093000000001,16314.323,17467.874,17901.314999999999,16183.971,16424.071,15881.964,16674.153999999999,16563.982,18864.821,20347.631000000001,18281.716,17786.451000000001,16824.163,17934.409,18003.384999999998,16105.213,17021.309000000001,15727.156000000001,16575.368999999999,17193.77,18831.48,19811.751,18718.125,17689.238000000001,16498.987000000001,17695.03,18471.713,16890.182000000001,16709.5,15812.97,16735.740000000002,17202.23,21687,21180.359,17765.901999999998,17395.39,16375.924000000001,17258.080999999998,17069.574000000001,16128.295,15914.811,16212.992,16460.428,17318.733,18783.884999999998,20486.901000000002,18717.054,17609.343000000001,16466.307000000001,17177.523000000001,18577.7,15586.686,15982.954,15598.365,16463.276000000002,18022.092000000001,19697.244999999999,20800.11,17845.069,17548.673999999999,16420.355,18053.646000000001,18194.885999999999,17038.791000000001,17805.942999999999,"-","-","-","-","-","-","-","-","-"]
[null,"Demanda transporte (b.c.)",15386,13488,14552,14496,15985,16563,18647,18072,16546,16832,15482,16971,17312,15853,15692,15475,15772,16860,18300,19303,17094,16007,15676,17710,18590,15943,16340,15145,16052,17001,19598,20175,17234,17377,15554,16946,17668.973000000002,15888.298000000001,17178.032999999999,15846.978999999999,16650.384999999998,17581.705000000002,19851.761999999999,21428.5,18782.492999999999,17347.312000000002,16854.147000000001,18232.84,18119.294000000002,16492.797999999999,17209.488000000001,15688.203,16935.775000000001,18090.661,19650.399000000001,20867.492999999999,18730.704000000002,17819.522000000001,16928.837,18374.72,18992.374,18446.042000000001,17605.366000000002,16081.609,17085.057000000001,18297.377,20077.276000000002,21154.616999999998,18324.184000000001,17510.093000000001,16314.323,17467.874,17901.314999999999,16183.971,16424.071,15881.964,16674.153999999999,16563.982,18864.821,20347.631000000001,18281.716,17786.451000000001,16824.163,17934.409,18003.384999999998,16105.213,17021.309000000001,15727.156000000001,16575.368999999999,17193.77,18831.48,19811.751,18718.125,17689.238000000001,16498.987000000001,17695.03,18471.713,16890.182000000001,16709.5,15812.97,16735.740000000002,17202.23,21687,21180.359,17765.901999999998,17395.39,16375.924000000001,17258.080999999998,17069.574000000001,16128.295,15914.811,16212.992,16460.428,17318.733,18783.884999999998,20486.901000000002,18717.054,17609.343000000001,16466.307000000001,17177.523000000001,18577.7,15586.686,15982.954,15598.365,16463.276000000002,18022.092000000001,19697.244999999999,20800.11,17845.069,17548.673999999999,16420.355,18053.646000000001,18194.885999999999,17038.791000000001,17805.942999999999,"-","-","-","-","-","-","-","-","-"]
[]
[null,"Balance eléctrico mensual nacional (GWh)","2007-01-01","2007-02-01","2007-03-01","2007-04-01","2007-05-01","2007-06-01","2007-07-01","2007-08-01","2007-09-01","2007-10-01","2007-11-01","2007-12-01","2008-01-01","2008-02-01","2008-03-01","2008-04-01","2008-05-01","2008-06-01","2008-07-01","2008-08-01","2008-09-01","2008-10-01","2008-11-01","2008-12-01","2009-01-01","2009-02-01","2009-03-01","2009-04-01","2009-05-01","2009-06-01","2009-07-01","2009-08-01","2009-09-01","2009-10-01","2009-11-01","2009-12-01","2010-01-01","2010-02-01","2010-03-01","2010-04-01","2010-05-01","2010-06-01","2010-07-01","2010-08-01","2010-09-01","2010-10-01","2010-11-01","2010-12-01","2011-01-01","2011-02-01","2011-03-01","2011-04-01","2011-05-01","2011-06-01","2011-07-01","2011-08-01","2011-09-01","2011-10-01","2011-11-01","2011-12-01","2012-01-01","2012-02-01","2012-03-01","2012-04-01","2012-05-01","2012-06-01","2012-07-01","2012-08-01","2012-09-01","2012-10-01","2012-11-01","2012-12-01","2013-01-01","2013-02-01","2013-03-01","2013-04-01","2013-05-01","2013-06-01","2013-07-01","2013-08-01","2013-09-01","2013-10-01","2013-11-01","2013-12-01","2014-01-01","2014-02-01","2014-03-01","2014-04-01","2014-05-01","2014-06-01","2014-07-01","2014-08-01","2014-09-01","2014-10-01","2014-11-01","2014-12-01","2015-01-01","2015-02-01","2015-03-01","2015-04-01","2015-05-01","2015-06-01","2015-07-01","2015-08-01","2015-09-01","2015-10-01","2015-11-01","2015-12-01","2016-01-01","2016-02-01","2016-03-01","2016-04-01","2016-05-01","2016-06-01","2016-07-01","2016-08-01","2016-09-01","2016-10-01","2016-11-01","2016-12-01","2017-01-01","2017-02-01","2017-03-01","2017-04-01","2017-05-01","2017-06-01","2017-07-01","2017-08-01","2017-09-01","2017-10-01","2017-11-01","2017-12-01","2018-01-01","2018-02-01","2018-03-01","2018-04-01","2018-05-01","2018-06-01","2018-07-01","2018-08-01","2018-09-01","2018-10-01","2018-11-01","2018-12-01"]
[null,"Hidráulica",{"$f":"GY3+(O45)/1000","v":1920.0478000000003},2539.7347,3412.3603999999996,2337.7021,2328.2846,1896.4941999999999,2152.4522999999999,1514.2806,1189.9214999999999,1525.5493000000001,1152.0925,1010.0581,1052.9718,724.43350000000009,774.5612000000001,2158.8984000000028,2756.8809000000001,2593.9364999999998,1801.4576,1275.0206000000001,1101.1437999999998,904.63950000000011,1192.6748000000002,1959.02,1753.4290999999998,2852.5814999999998,2234.3775999999998,1704.1587,2008.6723999999999,1659.6541999999999,1393.0593999999999,1167.1748,{"$f":"IE3+(AU45)/1000","v":750.34090000000003},1028.1299000000001,1560.9612999999999,2619.7628999999997,4414.2761132999995,3450.7255615999998,5031.7780444,4029.8561307,3174.5390475999998,2946.0881532000003,2437.1694070000003,1695.0818135,1249.4073436999997,1282.6130285000002,2043.8580677,3254.0614768999999,4452.6179633060001,2489.5449081979996,3179.3737100999997,2947.9286343640001,2303.8190585580001,1656.8643463960002,1275.667963936,1226.754154882,987.62639421200004,1058.4860482879999,1728.4718566200004,1735.21487035,1290.8354821600001,892.93011502000013,986.88043857999992,1274.3038001159998,{"$f":"JK3+(CA45)/1000","v":1893.1437641940004},1663.7087523760001,1333.759449704,1069.821452312,836.67316930199979,1119.087479006,1575.4273045339999,2041.313122994,2346.31781026,2863.5976818160002,3778.6305351000001,4543.6187317780004,3031.87805385,2542.564553832,2184.2292828140003,1739.652574466,1523.9424708719998,1522.3665315180001,2278.7143926239996,1931.9919450100001,3475.8993178300002,5004.8099078599998,4483.1102180580001,4171.2361138279994,2211.6758872419996,1958.705239572,1871.228496684,1639.2983342280002,1440.6196519580001,1271.1454530799999,1906.2266791900001,2608.923207674,{"$f":"IFERROR(KQ3+(DG45)/1000,\"-\")","v":2567.1918793640002},3559.704091526,3844.5106837779999,2655.8204394859999,2946.3576280720004,2486.260150308,2054.9406936880005,1635.2812370920003,1601.96407989,1646.8904025439999,1887.9922419959998,1439.095957106,3440.8932849500002,4051.1515185739995,4363.1624379659997,5231.6080089240004,5085.4276365120004,2938.3612728839998,2265.1297052260002,2041.0086219440004,1654.0873034399999,1633.1335515920002,1494.023942218,1844.6384335419998,{"$f":"IFERROR(LO3+(EE45)/1000,\"-\")","v":2043.4255533339997},{"$f":"IFERROR(LP3+(EF45)/1000,\"-\")","v":1953.2214518620001},{"$f":"IFERROR(LQ3+(EG45)/1000,\"-\")","v":2697.1149227359997},{"$f":"IFERROR(LR3+(EH45)/1000,\"-\")","v":1714.658743468},{"$f":"IFERROR(LS3+(EI45)/1000,\"-\")","v":1923.933508156},{"$f":"IFERROR(LT3+(EJ45)/1000,\"-\")","v":1638.2086847759999},{"$f":"IFERROR(LU3+(EK45)/1000,\"-\")","v":1193.3358079520001},{"$f":"IFERROR(LV3+(EL45)/1000,\"-\")","v":1085.5621187339998},{"$f":"IFERROR(LW3+(EM45)/1000,\"-\")","v":1188.5065104380001},{"$f":"IFERROR(LX3+(EN45)/1000,\"-\")","v":828.60692537800003},{"$f":"IFERROR(LY3+(EO45)/1000,\"-\")","v":842.55449153200004},{"$f":"IFERROR(LZ3+(EP45)/1000,\"-\")","v":1254.6534266699998},{"$f":"IFERROR(MA3+(EQ45)/1000,\"-\")","v":2195.4199847860004},2386.6504253499998,{"$f":"IFERROR(MC3+(ES45)/1000,\"-\")","v":4379.9547000000002},{"$f":"IFERROR(MD3+(ET45)/1000,\"-\")","v":"-"},{"$f":"IFERROR(ME3+(EU45)/1000,\"-\")","v":"-"},{"$f":"IFERROR(MF3+(EV45)/1000,\"-\")","v":"-"},{"$f":"IFERROR(MG3+(EW45)/1000,\"-\")","v":"-"},{"$f":"IFERROR(MH3+(EX45)/1000,\"-\")","v":"-"},{"$f":"IFERROR(MI3+(EY45)/1000,\"-\")","v":"-"},{"$f":"IFERROR(MJ3+(EZ45)/1000,\"-\")","v":"-"},{"$f":"IFERROR(MK3+(FA45)/1000,\"-\")","v":"-"},{"$f":"IFERROR(ML3+(FB45)/1000,\"-\")","v":"-"}]
[null,"Turbinación bombeo",{"$f":"IFERROR(GY4,\"-\")","v":260.2432},{"$f":"IFERROR(GZ4,\"-\")","v":277.11529999999999},{"$f":"IFERROR(HA4,\"-\")","v":268.91759999999999},{"$f":"IFERROR(HB4,\"-\")","v":205.37789999999998},{"$f":"IFERROR(HC4,\"-\")","v":278.33539999999999},{"$f":"IFERROR(HD4,\"-\")","v":249.37780000000001},{"$f":"IFERROR(HE4,\"-\")","v":233.46469999999999},{"$f":"IFERROR(HF4,\"-\")","v":259.9674},{"$f":"IFERROR(HG4,\"-\")","v":242.14749999999998},{"$f":"IFERROR(HH4,\"-\")","v":221.90069999999997},{"$f":"IFERROR(HI4,\"-\")","v":268.90849999999995},{"$f":"IFERROR(HJ4,\"-\")","v":336.8449},{"$f":"IFERROR(HK4,\"-\")","v":301.58519999999999},{"$f":"IFERROR(HL4,\"-\")","v":293.51349999999996},{"$f":"IFERROR(HM4,\"-\")","v":281.25579999999997},{"$f":"IFERROR(HN4,\"-\")","v":153.34059999999999},{"$f":"IFERROR(HO4,\"-\")","v":144.25110000000001},{"$f":"IFERROR(HP4,\"-\")","v":199.67849999999999},{"$f":"IFERROR(HQ4,\"-\")","v":177.6474},{"$f":"IFERROR(HR4,\"-\")","v":133.56139999999999},{"$f":"IFERROR(HS4,\"-\")","v":158.58920000000001},{"$f":"IFERROR(HT4,\"-\")","v":208.00149999999996},{"$f":"IFERROR(HU4,\"-\")","v":287.87919999999997},{"$f":"IFERROR(HV4,\"-\")","v":322.44799999999998},{"$f":"IFERROR(HW4,\"-\")","v":344.55889999999994},{"$f":"IFERROR(HX4,\"-\")","v":274.42450000000002},{"$f":"IFERROR(HY4,\"-\")","v":197.03039999999999},{"$f":"IFERROR(HZ4,\"-\")","v":179.03129999999999},{"$f":"IFERROR(IA4,\"-\")","v":173.24859999999998},{"$f":"IFERROR(IB4,\"-\")","v":157.21579999999997},{"$f":"IFERROR(IC4,\"-\")","v":168.71259999999998},{"$f":"IFERROR(ID4,\"-\")","v":171.5042},{"$f":"IFERROR(IE4,\"-\")","v":178.14509999999999},{"$f":"IFERROR(IF4,\"-\")","v":198.88609999999997},{"$f":"IFERROR(IG4,\"-\")","v":278.25069999999994},{"$f":"IFERROR(IH4,\"-\")","v":334.92410000000001},{"$f":"IFERROR(II4,\"-\")","v":529.60983670000007},{"$f":"IFERROR(IJ4,\"-\")","v":388.30555539999995},{"$f":"IFERROR(IK4,\"-\")","v":381.26509259999995},{"$f":"IFERROR(IL4,\"-\")","v":212.21241929999999},{"$f":"IFERROR(IM4,\"-\")","v":195.96443439999999},{"$f":"IFERROR(IN4,\"-\")","v":161.10858679999998},{"$f":"IFERROR(IO4,\"-\")","v":139.41769099999999},{"$f":"IFERROR(IP4,\"-\")","v":161.80076849999998},{"$f":"IFERROR(IQ4,\"-\")","v":163.58696829999997},{"$f":"IFERROR(IR4,\"-\")","v":242.28118949999995},{"$f":"IFERROR(IS4,\"-\")","v":225.55656829999995},{"$f":"IFERROR(IT4,\"-\")","v":319.33869309999994},{"$f":"IFERROR(IU4,\"-\")","v":283.94490769399999},{"$f":"IFERROR(IV4,\"-\")","v":172.14437780200001},{"$f":"IFERROR(IW4,\"-\")","v":234.3481209},{"$f":"IFERROR(IX4,\"-\")","v":201.526885636},{"$f":"IFERROR(IY4,\"-\")","v":111.13141044199999},{"$f":"IFERROR(IZ4,\"-\")","v":97.401727604000001},{"$f":"IFERROR(JA4,\"-\")","v":102.43908606400001},{"$f":"IFERROR(JB4,\"-\")","v":120.019735118},{"$f":"IFERROR(JC4,\"-\")","v":138.437161788},{"$f":"IFERROR(JD4,\"-\")","v":216.20731071200001},{"$f":"IFERROR(JE4,\"-\")","v":224.26137738},{"$f":"IFERROR(JF4,\"-\")","v":281.67412965},{"$f":"IFERROR(JG4,\"-\")","v":318.69145184000001},{"$f":"IFERROR(JH4,\"-\")","v":266.29888497999997},{"$f":"IFERROR(JI4,\"-\")","v":265.75549541999999},{"$f":"IFERROR(JJ4,\"-\")","v":307.58115988400004},{"$f":"IFERROR(JK4,\"-\")","v":223.421483806},{"$f":"IFERROR(JL4,\"-\")","v":199.61285362400002},{"$f":"IFERROR(JM4,\"-\")","v":195.82272629600001},{"$f":"IFERROR(JN4,\"-\")","v":256.54768168800001},{"$f":"IFERROR(JO4,\"-\")","v":270.24170669800003},{"$f":"IFERROR(JP4,\"-\")","v":283.98781499400002},{"$f":"IFERROR(JQ4,\"-\")","v":276.84362946600004},{"$f":"IFERROR(JR4,\"-\")","v":337.08485500600005},{"$f":"IFERROR(JS4,\"-\")","v":372.34012374000002},{"$f":"IFERROR(JT4,\"-\")","v":342.600296184},{"$f":"IFERROR(JU4,\"-\")","v":457.14945289999997},{"$f":"IFERROR(JV4,\"-\")","v":370.51571222199999},{"$f":"IFERROR(JW4,\"-\")","v":251.14840015000001},{"$f":"IFERROR(JX4,\"-\")","v":216.49426816800002},{"$f":"IFERROR(JY4,\"-\")","v":175.260815186},{"$f":"IFERROR(JZ4,\"-\")","v":163.016439534},{"$f":"IFERROR(KA4,\"-\")","v":139.951745128},{"$f":"IFERROR(KB4,\"-\")","v":216.268290482},{"$f":"IFERROR(KC4,\"-\")","v":246.284607376},{"$f":"IFERROR(KD4,\"-\")","v":338.64703298999996},{"$f":"IFERROR(KE4,\"-\")","v":443.67862617000003},{"$f":"IFERROR(KF4,\"-\")","v":369.22198314000002},{"$f":"IFERROR(KG4,\"-\")","v":354.77524994200002},{"$f":"IFERROR(KH4,\"-\")","v":361.18861317199998},{"$f":"IFERROR(KI4,\"-\")","v":275.95647575800001},{"$f":"IFERROR(KJ4,\"-\")","v":207.70265442800002},{"$f":"IFERROR(KK4,\"-\")","v":170.77235531599999},{"$f":"IFERROR(KL4,\"-\")","v":151.65694177199998},{"$f":"IFERROR(KM4,\"-\")","v":160.19068604199998},{"$f":"IFERROR(KN4,\"-\")","v":267.50232792000003},{"$f":"IFERROR(KO4,\"-\")","v":326.90832081000002},{"$f":"IFERROR(KP4,\"-\")","v":326.44179232599998},{"$f":"IFERROR(KQ4,\"-\")","v":319.02103063599998},{"$f":"IFERROR(KR4,\"-\")","v":291.33964547400001},{"$f":"IFERROR(KS4,\"-\")","v":327.144737222},{"$f":"IFERROR(KT4,\"-\")","v":255.86272351400001},{"$f":"IFERROR(KU4,\"-\")","v":242.84147692799999},{"$f":"IFERROR(KV4,\"-\")","v":125.366838692},{"$f":"IFERROR(KW4,\"-\")","v":110.974045312},{"$f":"IFERROR(KX4,\"-\")","v":202.46425890799998},{"$f":"IFERROR(KY4,\"-\")","v":162.10553811},{"$f":"IFERROR(KZ4,\"-\")","v":249.57726645600002},{"$f":"IFERROR(LA4,\"-\")","v":276.57492800400001},{"$f":"IFERROR(LB4,\"-\")","v":332.09329889399999},{"$f":"IFERROR(LC4,\"-\")","v":454.98487605000003},{"$f":"IFERROR(LD4,\"-\")","v":434.36759242599999},{"$f":"IFERROR(LE4,\"-\")","v":351.10246903400002},{"$f":"IFERROR(LF4,\"-\")","v":429.29966807599999},{"$f":"IFERROR(LG4,\"-\")","v":316.01911348800002},{"$f":"IFERROR(LH4,\"-\")","v":169.55252211600001},{"$f":"IFERROR(LI4,\"-\")","v":96.849533773999994},{"$f":"IFERROR(LJ4,\"-\")","v":110.35765205600001},{"$f":"IFERROR(LK4,\"-\")","v":101.23997756},{"$f":"IFERROR(LL4,\"-\")","v":161.43736240799998},{"$f":"IFERROR(LM4,\"-\")","v":258.23356678200003},{"$f":"IFERROR(LN4,\"-\")","v":250.884576458},{"$f":"IFERROR(LO4,\"-\")","v":291.21301766599998},{"$f":"IFERROR(LP4,\"-\")","v":267.73958013800001},{"$f":"IFERROR(LQ4,\"-\")","v":241.22357426400001},{"$f":"IFERROR(LR4,\"-\")","v":199.433449532},{"$f":"IFERROR(LS4,\"-\")","v":162.454982844},{"$f":"IFERROR(LT4,\"-\")","v":91.897749223999995},{"$f":"IFERROR(LU4,\"-\")","v":98.826694048000007},{"$f":"IFERROR(LV4,\"-\")","v":112.205176266},{"$f":"IFERROR(LW4,\"-\")","v":118.523846562},{"$f":"IFERROR(LX4,\"-\")","v":133.817345622},{"$f":"IFERROR(LY4,\"-\")","v":222.08938846799998},{"$f":"IFERROR(LZ4,\"-\")","v":309.56905333000003},{"$f":"IFERROR(MA4,\"-\")","v":273.43523521399999},180.62302364999999,{"$f":"IFERROR(MC4,\"-\")","v":283.77729999999997},{"$f":"IFERROR(MD4,\"-\")","v":"-"},{"$f":"IFERROR(ME4,\"-\")","v":"-"},{"$f":"IFERROR(MF4,\"-\")","v":"-"},{"$f":"IFERROR(MG4,\"-\")","v":"-"},{"$f":"IFERROR(MH4,\"-\")","v":"-"},{"$f":"IFERROR(MI4,\"-\")","v":"-"},{"$f":"IFERROR(MJ4,\"-\")","v":"-"},{"$f":"IFERROR(MK4,\"-\")","v":"-"},{"$f":"IFERROR(ML4,\"-\")","v":"-"}]
[null,"Nuclear",{"$f":"GY5","v":5319.1580000000004},4778.3050000000003,4947.4629999999997,4342.93,3485.058,3161.45,3855.7460000000001,3976.62,4877.2839999999997,4891.0659999999998,3934.346,5069.5010000000002,5322.9409999999998,5119.9319999999998,5354.7060000000001,4039.7550000000001,4689.7039999999997,4579.7330000000002,4541.0349999999999,5013.9489999999996,4482.3890000000001,4314.4620000000004,4045.8270000000002,4955.8580000000002,5438.39,4335.1400000000003,3949.223,4063.489,3687.607,3530.33,3998.25,5278.1620000000003,{"$f":"IE5","v":4387.8469999999998},3957.8240000000001,3973.4949999999999,3949.6880000000001,4480.6099999999997,4635.9830000000002,4877.9646469999998,4894.268,4417.8689999999997,4693.97,5399.9840000000004,5421.2550000000001,5066.8190000000004,5429.7690000000002,5094.6189999999997,4829.2110000000002,4718.777,4271.59,4332.2643109999999,4457.3370000000004,3640.74,4702.2290000000003,4823.0249999999996,5271.61,4983.1229999999996,4499.7290000000003,4546.8770000000004,4856.63,5171.7839999999997,5146.0450000000001,5472.3729999999996,5200.7150000000001,{"$f":"JK5","v":4487.326},3504.3710000000001,5098.692,5457.9219999999996,5300.0649999999996,5396.02,4070.386,4361.2879999999996,4582.8119999999999,4425.6019999999999,5210.3209999999999,4458.8410000000003,3995.2890000000002,4334.933,5136.4780000000001,5025.3630000000003,4740.6139999999996,4342.4009999999998,4067.681,3986.5520000000001,4535.384,4723.7730000000001,5288.5060000000003,5057.6959999999999,4341.3779999999997,3439.377,4262.5479999999998,4221.3969999999999,4806.0709999999999,5129.5820000000003,4369.2830000000004,4695.2439999999997,{"$f":"IFERROR(KQ5,\"-\")","v":5242.7219999999998},4720.8609999999999,5205.7860000000001,4690.1409999999996,3554.4010480000002,3771.7689999999998,4798.9250000000002,4963.9790000000003,4873.9170000000004,4095.259,3973.4929999999999,4863.5860000000002,4615.6859999999997,3973.2069999999999,5191.7529999999997,5055.57,3891.866,4819.2470000000003,5178.0649999999996,5151.8209999999999,5009.8950000000004,5096.1009999999997,3774.5970000000002,4341.1639999999998,{"$f":"IFERROR(LO5,\"-\")","v":5285.3739999999998},{"$f":"IFERROR(LP5,\"-\")","v":4768.268},{"$f":"IFERROR(LQ5,\"-\")","v":5270.7340000000004},{"$f":"IFERROR(LR5,\"-\")","v":4928.7539999999999},{"$f":"IFERROR(LS5,\"-\")","v":4143.7839999999997},{"$f":"IFERROR(LT5,\"-\")","v":4049.538},{"$f":"IFERROR(LU5,\"-\")","v":4393.4089999999997},{"$f":"IFERROR(LV5,\"-\")","v":5080.2929999999997},{"$f":"IFERROR(LW5,\"-\")","v":4725.6310000000003},{"$f":"IFERROR(LX5,\"-\")","v":4310.2259999999997},{"$f":"IFERROR(LY5,\"-\")","v":3615.6709999999998},{"$f":"IFERROR(LZ5,\"-\")","v":5037.24},{"$f":"IFERROR(MA5,\"-\")","v":5098.7070000000003},4594.5630000000001,{"$f":"IFERROR(MC5,\"-\")","v":4486.4690999999993},{"$f":"IFERROR(MD5,\"-\")","v":"-"},{"$f":"IFERROR(ME5,\"-\")","v":"-"},{"$f":"IFERROR(MF5,\"-\")","v":"-"},{"$f":"IFERROR(MG5,\"-\")","v":"-"},{"$f":"IFERROR(MH5,\"-\")","v":"-"},{"$f":"IFERROR(MI5,\"-\")","v":"-"},{"$f":"IFERROR(MJ5,\"-\")","v":"-"},{"$f":"IFERROR(MK5,\"-\")","v":"-"},{"$f":"IFERROR(ML5,\"-\")","v":"-"}]
[null,"Carbón",{"$f":"GY6+(O26)/1000","v":6355.9290000000001},5122.8689999999997,5084.009,6098.4139999999998,6219.9310000000005,5996.3879999999999,6220.3989999999994,6178.9250000000002,5753.5960000000005,5577.9750000000004,5687.9780000000001,6333.69,5268.5780000000004,4867.5980000000009,3927.5260000000003,3323.2709999999997,2421.4650000000001,2321.1170000000002,3976.9629999999997,3367.8240000000001,3731.902,4344.1439999999993,4316.3040000000001,4641.6710000000003,4771.5609999999997,3283.0160000000001,3194.9989999999998,2027.452,2501.1990000000001,2745.4129999999996,3511.5260000000003,2102.6730000000002,{"$f":"IE6+(AU26)/1000","v":2949.413},3336.002,2251.8330000000001,2117.9380000000001,1984.722964,1620.4064370000001,1128.3404140000002,904.4831099999999,1053.230108,1601.6091620000002,2742.5060000000003,3122.487928,3256.4198250000004,2204.4321009999999,1819.434667,2262.5406840000001,2317.9490940000001,2688.5375240000003,3114.9868590000001,2636.293561,3202.2224959999999,2982.2018439999997,4478.8947290000006,4355.3382540000002,4935.4912349999995,4481.8416289999996,4047.311404,4025.6256289999997,5420.7886419999995,5503.6138369999999,4674.8311439999998,2723.9471229999999,{"$f":"JK6+(CA26)/1000","v":4013.7438219999999},5305.8050000000003,4946.9890000000005,5091.3140000000003,4045.915,4244.0140369999999,4076.3720000000003,3766.0839999999998,3069.549,2589.366,1444.32,1079.71,2089.6330000000003,2664.9409999999998,5473.6450000000004,4622.5050000000001,4769.3790000000008,4201.7021700000005,2679.560602,4843.2529999999997,2299.6970000000001,906.38099999999997,1309.4750000000001,1396.712,3372.1858039999997,5214.5529999999999,5612.7840000000006,5291.3990000000003,5911.97,4547.2020000000002,3234.9090000000001,4223.0349999999999,{"$f":"IFERROR(KQ6+(DG26)/1000,\"-\")","v":5080.8930799999998},3113.2180399999997,2764.9660000000003,3026.5721089999997,2957.1604540000003,5516.3035399999999,6282.2818219999999,5453.0897719999994,4797.4280559999997,4387.6389789999994,4681.7661900000003,4727.7226219999993,2676.173241,1906.2928549999999,1795.6659729999999,1055.057986,1233.321087,2278.8534719999998,3945.654931,3663.8701080000001,4561.0403310000002,4508.0514950000006,4638.0322109999997,5229.2586120000005,{"$f":"IFERROR(LO6+(EE26)/1000,\"-\")","v":5387.1972139999998},{"$f":"IFERROR(LP6+(EF26)/1000,\"-\")","v":3516.0253990000001},{"$f":"IFERROR(LQ6+(EG26)/1000,\"-\")","v":1969.1444119999999},{"$f":"IFERROR(LR6+(EH26)/1000,\"-\")","v":2091.3300790000003},{"$f":"IFERROR(LS6+(EI26)/1000,\"-\")","v":3763.7099760000001},{"$f":"IFERROR(LT6+(EJ26)/1000,\"-\")","v":4558.488824},{"$f":"IFERROR(LU6+(EK26)/1000,\"-\")","v":4313.7476999999999},{"$f":"IFERROR(LV6+(EL26)/1000,\"-\")","v":3241.8860490000002},{"$f":"IFERROR(LW6+(EM26)/1000,\"-\")","v":3073.6484880000003},{"$f":"IFERROR(LX6+(EN26)/1000,\"-\")","v":4107.6899059999996},{"$f":"IFERROR(LY6+(EO26)/1000,\"-\")","v":4827.6671139999999},{"$f":"IFERROR(LZ6+(EP26)/1000,\"-\")","v":4345.7332610000003},{"$f":"IFERROR(MA6+(EQ26)/1000,\"-\")","v":3240.0929860000001},3693.5238909999998,{"$f":"IFERROR(MC6+(ES26)/1000,\"-\")","v":1520.622408},{"$f":"IFERROR(MD6+(ET26)/1000,\"-\")","v":"-"},{"$f":"IFERROR(ME6+(EU26)/1000,\"-\")","v":"-"},{"$f":"IFERROR(MF6+(EV26)/1000,\"-\")","v":"-"},{"$f":"IFERROR(MG6+(EW26)/1000,\"-\")","v":"-"},{"$f":"IFERROR(MH6+(EX26)/1000,\"-\")","v":"-"},{"$f":"IFERROR(MI6+(EY26)/1000,\"-\")","v":"-"},{"$f":"IFERROR(MJ6+(EZ26)/1000,\"-\")","v":"-"},{"$f":"IFERROR(MK6+(FA26)/1000,\"-\")","v":"-"},{"$f":"IFERROR(ML6+(FB26)/1000,\"-\")","v":"-"}]
[null,"Fuel + Gas",{"$f":"GY7+SUM(O29,O31,O49,O51,C66,C74)/1000","v":768.6},809.29600000000005,838.596,760.79700000000003,775.88300000000004,747.34100000000001,950.17899999999997,946.66399999999999,919.39,799.77,841.274,830.67499999999995,829.66100000000006,776.97799999999995,690.65699999999993,738.39300000000003,796.62799999999993,853.54200000000003,852.61299999999994,943.85699999999997,880.45299999999997,850.27800000000002,839.86,834.64599999999996,768.62099999999998,673.43399999999997,795.63,680.08900000000006,729.07300000000009,778.62199999999996,889.54100000000005,870.26300000000003,{"$f":"IE7+SUM(AU29,AU31,AU49,AU51,AI66,AI74)/1000","v":821.12954200000001},758.47799999999995,740.34751200000005,771.07600000000002,769.16592200000014,680.88749999999982,622.58834999999999,645.15955300000007,743.36511300000006,767.24708999999996,791.55072799999994,801.00316300000009,775.18720799999994,725.47373100000004,741.36895700000014,758.76250100000016,594.46196099999997,548.13641900000005,628.73061000000007,550.15159600000004,557.56008599999984,542.76850400000001,647.65554300000008,646.04798199999993,617.66063399999996,597.759548,529.63905899999986,563.86776599999996,595.02567899999985,558.84153600000013,581.4469160000001,539.54576300000008,{"$f":"JK7+SUM(CA29,CA31,CA49,CA51,BO66,BO74)/1000","v":552.35293499999989},588.50467299999991,639.53546399999993,690.0367839999999,609.933943,604.058763,565.98287499999992,572.94640199999992,532.66472899999997,506.30962900000003,545.41229299999998,508.11154999999997,519.77221799999995,501.987346,602.74917900000003,626.30885999999998,562.466453,572.35046799999998,533.84648600000003,561.82555000000002,547.60081200000002,488.23519400000004,469.5920680000001,459.03594500000003,476.65172900000005,526.14371499999993,571.8504989999999,590.03464600000007,570.07531000000006,527.43748799999992,484.29922300000004,545.77096299999994,{"$f":"IFERROR(KQ7+SUM(DG29,DG31,DG49,DG51,CU66,CU74)/1000,\"-\")","v":543.26087299999995},491.748515,513.332629,474.64373399999999,512.16199800000004,541.06126199999994,631.12966299999994,638.96411599999999,609.24020499999995,513.03766000000007,471.43111900000002,556.63920300000007,558.98156400000005,515.02531699999997,549.77587699999992,508.834249,511.64875999999998,554.64312699999994,627.29600199999993,672.29103299999997,608.87011400000006,576.0359840000001,499.50138099999992,581.64503200000001,{"$f":"IFERROR(LO7+SUM(EE29,EE31,EE49,EE51,DS66,DS74)/1000,\"-\")","v":564.00679699999989},{"$f":"IFERROR(LP7+SUM(EF29,EF31,EF49,EF51,DT66,DT74)/1000,\"-\")","v":499.08204199999994},{"$f":"IFERROR(LQ7+SUM(EG29,EG31,EG49,EG51,DU66,DU74)/1000,\"-\")","v":539.15624100000002},{"$f":"IFERROR(LR7+SUM(EH29,EH31,EH49,EH51,DV66,DV74)/1000,\"-\")","v":558.70332700000006},{"$f":"IFERROR(LS7+SUM(EI29,EI31,EI49,EI51,DW66,DW74)/1000,\"-\")","v":573.52507600000001},{"$f":"IFERROR(LT7+SUM(EJ29,EJ31,EJ49,EJ51,DX66,DX74)/1000,\"-\")","v":618.8777},{"$f":"IFERROR(LU7+SUM(EK29,EK31,EK49,EK51,DY66,DY74)/1000,\"-\")","v":663.3458159999999},{"$f":"IFERROR(LV7+SUM(EL29,EL31,EL49,EL51,DZ66,DZ74)/1000,\"-\")","v":683.98383700000011},{"$f":"IFERROR(LW7+SUM(EM29,EM31,EM49,EM51,EA66,EA74)/1000,\"-\")","v":604.86058100000002},{"$f":"IFERROR(LX7+SUM(EN29,EN31,EN49,EN51,EB66,EB74)/1000,\"-\")","v":594.67674600000009},{"$f":"IFERROR(LY7+SUM(EO29,EO31,EO49,EO51,EC66,EC74)/1000,\"-\")","v":541.16824400000007},{"$f":"IFERROR(LZ7+SUM(EP29,EP31,EP49,EP51,ED66,ED74)/1000,\"-\")","v":569.68291799999997},{"$f":"IFERROR(MA7+SUM(EQ29,EQ31,EQ49,EQ51,EE66,EE74)/1000,\"-\")","v":573.4582620000001},533.37623299999996,{"$f":"IFERROR(MC7+SUM(ES29,ES31,ES49,ES51,EG66,EG74)/1000,\"-\")","v":528.17185099999995},{"$f":"IFERROR(MD7+SUM(ET29,ET31,ET49,ET51,EH66,EH74)/1000,\"-\")","v":"-"},{"$f":"IFERROR(ME7+SUM(EU29,EU31,EU49,EU51,EI66,EI74)/1000,\"-\")","v":"-"},{"$f":"IFERROR(MF7+SUM(EV29,EV31,EV49,EV51,EJ66,EJ74)/1000,\"-\")","v":"-"},{"$f":"IFERROR(MG7+SUM(EW29,EW31,EW49,EW51,EK66,EK74)/1000,\"-\")","v":"-"},{"$f":"IFERROR(MH7+SUM(EX29,EX31,EX49,EX51,EL66,EL74)/1000,\"-\")","v":"-"},{"$f":"IFERROR(MI7+SUM(EY29,EY31,EY49,EY51,EM66,EM74)/1000,\"-\")","v":"-"},{"$f":"IFERROR(MJ7+SUM(EZ29,EZ31,EZ49,EZ51,EN66,EN74)/1000,\"-\")","v":"-"},{"$f":"IFERROR(MK7+SUM(FA29,FA31,FA49,FA51,EO66,EO74)/1000,\"-\")","v":"-"},{"$f":"IFERROR(ML7+SUM(FB29,FB31,FB49,FB51,EP66,EP74)/1000,\"-\")","v":"-"}]
[null,"Ciclo combinado",{"$f":"GY8+SUM(O30,O50)/1000","v":6359.7610000000004},4080.7000000000003,4156.2129999999997,4273.4560000000001,4686.4580000000005,6528.933,6999.7269999999999,5503.9960000000001,5974.326,6466.7110000000002,7970.268,7599.5889999999999,8292.021999999999,8254.7870000000003,7091.7349999999997,7235.1049999999996,7505.3360000000002,7943.0940000000001,9260.9190000000017,8622.5419999999995,8167.759,7543.9189999999999,7156.8680000000004,6123.4529999999995,6394.8369999999995,4731.2190000000001,5388.1019999999999,5722.3029999999999,5822.0680000000002,7920.2789999999995,8907.5990000000002,8556.3119999999999,{"$f":"IE8+SUM(AU30,AU50)/1000","v":7707.5259999999998},6844.3010000000004,5793.1239999999998,6436.125,5621.9420650000002,5052.5037549999997,4384.9885919999997,4612.7417769999993,4834.0750719999996,5727.7229470000002,7160.3432119999998,6106.9485729999997,6544.5626990000001,5651.8631519999999,5881.4311129999996,5219.8611950000004,5357.8028379999996,4918.2779559999999,4328.05987,3079.8573809999998,4480.5739949999997,5207.2115969999995,4853.8780049999996,5091.4672199999995,4843.1770889999998,4096.5522579999997,3732.806521,3667.6058979999998,4550.816683,4236.0278829999997,3352.2137270000003,2485.3611889999997,{"$f":"JK8+SUM(CA30,CA50)/1000","v":2702.1673509999996},3418.6407119999999,3694.776656,3827.2448949999998,3194.7783510000004,3541.4010209999997,3221.146659,3075.423538,2923.0959130000001,2233.4364020000003,1783.2560400000002,1390.2393050000001,1923.9943190000001,1640.0760009999999,2520.2975040000001,2665.8331080000003,2506.6999999999998,2852.639095,2316.1537779999999,3071.1162589999999,1833.13393,1541.5453049999999,1616.1849179999999,1520.9307210000002,1736.4137759999999,2041.9860920000001,2149.1419169999999,2511.653084,2994.6609210000001,2526.5715639999999,2309.4357760000003,2293.4695470000001,{"$f":"IFERROR(KQ8+SUM(DG30,DG50)/1000,\"-\")","v":2521.0563010000001},1980.7948249999999,1918.4897619999999,2039.256764,1964.8185550000001,2169.9870989999999,3743.5810409999999,2621.2569169999997,2296.6953170000002,2556.0560369999998,2481.0695129999999,2997.6873089999999,2218.4708339999997,1638.7677440000002,1687.892951,1470.6548319999999,1789.8288790000001,2142.6925230000002,2638.6672639999997,2295.6537960000001,2410.8169469999998,3612.8551219999999,3771.2423739999999,3582.8581290000002,{"$f":"IFERROR(LO8+SUM(EE30,EE50)/1000,\"-\")","v":3252.498748},{"$f":"IFERROR(LP8+SUM(EF30,EF50)/1000,\"-\")","v":1797.2865979999999},{"$f":"IFERROR(LQ8+SUM(EG30,EG50)/1000,\"-\")","v":1732.604155},{"$f":"IFERROR(LR8+SUM(EH30,EH50)/1000,\"-\")","v":1504.427803},{"$f":"IFERROR(LS8+SUM(EI30,EI50)/1000,\"-\")","v":1900.330762},{"$f":"IFERROR(LT8+SUM(EJ30,EJ50)/1000,\"-\")","v":3402.6607940000004},{"$f":"IFERROR(LU8+SUM(EK30,EK50)/1000,\"-\")","v":3979.0981430000002},{"$f":"IFERROR(LV8+SUM(EL30,EL50)/1000,\"-\")","v":3797.681881},{"$f":"IFERROR(LW8+SUM(EM30,EM50)/1000,\"-\")","v":3465.220902},{"$f":"IFERROR(LX8+SUM(EN30,EN50)/1000,\"-\")","v":4204.4185219999999},{"$f":"IFERROR(LY8+SUM(EO30,EO50)/1000,\"-\")","v":4912.2516849999993},{"$f":"IFERROR(LZ8+SUM(EP30,EP50)/1000,\"-\")","v":3348.0086240000001},{"$f":"IFERROR(MA8+SUM(EQ30,EQ50)/1000,\"-\")","v":2544.337974},2238.1759200000001,{"$f":"IFERROR(MC8+SUM(ES30,ES50)/1000,\"-\")","v":1524.5291400000001},{"$f":"IFERROR(MD8+SUM(ET30,ET50)/1000,\"-\")","v":"-"},{"$f":"IFERROR(ME8+SUM(EU30,EU50)/1000,\"-\")","v":"-"},{"$f":"IFERROR(MF8+SUM(EV30,EV50)/1000,\"-\")","v":"-"},{"$f":"IFERROR(MG8+SUM(EW30,EW50)/1000,\"-\")","v":"-"},{"$f":"IFERROR(MH8+SUM(EX30,EX50)/1000,\"-\")","v":"-"},{"$f":"IFERROR(MI8+SUM(EY30,EY50)/1000,\"-\")","v":"-"},{"$f":"IFERROR(MJ8+SUM(EZ30,EZ50)/1000,\"-\")","v":"-"},{"$f":"IFERROR(MK8+SUM(FA30,FA50)/1000,\"-\")","v":"-"},{"$f":"IFERROR(ML8+SUM(FB30,FB50)/1000,\"-\")","v":"-"}]
[null,"Régimen ordinario",{"$f":"SUM(C85:C90)","v":20983.739000000001},{"$f":"SUM(D85:D90)","v":17608.02},18707.558999999997,18018.677,17773.95,18579.984,20411.968000000001,18380.453000000001,18956.665000000001,19482.972000000002,19854.866999999998,21180.358,21067.758999999998,20037.241999999998,18120.440999999999,17648.763000000003,18314.264999999999,18491.100999999999,20610.635000000002,19356.754000000001,18522.235999999997,18165.444,17839.413,18837.095999999998,19471.396999999997,16149.814999999999,15759.361999999997,14376.523000000001,14921.868000000002,16791.513999999999,18868.688000000002,18146.089,{"$f":"SUM(AI85:AI90)","v":16794.401542},16123.620999999999,14598.011512000001,16229.513999999999,17800.326901,15828.811808999997,16426.925139999999,15298.720989999998,14419.042774999998,15897.745939000002,18670.971038000003,17308.577246000001,17055.983044000001,15536.432202,15806.268372999999,16643.775550000002,17725.553764,15088.231185000001,15817.763481000002,13873.095058000001,14296.047046,15188.677018999999,16181.560326999999,16711.237345999998,16505.515513999999,14950.575793999998,14809.367217999999,15130.618293,17347.941938,16603.757256000001,15333.500721,12531.454034999999,{"$f":"SUM(BO85:BO90)","v":13872.155355999999},14680.642991000001,15909.575296000001,16392.886812999997,14257.607169999999,15188.569115,13786.158468,14154.139918000001,13826.779576000001,12960.912009,13219.089320999999,12351.036298999999,11811.714990999999,11900.996168999998,16092.659781000002,14842.678982000001,14243.053669000001,13707.727555000001,12122.240866,14733.385786999999,"-","-","-","-","-","-","-","-","-","-","-","-","-","-","-","-","-","-","-","-","-","-","-","-","-","-","-","-","-","-","-","-","-","-","-","-","-","-","-","-","-","-","-","-","-","-","-","-","-","-","-","-","-","-","-","-","-","-","-","-"]
[null,"Hidroeólica","-","-","-","-","-","-","-","-","-","-","-","-","-","-","-","-","-","-","-","-","-","-","-","-","-","-","-","-","-","-","-","-","-","-","-","-","-","-","-","-","-","-","-","-","-","-","-","-","-","-","-","-","-","-","-","-","-","-","-","-","-","-","-","-","-","-","-","-","-","-","-","-","-","-","-","-","-","-","-","-","-","-","-","-","-","-","-","-","-","-","-",{"$f":"DB53/1000","v":0.31481300000000001},{"$f":"DC53/1000","v":0.161525},{"$f":"DD53/1000","v":0.19547100000000001},{"$f":"DE53/1000","v":0.201015},{"$f":"DF53/1000","v":0.19872599999999999},{"$f":"IFERROR(DG53/1000,\"-\")","v":0.41617599999999999},0.37487300000000001,0.243784,0.125636,0.242058,0.36242099999999999,2.0829909999999998,1.9288240000000001,0.74199999999999999,0.48464600000000002,0.88297099999999995,0.670686,0.81410000000000005,1.7795260000000002,1.522376,1.303018,0.92346299999999992,2.0026199999999998,2.580273,2.2239,2.171967,0.73335400000000006,1.0128509999999999,1.035191,1.084578,1.4479919999999999,2.1297550000000003,0.99451599999999996,1.495018,2.2291950000000003,3.1143130000000001,2.4583380000000004,2.340878,0.99089499999999997,0.81137000000000004,1.3016679999999998,{"$f":"IFERROR(EQ53/1000,\"-\")","v":2.2628509999999999},1.7680279999999999,{"$f":"IFERROR(ES53/1000,\"-\")","v":1.685079},{"$f":"IFERROR(ET53/1000,\"-\")","v":"-"},{"$f":"IFERROR(EU53/1000,\"-\")","v":"-"},{"$f":"IFERROR(EV53/1000,\"-\")","v":"-"},{"$f":"IFERROR(EW53/1000,\"-\")","v":"-"},{"$f":"IFERROR(EX53/1000,\"-\")","v":"-"},{"$f":"IFERROR(EY53/1000,\"-\")","v":"-"},{"$f":"IFERROR(EZ53/1000,\"-\")","v":"-"},{"$f":"IFERROR(FA53/1000,\"-\")","v":"-"},{"$f":"IFERROR(FB53/1000,\"-\")","v":"-"}]
[null,"Hidráulica/Resto hidráulica",{"$f":"GY10+(O54)/1000","v":345.48899999999998},478.79599999999999,516.02800000000002,529.75900000000001,509.19,412.91699999999997,302.29399999999998,256.69099999999997,186.381,186.98000000000002,190.15099999999998,211.82500000000002,340.49299999999999,233.46199999999999,301.47399999999999,581.11099999999999,613.46399999999994,581.87,380.714,264.678,212.28,190.523,400.12099999999998,539.62599999999998,521.06399999999996,629.61599999999999,560.02,501.49200000000002,577.14200000000005,468.387,365.35300000000001,282.64999999999998,{"$f":"IE10+(AU54)/1000","v":242.869},230.81,466.05,608.61800000000005,764.37,616.57799999999997,784.76,690.19600000000003,688.34299999999996,608.94799999999998,459.60300000000001,341.74799999999999,281.05,318.88900000000001,567.66,702.17499999999995,663.64800000000002,506.22,655.86500000000001,588.36700000000008,489.70300000000003,405.38899999999995,384.43099999999998,304.97299999999996,235.76399999999998,189.24,423.65600000000001,448.73440799999997,336.93943899999999,331.68107499999996,325.02500100000003,468.52787899999998,{"$f":"JK10+(CA54)/1000","v":642.37884499999996},439.77049699999998,337.78873499999997,265.08300199999996,199.02969999999999,269.68972600000001,410.39107300000001,620.03036400000008,667.51160200000004,688.127523,842.4176819999999,845.50599,780.13926700000002,659.12538800000004,535.22726699999998,403.179374,303.20133799999996,342.96671200000003,522.91916300000003,511.88099999999997,783.65599999999995,754.84899999999993,806.46900000000005,776.58499999999992,608.77699999999993,523.70100000000002,480.10599999999999,401.82502099999999,357.68799999999999,363.00200000000001,544.26599999999996,672.07500000000005,{"$f":"IFERROR(KQ10+(DG54)/1000,\"-\")","v":"-"},"-","-","-","-","-","-","-","-","-","-","-","-","-","-","-","-","-","-","-","-","-","-","-","-","-","-","-","-","-","-","-","-","-","-","-",{"$f":"IFERROR(MA10+(EQ54)/1000,\"-\")","v":"-"},"-",{"$f":"IFERROR(MC10+(ES54)/1000,\"-\")","v":"-"},{"$f":"IFERROR(MD10+(ET54)/1000,\"-\")","v":"-"},{"$f":"IFERROR(ME10+(EU54)/1000,\"-\")","v":"-"},{"$f":"IFERROR(MF10+(EV54)/1000,\"-\")","v":"-"},{"$f":"IFERROR(MG10+(EW54)/1000,\"-\")","v":"-"},{"$f":"IFERROR(MH10+(EX54)/1000,\"-\")","v":"-"},{"$f":"IFERROR(MI10+(EY54)/1000,\"-\")","v":"-"},{"$f":"IFERROR(MJ10+(EZ54)/1000,\"-\")","v":"-"},{"$f":"IFERROR(MK10+(FA54)/1000,\"-\")","v":"-"},{"$f":"IFERROR(ML10+(FB54)/1000,\"-\")","v":"-"}]
[null,"Eólica",{"$f":"GY11+SUM(O33,O55)/1000","v":2167.7449999999999},2895.3179999999998,3123.877,1382.6190000000001,2641.2139999999999,1818.328,1946.9179999999999,2468.8200000000002,2055.4479999999999,1927.347,2769.181,2414.8360000000002,2664.58,2035.72,4132.3620000000001,3389.4520000000002,1769.2150000000001,2125.6880000000001,2184.1570000000002,2034.3419999999999,2148.0600000000004,2516.4739999999997,3485.3240000000001,3674.4479999999999,3527.9769999999999,3244.2980000000002,3125.3940000000002,3106.5949999999998,2730.5969999999998,2353.5120000000002,2482.25,2293.0889999999999,{"$f":"IE11+SUM(AU33,AU55)/1000","v":2489.9910000000004},3138.623,4817.9000000000005,4942.6009999999997,4304.4309999999996,4637.902,4570.1519999999991,2667.3429999999998,3655.8969999999999,2615.31,2845.759,2937.761,2337.395,3967.3230000000003,4366.5439999999999,4639.5129999999999,4030.4670000000001,4053.1610000000001,4714.4639999999999,3423.9059999999999,3185.6109999999999,2975.2040000000002,3310.5589999999997,2781.78,2354.701,3175.6910000000003,3836.2260000000001,4623.6469999999999,3664.9578799999999,5049.4832850000003,3839.7926969999999,5336.9811980000004,{"$f":"JK11+SUM(CA33,CA55)/1000","v":3735.0307709999997},3473.6162140000001,3039.8783899999999,3181.7570000000001,3950.891212,3147.3323179999998,4622.2867120000001,5466.3301119999996,6316.8030689999996,5370.0570589999998,5763.1639999999998,4424.9819990000005,3970.8771710000001,3875.7850000000003,2885.9030000000002,3453.5439999999999,3239.1620000000003,3988.547,6458.3490000000002,4966.0729999999994,6569.5279999999993,5917.5259999999998,5096.7740000000003,3978.165,4177.875,3310.9670000000001,3637.1759999999999,2916.5050000000001,2145.3319999999999,3398.893,5093.1319999999996,4788.82,{"$f":"IFERROR(KQ11+SUM(DG33,DG55)/1000,\"-\")","v":4954.5020000000004},5992.5469999999996,4907.4960519999995,3933.9198799999999,4841.183,2903.93,3113.2939999999999,3287.3440000000001,3020.625,3898.4188899999999,3724.59825,3537.27,5624.5780000000004,6109.5309999999999,5443.9740000000002,4441.2962500000003,3933.1030000000001,3271.335,3521.9422,3652.9459999999999,2713.828,2389.6191900000003,3906.8539999999998,2687.6639999999998,4812.5491739999998,4928.5060000000003,4724.3779999999997,4196.1469999999999,3465.991,3189.672,3387.3580000000002,3343.8440000000001,2872.0099999999998,3207.7660000000001,3980.8450000000003,5787.9439999999995,{"$f":"IFERROR(MA11+SUM(EQ33,EQ55)/1000,\"-\")","v":5333.6570000000002},4669.4970000000003,{"$f":"IFERROR(MC11+SUM(ES33,ES55)/1000,\"-\")","v":7744.2150359999996},{"$f":"IFERROR(MD11+SUM(ET33,ET55)/1000,\"-\")","v":"-"},{"$f":"IFERROR(ME11+SUM(EU33,EU55)/1000,\"-\")","v":"-"},{"$f":"IFERROR(MF11+SUM(EV33,EV55)/1000,\"-\")","v":"-"},{"$f":"IFERROR(MG11+SUM(EW33,EW55)/1000,\"-\")","v":"-"},{"$f":"IFERROR(MH11+SUM(EX33,EX55)/1000,\"-\")","v":"-"},{"$f":"IFERROR(MI11+SUM(EY33,EY55)/1000,\"-\")","v":"-"},{"$f":"IFERROR(MJ11+SUM(EZ33,EZ55)/1000,\"-\")","v":"-"},{"$f":"IFERROR(MK11+SUM(FA33,FA55)/1000,\"-\")","v":"-"},{"$f":"IFERROR(ML11+SUM(FB33,FB55)/1000,\"-\")","v":"-"}]
[null,"Solar fotovoltaica",{"$f":"GY12+SUM(O34,O56,C76)/1000","v":10.391},12.96,21.983999999999998,26.105999999999998,36.128,40.742000000000004,51.927,56.504000000000005,60.428000000000004,57.695999999999998,54.375999999999998,54.66,59.578000000000003,73.40100000000001,108.56200000000001,131.04400000000001,137.02099999999999,196.40899999999999,240.44200000000001,298.52500000000003,328.08499999999998,334.32799999999997,335.40200000000004,255.15899999999999,261.25799999999998,396.22799999999995,528.73199999999997,569.73800000000006,672.34699999999998,643.83199999999999,717.298,663.41,{"$f":"IE12+SUM(AU34,AU56,AI76)/1000","v":511.53100000000001},502.20600000000002,361.99299999999999,243.81700000000001,263.11899999999997,305.07099999999997,481.50900000000001,590.40700000000004,711.44200000000001,685.33100000000002,785.81499999999994,723.07,631.37599999999998,548.48400000000004,382.17600000000004,314.97199999999998,356.50800000000004,504.47500000000002,536.09400000000005,661.11799999999994,747.8130000000001,810.57900000000006,855.84499999999991,802.64800000000002,732.96999999999991,628.05799999999999,363.85199999999998,425.15999999999997,504.68700000000001,660.33,770.14300000000003,658.51900000000001,{"$f":"JK12+SUM(CA34,CA56,BO76)/1000","v":863.505},875.875,941.61799999999994,865.18099999999993,692.37199999999996,595.35799999999995,372.47300000000001,402.029,446.28399999999999,527.67399999999998,566.69600000000003,763.80400000000009,872.91799999999989,930.95299999999997,974.76400000000001,896.60900000000004,759.63499999999999,634.76799999999992,513.57500000000005,439.23899999999998,377.51799999999997,434.38400000000001,735.89800000000002,791.91300000000001,924.375,903.697,951.48400000000004,913.99200000000008,686.95600000000002,647.95300000000009,385.42600000000004,453.97700000000003,{"$f":"IFERROR(KQ12+SUM(DG34,DG56,CU76)/1000,\"-\")","v":518.44286299999999},494.22899999999998,713.271298,755.91261000000009,924.10299999999995,889.255,933.15800000000002,831.90200000000004,722.21187000000009,537.13499999999999,529.70299999999997,393.75200000000001,364.464,480.09399999999999,709.29829999999993,721.4905,807.02800000000002,924.06700000000001,918.53600000000006,895.85400000000004,766.09,584.44900000000007,426.517,379.71100000000001,476.15699999999998,445.43900000000002,717.35500000000002,836.64700000000005,872.75,880.70800000000008,913.76099999999997,817.49400000000003,773.90899999999999,680.51699999999994,539.50900000000001,430.79,{"$f":"IFERROR(MA12+SUM(EQ34,EQ56,EE76)/1000,\"-\")","v":442.29599999999999},508.14800000000002,{"$f":"IFERROR(MC12+SUM(ES34,ES56,EG76)/1000,\"-\")","v":587.50707},{"$f":"IFERROR(MD12+SUM(ET34,ET56,EH76)/1000,\"-\")","v":"-"},{"$f":"IFERROR(ME12+SUM(EU34,EU56,EI76)/1000,\"-\")","v":"-"},{"$f":"IFERROR(MF12+SUM(EV34,EV56,EJ76)/1000,\"-\")","v":"-"},{"$f":"IFERROR(MG12+SUM(EW34,EW56,EK76)/1000,\"-\")","v":"-"},{"$f":"IFERROR(MH12+SUM(EX34,EX56,EL76)/1000,\"-\")","v":"-"},{"$f":"IFERROR(MI12+SUM(EY34,EY56,EM76)/1000,\"-\")","v":"-"},{"$f":"IFERROR(MJ12+SUM(EZ34,EZ56,EN76)/1000,\"-\")","v":"-"},{"$f":"IFERROR(MK12+SUM(FA34,FA56,EO76)/1000,\"-\")","v":"-"},{"$f":"IFERROR(ML12+SUM(FB34,FB56,EP76)/1000,\"-\")","v":"-"}]
[null,"Solar térmica",{"$f":"GY13","v":0},0,0.43099999999999999,0.34200000000000003,0.55800000000000005,0.88300000000000001,1.256,1.1160000000000001,0.63900000000000001,1.214,0.997,0.191,1.0840000000000001,0.79700000000000004,1.4610000000000001,0.95799999999999996,0.94199999999999995,1.9630000000000001,2.0379999999999998,1.98,0.85899999999999999,0.86599999999999999,1.27,1.1599999999999999,0.69,1.236,2.323,7.2039999999999997,7.6580000000000004,6.7519999999999998,12.414,23.867999999999999,{"$f":"IE13","v":17.539000000000001},23.446000000000002,16.183,10.51,13.151999999999999,11.682,23.731999999999999,36.92,69.084000000000003,72.531999999999996,104.59,121.9,100.917,71.745000000000005,31.619,33.747,34.25,88.656999999999996,98.456999999999994,137.833,154.07300000000001,232.48400000000001,284.20800000000003,235.32900000000001,228.55799999999999,172.91200000000001,80.436999999999998,85.159000000000006,117.342,200.34200000000001,235.113,177.77699999999999,{"$f":"JK13","v":348.38200000000001},414.74900000000002,541.31700000000001,485.12700000000001,368.64299999999997,285.79500000000002,133.96199999999999,135.58500000000001,113.494,204.00899999999999,125.37,300.89400000000001,499.26799999999997,647.33000000000004,758.52300000000002,661.85599999999999,478.95499999999998,294.24200000000002,199.22399999999999,158.36199999999999,79.801000000000002,103.265,385.17500000000001,435.52699999999999,729.93600000000004,687.28800000000001,811.15300000000002,833.178,389.596,289.33699999999999,90.186999999999998,124.47199999999999,{"$f":"IFERROR(KQ13,\"-\")","v":176.95099999999999},190.92500000000001,415.82900000000001,393.16,694.83900000000006,734.05399999999997,888.91800000000001,607.62300000000005,483.25,188.16900000000001,226.81800000000001,84.698999999999998,59.914000000000001,133.01,387.86099999999999,408.32299999999998,498.79500000000002,813.99099999999999,825.32500000000005,805.81899999999996,595.62699999999995,284.70299999999997,139.69999999999999,118.136,149.21199999999999,88.741,340.84500000000003,535.255,607.89800000000002,761.90200000000004,812.88,692.43499999999995,608.14,398.79300000000001,220.65199999999999,131.196,{"$f":"IFERROR(MA13,\"-\")","v":112.38800000000001},229.80799999999999,{"$f":"IFERROR(MC13,\"-\")","v":227.90559999999999},{"$f":"IFERROR(MD13,\"-\")","v":"-"},{"$f":"IFERROR(ME13,\"-\")","v":"-"},{"$f":"IFERROR(MF13,\"-\")","v":"-"},{"$f":"IFERROR(MG13,\"-\")","v":"-"},{"$f":"IFERROR(MH13,\"-\")","v":"-"},{"$f":"IFERROR(MI13,\"-\")","v":"-"},{"$f":"IFERROR(MJ13,\"-\")","v":"-"},{"$f":"IFERROR(MK13,\"-\")","v":"-"},{"$f":"IFERROR(ML13,\"-\")","v":"-"}]
[null,"Térmica renovable/Otras renovables",{"$f":"GY14+SUM(O35,O57)/1000","v":216.57900000000001},190.44399999999999,202.655,201.31399999999999,212.92099999999999,208.53500000000003,222.32499999999999,223.34399999999999,210.393,242.72399999999999,222.18800000000002,235.54599999999999,240.54300000000001,235.363,243.89999999999998,241.16800000000001,240.34899999999999,235.23099999999999,223.648,239.89500000000001,225.512,247.172,248.54500000000002,247.38200000000001,267.15800000000002,253.47299999999998,264.57600000000002,300.05200000000002,272.99799999999999,253.04599999999999,260.84899999999999,260.46300000000002,{"$f":"IE14+SUM(AU35,AU57)/1000","v":287.976},347.83600000000001,272.58799999999997,276.327,274.84199999999998,245.35900000000001,262.31099999999998,277.04300000000001,300.03700000000003,288.51100000000002,278.10199999999998,284.791,267.96199999999999,284.303,273.09999999999997,295.99899999999997,360.32499999999999,334.40699999999998,355.24599999999998,356.64,335.76299999999998,336.97399999999999,358.63499999999999,356.02099999999996,375.80200000000002,383.84299999999996,376.08700000000005,388.24636300000003,394.35710999999998,373.43272300000001,398.84319799999997,372.66191600000002,{"$f":"JK14+SUM(CA35,CA57)/1000","v":361.52463499999999},406.76686599999999,422.10672299999999,401.27762000000001,373.84606100000002,413.891459,401.555475,434.50466799999998,436.52267400000005,415.74157700000001,453.79920099999998,422.25598100000002,438.81170000000003,393.22358099999997,432.786744,418.17954099999997,398.67487700000004,405.47619700000001,414.20800000000003,445.01599999999996,424.45600000000002,332.233,366.40699999999998,339.55800000000005,410.952,407.03699999999998,412.22,446.01172200000002,422.947,388.49400000000003,373.56199999999995,404.851,{"$f":"IFERROR(KQ14+SUM(DG35,DG57)/1000,\"-\")","v":240.00928999999999},206.32529,234.65600000000001,180.423,226.98099999999999,277.27029800000003,300.35291799999999,312.37200000000001,302.41299999999995,311.08697000000001,304.67399999999998,287.41300000000001,269.97300000000001,261.56792000000002,255.63013999999998,209.99540000000002,277.22199999999998,287.56,311.08,326.72672,307.66200000000003,306.35834,304.59899999999999,306.185,327.21600000000001,289.71999999999997,269.56099999999998,232.80499999999998,298.76599999999996,302.43800000000005,333.47499999999997,316.85300000000001,310.14300000000003,310.94,308.63600000000002,313.54999999999995,{"$f":"IFERROR(MA14+SUM(EQ35,EQ57)/1000,\"-\")","v":297.47300000000001},302.44399999999996,{"$f":"IFERROR(MC14+SUM(ES35,ES57)/1000,\"-\")","v":279.40366999999998},{"$f":"IFERROR(MD14+SUM(ET35,ET57)/1000,\"-\")","v":"-"},{"$f":"IFERROR(ME14+SUM(EU35,EU57)/1000,\"-\")","v":"-"},{"$f":"IFERROR(MF14+SUM(EV35,EV57)/1000,\"-\")","v":"-"},{"$f":"IFERROR(MG14+SUM(EW35,EW57)/1000,\"-\")","v":"-"},{"$f":"IFERROR(MH14+SUM(EX35,EX57)/1000,\"-\")","v":"-"},{"$f":"IFERROR(MI14+SUM(EY35,EY57)/1000,\"-\")","v":"-"},{"$f":"IFERROR(MJ14+SUM(EZ35,EZ57)/1000,\"-\")","v":"-"},{"$f":"IFERROR(MK14+SUM(FA35,FA57)/1000,\"-\")","v":"-"},{"$f":"IFERROR(ML14+SUM(FB35,FB57)/1000,\"-\")","v":"-"}]
[null,"Térmica no renovable/Cogeneración y resto/Cogeneración",{"$f":"GY15+SUM(O36,O58,C77)/1000","v":1995.5450000000001},1768.9959999999999,1879.5849999999998,1844.2359999999999,1838.9460000000001,1904.7730000000001,2000.027,1879.0259999999998,1965.914,2104.393,2108.9319999999998,2160.0570000000002,2263.8589999999999,2239.8829999999998,2285.25,2241.5010000000002,2119.1759999999999,2090.9559999999997,2229.8599999999997,2028.0640000000001,2188.578,2370.777,2326.19,2337.056,2435.4610000000002,2252.732,2408.4,2350.433,2364.2140000000004,2321.6890000000003,2408.567,2045.8420000000001,{"$f":"IE15+SUM(AU36,AU58,AI77)/1000","v":2349.3010000000004},2475.8960000000002,2583.23,2604.9659999999999,2672.7280000000001,2486.873,2628.8110000000001,2562.366,2593.181,2552.884,2625.9669999999996,2177.1619999999998,2550.5650000000001,2661.3690000000001,2677.2269999999999,2784.1910000000003,2796.9879999999998,2610.8319999999999,2895.174,2706.5819999999999,2734.9050000000002,2601.5860000000002,2665.2939999999999,2230.6089999999999,2664.549,2787.1820000000002,2771.509,2853.5859999999998,2953.8130000000001,2799.4249999999997,2938.2000000000003,2833.3379999999997,{"$f":"JK15+SUM(CA36,CA58,BO77)/1000","v":2870.8989999999999},2704.0389999999998,2812.6610000000001,2379.1909999999998,2765.1979999999999,2920.4010000000003,2862.3199999999997,2927.7640000000001,3021.6349999999998,2704.5899999999997,2900.9970000000003,2799.471,2837.9189999999999,2677.81,2682.4589999999998,2123.2829999999999,2588.922,2637.34,2631.232,2690.721,2699.431,1996.249,1915.193,1734.681,2072.8940000000002,2222.1299999999997,2283.788,2126.6960000000004,2284.6910000000003,2294.8229999999999,2087.91,2167.3380000000002,{"$f":"IFERROR(KQ15+SUM(DG36,DG58,CU77)/1000,\"-\")","v":2225.9259999999999},1964.058,2120.3530000000001,2034.8821599999999,2124.3719999999998,2074.5451599999997,2170.1669999999999,2044.5060000000001,2156.192,2218.0360000000001,2132.4720000000002,2183.9849999999997,2131.625,1970.7746400000001,2072.5729300000003,1995.5405800000001,2115.7290000000003,2171.085,2242.6869000000002,2123.5298000000003,2138.076,2321.3920000000003,2298.5420000000004,2325.0570000000002,2449.982,2207.0050000000001,2392.2059999999997,2233.2640000000001,2326.415,2315.2570000000001,2398.0920000000001,2257.2759999999998,2272.002,2392.77,2441.4610000000002,2484.7149999999997,{"$f":"IFERROR(MA15+SUM(EQ36,EQ58,EE77)/1000,\"-\")","v":2477.9189999999999},2246.5069999999996,{"$f":"IFERROR(MC15+SUM(ES36,ES58,EG77)/1000,\"-\")","v":2501.4601959999995},{"$f":"IFERROR(MD15+SUM(ET36,ET58,EH77)/1000,\"-\")","v":"-"},{"$f":"IFERROR(ME15+SUM(EU36,EU58,EI77)/1000,\"-\")","v":"-"},{"$f":"IFERROR(MF15+SUM(EV36,EV58,EJ77)/1000,\"-\")","v":"-"},{"$f":"IFERROR(MG15+SUM(EW36,EW58,EK77)/1000,\"-\")","v":"-"},{"$f":"IFERROR(MH15+SUM(EX36,EX58,EL77)/1000,\"-\")","v":"-"},{"$f":"IFERROR(MI15+SUM(EY36,EY58,EM77)/1000,\"-\")","v":"-"},{"$f":"IFERROR(MJ15+SUM(EZ36,EZ58,EN77)/1000,\"-\")","v":"-"},{"$f":"IFERROR(MK15+SUM(FA36,FA58,EO77)/1000,\"-\")","v":"-"},{"$f":"IFERROR(ML15+SUM(FB36,FB58,EP77)/1000,\"-\")","v":"-"}]
[null,"Residuos no renovables","-","-","-","-","-","-","-","-","-","-","-","-","-","-","-","-","-","-","-","-","-","-","-","-","-","-","-","-","-","-","-","-","-","-","-","-","-","-","-","-","-","-","-","-","-","-","-","-","-","-","-","-","-","-","-","-","-","-","-","-","-","-","-","-","-","-","-","-","-","-","-","-","-","-","-","-","-","-","-","-","-","-","-","-","-","-","-","-","-","-","-","-","-","-","-","-",{"$f":"KQ16+SUM(DG37,CU78)/1000","v":197.69399999999999},177.61449999999999,207.61250000000001,168.03550000000001,207.88700000000003,210.36849999999998,223.35549999999998,226.59900000000002,217.54299999999998,230.57749999999999,217.71549999999996,195.107,209.91150000000002,{"$f":"IFERROR(LD16+SUM(DT37,DH78)/1000,\"-\")","v":192.98699999999999},218.0865,191.97449999999998,151.87899999999999,209.61450000000002,254.60599999999999,256.24200000000002,250.02100000000002,244.20500000000001,214.7045,212.73349999999999,224.85249999999999,198.53299999999999,220.08599999999998,187.77449999999999,187.24350000000001,225.8425,215.10900000000001,229.59950000000003,228.79100000000003,242.89299999999997,217.89099999999999,229.04900000000001,{"$f":"IFERROR(MA16+SUM(EQ37,EE78)/1000,\"-\")","v":234.57399999999998},206.94350000000003,{"$f":"IFERROR(MC16+SUM(ES37,EG78)/1000,\"-\")","v":229.77460000000002},{"$f":"IFERROR(MD16+SUM(ET37,EH78)/1000,\"-\")","v":"-"},{"$f":"IFERROR(ME16+SUM(EU37,EI78)/1000,\"-\")","v":"-"},{"$f":"IFERROR(MF16+SUM(EV37,EJ78)/1000,\"-\")","v":"-"},{"$f":"IFERROR(MG16+SUM(EW37,EK78)/1000,\"-\")","v":"-"},{"$f":"IFERROR(MH16+SUM(EX37,EL78)/1000,\"-\")","v":"-"},{"$f":"IFERROR(MI16+SUM(EY37,EM78)/1000,\"-\")","v":"-"},{"$f":"IFERROR(MJ16+SUM(EZ37,EN78)/1000,\"-\")","v":"-"},{"$f":"IFERROR(MK16+SUM(FA37,EO78)/1000,\"-\")","v":"-"},{"$f":"IFERROR(ML16+SUM(FB37,EP78)/1000,\"-\")","v":"-"}]
[null,"Residuos renovables","-","-","-","-","-","-","-","-","-","-","-","-","-","-","-","-","-","-","-","-","-","-","-","-","-","-","-","-","-","-","-","-","-","-","-","-","-","-","-","-","-","-","-","-","-","-","-","-","-","-","-","-","-","-","-","-","-","-","-","-","-","-","-","-","-","-","-","-","-","-","-","-","-","-","-","-","-","-","-","-","-","-","-","-","-","-","-","-","-","-","-","-","-","-","-","-",{"$f":"IFERROR(KQ17+SUM(DG38,CU79)/1000,\"-\")","v":64.152000000000001},{"$f":"IFERROR(KR17+SUM(DH38,CV79)/1000,\"-\")","v":59.516500000000001},{"$f":"IFERROR(KS17+SUM(DI38,CW79)/1000,\"-\")","v":72.007499999999993},{"$f":"IFERROR(KT17+SUM(DJ38,CX79)/1000,\"-\")","v":47.499499999999998},{"$f":"IFERROR(KU17+SUM(DK38,CY79)/1000,\"-\")","v":64.893000000000001},{"$f":"IFERROR(KV17+SUM(DL38,CZ79)/1000,\"-\")","v":73.037499999999994},{"$f":"IFERROR(KW17+SUM(DM38,DA79)/1000,\"-\")","v":73.160499999999999},{"$f":"IFERROR(KX17+SUM(DN38,DB79)/1000,\"-\")","v":70.308999999999997},{"$f":"IFERROR(KY17+SUM(DO38,DC79)/1000,\"-\")","v":70.194000000000003},{"$f":"IFERROR(KZ17+SUM(DP38,DD79)/1000,\"-\")","v":75.951499999999996},{"$f":"IFERROR(LA17+SUM(DQ38,DE79)/1000,\"-\")","v":74.485500000000002},{"$f":"IFERROR(LB17+SUM(DR38,DF79)/1000,\"-\")","v":72.841999999999999},{"$f":"IFERROR(LC17+SUM(DS38,DG79)/1000,\"-\")","v":66.351500000000001},53.484999999999999,66.529499999999999,39.262500000000003,39.160000000000004,69.139499999999998,75.308000000000007,73.403000000000006,75.08,74.216999999999999,74.121500000000012,79.339500000000001,72.733499999999992,63.647000000000006,70.867000000000004,61.682499999999997,45.922499999999999,81.467500000000001,83.370999999999995,80.367499999999993,77.905000000000001,80.609999999999985,77.924000000000007,80.509,{"$f":"IFERROR(MA17+SUM(EQ38,EE79)/1000,\"-\")","v":77.265999999999991},67.379500000000007,78.719500000000011,"-","-","-","-","-","-","-","-","-"]
[null,"Régimen especial",{"$f":"SUM(C92:C98)","v":4735.7489999999998},{"$f":"SUM(D92:D98)","v":5346.5139999999992},5744.5599999999995,3984.3760000000002,5238.9570000000003,4386.1779999999999,4524.7469999999994,4885.5010000000002,4479.2029999999995,4520.3540000000003,5345.8249999999998,5077.1149999999998,5570.1369999999997,4818.6259999999993,7073.009,6585.2339999999995,4880.1670000000004,5232.1170000000002,5260.8590000000004,4867.4840000000004,5103.3740000000007,5660.1399999999994,6796.8520000000008,7054.8309999999983,7013.6080000000002,6777.5829999999996,6889.4450000000015,6835.5139999999992,6624.9560000000001,6047.2180000000008,6246.7309999999998,5569.3220000000001,5899.2070000000012,6718.8170000000009,8517.9440000000013,8686.8389999999999,8292.6419999999998,8303.4650000000001,8751.2749999999996,6824.2749999999996,8017.9840000000004,6823.5160000000005,7099.8359999999993,6586.4320000000007,6169.2649999999994,7852.1130000000012,8298.3260000000009,8770.5969999999998,8242.1859999999997,8097.7520000000004,9255.2999999999993,7874.4459999999999,7647.8680000000004,7362.2160000000013,7858.9719999999998,6711.3600000000006,6592.3440000000001,7336.9260000000013,7851.7670000000007,8824.5327710000001,7972.0964289999993,9414.6940830000003,8507.1168959999995,9847.8049930000016,8821.7202509999988,{"$f":"SUM(BP92:BP98)","v":8314.8165769999996},{"$f":"SUM(BQ92:BQ98)","v":8095.3698480000003},7577.6166219999996,8349.9799729999995,7632.4675029999999,8802.9882599999983,9986.243144,11002.250344999999,9910.1991589999998,10652.443883,9556.9129700000012,9399.9331380000003,9184.2269689999994,8269.6630110000006,7956.6509149999983,7768.5502150000011,8303.3399090000003,10739.507163,{"$f":"SUM(CH92:CH98)","v":9211.2919999999995},"-","-","-","-","-","-","-","-","-","-","-","-","-","-","-","-","-","-","-","-","-","-","-","-","-","-","-","-","-","-","-","-","-","-","-","-","-","-","-","-","-","-","-","-","-","-","-","-","-","-","-","-","-","-","-","-","-","-","-","-"]
[null,"Generación",{"$f":"SUM(C85:C90,C92:C98)","v":25719.488000000005},22954.533999999996,24452.118999999995,22003.053,23012.906999999999,22966.162000000004,24936.715000000004,23265.954000000005,23435.868000000002,24003.326000000001,25200.691999999999,26257.472999999998,26637.895999999997,24855.868000000002,25193.45,24233.997000000007,23194.431999999997,23723.217999999997,25871.494000000002,24224.238000000001,23625.609999999997,23825.584000000003,24636.264999999999,25891.927,26485.004999999994,22927.397999999997,22648.807000000001,21212.037000000004,21546.824000000004,22838.731999999996,25115.418999999998,23715.411,{"$f":"SUM(AI85:AI90,AI92:AI98)","v":22693.608541999998},22842.437999999998,23115.955512,24916.352999999996,26092.968900999997,24132.276808999995,25178.200139999997,22122.995989999996,22437.026774999998,22721.261938999996,25770.807038000003,23895.009246000001,23225.248044,23388.545201999998,24104.594372999993,25414.37255,25967.739764000005,23185.983184999994,25073.063481000001,21747.541057999995,21943.915045999998,22550.893018999999,24040.532327000001,23422.597346000002,23097.859514,22287.501794,22661.134217999999,23955.151063999998,25320.038367000001,26018.451339000003,23840.617617,22379.259027999997,{"$f":"SUM(BO85:BO90,BO92:BO98)","v":22693.875607000005},22995.459568000002,24004.945144000001,23970.503434999999,22607.587142999997,22821.036617999998,22589.146728000003,24140.383062000001,24829.029920999998,22871.111167999996,23871.533203999999,21907.949269000001,21211.648129000001,21085.223138000001,24362.322792000003,22799.329897,22011.603884000004,22011.067464,22861.748028999998,23944.677787000001,24069.783685999999,22572.472389999999,22827.559454000002,21023.228392999998,21339.070671999998,21443.287701000005,23214.252268,22043.961561999997,22170.959093999998,21652.138304,21205.746014000004,23304.616236000002,{"$f":"IF(SUM(CU85:CU90,CU92:CU100)=0,\"-\",SUM(CU85:CU90,CU92:CU100))","v":24652.238493000001},{"$f":"IF(SUM(CV85:CV90,CV92:CV100)=0,\"-\",SUM(CV85:CV90,CV92:CV100))","v":23243.256280000001},23245.698945999997,20656.255056000002,21262.241217999996,21773.570768999994,25326.321174000008,22897.619124999997,21314.521065999998,20908.318851,20983.676212999999,21672.563076000002,22692.820900000002,21722.041113000003,23094.827454000006,21760.210492000002,20651.950938999998,20652.144536999996,22903.726809000003,22071.746630999995,21194.505640000003,21793.291399000005,21801.681326000002,21940.309973999996,25337.502081999999,21024.662063000003,21187.405059999997,19281.876918000002,20274.219323000001,22119.187946999991,22788.923473999999,21741.939399999999,20321.632206000002,21494.715340000002,22749.131292999995,{"$f":"IF(SUM(ED85:ED90,ED92:ED100)=0,\"-\",SUM(ED85:ED90,ED92:ED100))","v":24323.941950999997},22903.287292999998,{"$f":"IF(SUM(EF85:EF90,EF92:EF100)=0,\"-\",SUM(EF85:EF90,EF92:EF100))","v":21859.407520999997},24374.195249999993,"-","-","-","-","-","-","-","-","-"]
[null,"Consumos en bombeo",{"$f":"GY20","v":-371.77600000000001},-395.87900000000002,-384.16800000000001,-293.39699999999999,-397.62200000000001,-356.25400000000002,-333.52100000000002,-371.38200000000001,-345.92500000000001,-317.00099999999998,-384.15499999999997,-481.20699999999999,-430.83600000000001,-419.30500000000001,-401.79399999999998,-219.05799999999999,-206.07300000000001,-285.255,-253.78200000000001,-190.80199999999999,-226.55600000000001,-297.14499999999998,-411.25599999999997,-460.64,-492.22699999999998,-392.03500000000003,-281.47199999999998,-255.75899999999999,-247.49799999999999,-224.59399999999999,-241.018,-245.006,{"$f":"IE20","v":-254.49299999999999},-284.12299999999999,-397.50099999999998,-478.46300000000002,-756.58548100000007,-554.72222199999999,-544.66441799999996,-303.16059899999999,-279.94919199999998,-230.155124,-199.16812999999999,-231.14395499999998,-233.69566899999998,-346.11598499999997,-322.22366899999997,-456.19813299999998,-430.91918800000002,-280.66478600000005,-347.70577100000003,-297.00992200000002,-158.92510200000001,-139.95152400000001,-173.53430600000002,-181.06439699999999,-176.06341800000001,-301.62591900000001,-325.48060800000002,-402.01487400000002,-448.91067399999997,-444.12264199999998,-429.06647600000002,-565.84194300000001,{"$f":"JK20","v":-360.20398999999998},-322.06323800000001,-285.67122799999999,-365.72605300000004,-454.578665,-397.03421900000001,-403.31192900000002,-546.01673100000005,-697.63724999999999,-562.65698600000007,-1052.4229879999998,-872.86187399999994,-452.79265899999996,-384.57999899999999,-256.57863700000001,-231.78292800000003,-211.57028500000001,-305.59618699999999,-348.25588500000003,-581.10931200000005,-858.01401699999997,-633.18831499999999,-524.05132400000002,-508.09411,-434.99119899999999,-325.47192799999999,-239.80621400000001,-218.068423,-215.90781899999999,-408.39204999999998,-518.48742099999993,-445.117231,{"$f":"IFERROR(KQ20,\"-\")","v":-479.60648900000001},-543.86398299999996,-478.82839000000001,-406.19568500000003,-422.73500000000001,-154.35719500000002,-167.860691,-301.47133700000001,-245.09551099999999,-374.45159699999999,-436.89324499999998,-508.73505599999999,-897.23722699999996,-716.42767700000002,-590.25587100000007,-584.07853499999999,-474.71409,-210.517944,-141.61362500000001,-157.40858300000002,-122.319526,-229.38049699999999,-352.86669000000001,-342.59280999999999,-433.831684,-560.18740600000001,-335.17777599999999,-335.53738199999998,-229.06522200000001,-192.29135200000002,-173.37316200000001,-204.27099900000002,-165.54855699999999,-221.48029300000002,-269.55341499999997,-554.92065600000001,{"$f":"IFERROR(MA20,\"-\")","v":-390.73397899999998},-253.25366200000002,{"$f":"IFERROR(MC20,\"-\")","v":-728.75189999999998},{"$f":"IFERROR(MD20,\"-\")","v":"-"},{"$f":"IFERROR(ME20,\"-\")","v":"-"},{"$f":"IFERROR(MF20,\"-\")","v":"-"},{"$f":"IFERROR(MG20,\"-\")","v":"-"},{"$f":"IFERROR(MH20,\"-\")","v":"-"},{"$f":"IFERROR(MI20,\"-\")","v":"-"},{"$f":"IFERROR(MJ20,\"-\")","v":"-"},{"$f":"IFERROR(MK20,\"-\")","v":"-"},{"$f":"IFERROR(ML20,\"-\")","v":"-"}]
[null,"Saldo intercambios internacionales",{"$f":"GY22","v":94.564999999999998},-235.49199999999999,-243.36199999999999,-261.05399999999997,-494.78800000000001,-223.46299999999999,-289.77800000000002,-314.01400000000001,-846.57600000000002,-1153.7719999999999,-1052.93,-729.80100000000004,-456.80399999999997,-655.58699999999999,-1199.348,-1291.615,-761.27499999999998,-1052.3420000000001,-907.81299999999999,-796.07299999999998,-935.81,-1102.0160000000001,-948.447,-932.45600000000002,-897.62800000000004,-474.27699999999999,-192.952,-548.93399999999997,-437.37599999999998,-769.16099999999994,-944.90899999999999,-817.41700000000003,{"$f":"IE22","v":-711.16800000000001},-941.36500000000001,-897.21199999999999,-454.01499999999999,-304.71344599999998,-506.196753,-560.11404599999992,-729.095102,-542.81502899999998,-821.22575100000006,-1000.6535670000001,-758.60105700000008,-964.2554520000001,-1295.5098870000002,-593.21057400000007,-256.28839399999998,-611.33580500000005,-358.84235899999999,-762.63600899999994,-1074.8113170000001,-233.62379999999999,-404.76718699999998,-470.93457000000001,-197.10088099999999,-548.75685799999997,-381.58426100000003,-579.51663300000007,-466.21665400000001,-525.29093599999999,-1375.7932209999999,-869.96906999999999,-1211.9197819999999,{"$f":"JK22","v":-939.84038100000009},-625.32935199999997,-629.52545599999996,-646.20974899999999,-1047.302604,-1457.208903,-791.40693099999999,-1080.1572060000001,-364.45221100000003,-642.39397799999995,-430.41725799999995,-411.18220100000002,-132.05559299999999,-358.69515000000001,-1060.4316310000002,-517.67452200000002,-821.87308799999994,-679.119191,-892.91131900000005,-420.92630800000001,28.099829000000003,-490.54062400000004,-225.94670300000001,-652.23227599999996,-256.41148300000003,-285.58111300000002,-481.72024800000003,-236.69277,-336.25484,-303.54976099999999,195.372657,-360.667597,{"$f":"IFERROR(KQ22,\"-\")","v":-259.102957},-558.85504600000002,-396.75677899999999,-295.55073599999997,180.77279000000001,0.88915499999999992,-184.17543000000001,-251.793361,-169.941732,436.52791200000001,453.10844900000001,911.71451000000002,847.59026500000004,960.57577300000003,174.92662100000001,-106.684112,762.50236499999994,1083.2692120000002,917.73114199999998,1034.6561139999999,1130.5906419999999,-433.77785799999998,357.21121500000004,938.722174,-531.54929799999991,541.13368700000001,1457.080766,1040.959484,1444.9856000000002,1128.8588829999999,1273.4433959999999,1827.910942,1393.3084220000001,280.22841800000003,-346.27278000000001,-339.50387699999999,{"$f":"IFERROR(MA22,\"-\")","v":1340.296642},857.10299299999997,{"$f":"IFERROR(MC22,\"-\")","v":-292.80159999999995},{"$f":"IFERROR(MD22,\"-\")","v":"-"},{"$f":"IFERROR(ME22,\"-\")","v":"-"},{"$f":"IFERROR(MF22,\"-\")","v":"-"},{"$f":"IFERROR(MG22,\"-\")","v":"-"},{"$f":"IFERROR(MH22,\"-\")","v":"-"},{"$f":"IFERROR(MI22,\"-\")","v":"-"},{"$f":"IFERROR(MJ22,\"-\")","v":"-"},{"$f":"IFERROR(MK22,\"-\")","v":"-"},{"$f":"IFERROR(ML22,\"-\")","v":"-"}]
[null,"Demanda transporte (b.c.)",{"$f":"SUM(C102:C104)","v":25442.277000000002},{"$f":"SUM(D102:D104)","v":22323.162999999997},23824.588999999993,21448.601999999999,22120.496999999999,22386.445000000003,24313.416000000005,22580.558000000005,22243.367000000002,22532.553,23763.607,25046.465,25750.255999999998,23780.976000000002,23592.307999999997,22723.324000000004,22227.083999999995,22385.620999999996,24709.899000000005,23237.363000000001,22463.243999999995,22426.423000000003,23276.561999999998,24498.831000000002,25095.149999999994,22061.085999999999,22174.382999999998,20407.344000000005,20861.950000000004,21844.976999999995,23929.491999999998,22652.987999999998,21727.947541999998,21616.949999999997,21821.242512000001,23983.874999999996,25031.669973999997,23071.357833999995,24073.421675999998,21090.740288999998,21614.262553999997,21669.881063999994,24570.985341000003,22905.264234000002,22027.296922999998,21746.919329999997,23189.160129999993,24701.886022999999,24925.484771000007,22546.476039999994,23962.721700999999,20375.719818999994,21551.366143999996,22006.174307999998,23396.063450999998,23044.432068000006,22373.039237999998,21604.291614000002,21756.136976999998,23086.919535999998,24345.836757000001,24198.535476000005,22541.582071000001,20601.497302999996,21393.831236000005,{"$f":"SUM(BP102:BP104)","v":22048.066978000003},23089.748460000003,22958.567632999999,21105.705873999996,20966.793495999998,21394.427868000002,22514.209125000001,23766.940459999998,21666.060203999994,22388.692958,20623.905194000003,20626.799877000001,20341.947989,23045.312524000004,22049.872446999998,20978.160511000002,21026.352085999999,21620.580825000001,22942.642167000002,23239.869497999996,21448.743450999998,22077.561427000001,19862.902007000001,20647.667989999998,20832.234660000006,22492.725805999999,21589.200368999995,21618.796434999997,20940.196493000003,20882.631250000002,22498.831408000002,{"$f":"IF(SUM(CU102:CU104)=0,\"-\",SUM(CU102:CU104))","v":23913.529047},{"$f":"IF(SUM(CV102:CV104)=0,\"-\",SUM(CV102:CV104))","v":22140.537251000002},{"$f":"IF(SUM(CW102:CW104)=0,\"-\",SUM(CW102:CW104))","v":22370.113776999999},{"$f":"IF(SUM(CX102:CX104)=0,\"-\",SUM(CX102:CX104))","v":19954.508635000002},{"$f":"IF(SUM(CY102:CY104)=0,\"-\",SUM(CY102:CY104))","v":21020.279007999994},21620.102728999995,24974.285053000007,22344.354426999998,20899.483822999999,20970.395166000002,20999.891416999999,22075.542530000002,{"$f":"IF(SUM(DG102:DG104)=0,\"-\",SUM(DG102:DG104))","v":22643.173938},{"$f":"IF(SUM(DH102:DH104)=0,\"-\",SUM(DH102:DH104))","v":21966.189209000004},{"$f":"IF(SUM(DI102:DI104)=0,\"-\",SUM(DI102:DI104))","v":22679.498204000003},{"$f":"IF(SUM(DJ102:DJ104)=0,\"-\",SUM(DJ102:DJ104))","v":21069.447845000002},{"$f":"IF(SUM(DK102:DK104)=0,\"-\",SUM(DK102:DK104))","v":20939.739213999997},21524.895804999996,{"$f":"IF(SUM(DM102:DM104)=0,\"-\",SUM(DM102:DM104))","v":23679.844326000002},22948.994161999995,22202.776756000003,21130.133044000006,21806.025851000002,22536.439337999996,{"$f":"IF(SUM(DS102:DS104)=0,\"-\",SUM(DS102:DS104))","v":24372.121099999997},{"$f":"IF(SUM(DT102:DT104)=0,\"-\",SUM(DT102:DT104))","v":21005.608344000004},{"$f":"IF(SUM(DU102:DU104)=0,\"-\",SUM(DU102:DU104))","v":22309.308049999996},{"$f":"IF(SUM(DV102:DV104)=0,\"-\",SUM(DV102:DV104))","v":19987.299020000002},{"$f":"IF(SUM(DW102:DW104)=0,\"-\",SUM(DW102:DW104))","v":21490.139701},23055.755477999992,23888.993707999998,23365.579342999998,21549.392071000002,21553.463465000001,22133.305097999997,23429.517417999999,{"$f":"IF(SUM(EE102:EE104)=0,\"-\",SUM(EE102:EE104))","v":23852.849955999998},{"$f":"IF(SUM(EF102:EF104)=0,\"-\",SUM(EF102:EF104))","v":22463.256851999999},{"$f":"IF(SUM(EG102:EG104)=0,\"-\",SUM(EG102:EG104))","v":23352.641749999995},{"$f":"IF(SUM(EH102:EH104)=0,\"-\",SUM(EH102:EH104))","v":"-"},{"$f":"IF(SUM(EI102:EI104)=0,\"-\",SUM(EI102:EI104))","v":"-"},"-","-","-","-","-","-","-"]
[]
[null,"Balance eléctrico anual peninsular (GWh)",1990,1991,1992,1993,1994,1995,1996,1997,1998,1999,2000,2001,2002,2003,2004,2005,2006,2007,2008,2009,2010,2011,2012,2013,2014,2015,2016,2017,2018,2019,2020,2021]
[null,"Hidráulica",{"$f":"SUM(Balance!C3:N3)","v":23540.760600000001},{"$f":"SUM(Balance!O3:Z3)","v":24727.9339},{"$f":"SUM(Balance!AA3:AL3)","v":16556.8675},{"$f":"SUM(Balance!AM3:AX3)","v":21514.489699999995},{"$f":"SUM(Balance!AY3:BJ3)","v":25008.665699999998},{"$f":"SUM(Balance!BK3:BV3)","v":20239.087800000001},{"$f":"SUM(Balance!BW3:CH3)","v":36324.757399999995},{"$f":"SUM(Balance!CI3:CT3)","v":31681.262700000003},{"$f":"SUM(Balance!CU3:DF3)","v":31855.535200000002},{"$f":"SUM(Balance!DG3:DR3)","v":21297.382000000005},{"$f":"SUM(Balance!DS3:ED3)","v":24057.834800000004},{"$f":"SUM(Balance!EE3:EP3)","v":36104.5772},{"$f":"SUM(Balance!EQ3:FB3)","v":17325.872599999999},{"$f":"SUM(Balance!FC3:FN3)","v":35008.3632},{"$f":"SUM(Balance!FO3:FZ3)","v":26120.459100000004},{"$f":"SUM(Balance!GA3:GL3)","v":14430.614099999992},{"$f":"SUM(Balance!GM3:GX3)","v":21226.384899999994},{"$f":"SUM(Balance!GY3:HJ3)","v":22978.978099999993},{"$f":"SUM(Balance!HK3:HV3)","v":18295.638600000002},{"$f":"SUM(Balance!HW3:IH3)","v":20732.3027},{"$f":"SUM(Balance!II3:IT3)","v":35009.454188100004},{"$f":"SUM(Balance!IU3:JF3)","v":25042.369909209996},{"$f":"SUM(Balance!JG3:JR3)","v":15977.884330298002},{"$f":"SUM(Balance!JS3:KD3)","v":30287.504563939998},{"$f":"SUM(Balance!KE3:KP3)","v":32042.878507204001},{"$f":"SUM(Balance!KQ3:LB3)","v":28322.424284850003},{"$f":"SUM(Balance!LC3:LN3)","v":36039.153717771995},{"$f":"SUM(Balance!LO3:LZ3)","v":18360.500145036},{"$f":"SUM(Balance!MA3:ML3)","v":8961.7111101360006},"-","-","-"]
[null,"Turbinación bombeo",{"$f":"SUM(Balance!C4:N4)","v":727.49040000000002},{"$f":"SUM(Balance!O4:Z4)","v":1002.9131},{"$f":"SUM(Balance!AA4:AL4)","v":1953.4935},{"$f":"SUM(Balance!AM4:AX4)","v":1321.2912999999999},{"$f":"SUM(Balance!AY4:BJ4)","v":941.77229999999986},{"$f":"SUM(Balance!BK4:BV4)","v":1457.2081999999998},{"$f":"SUM(Balance!BW4:CH4)","v":1065.8326000000002},{"$f":"SUM(Balance!CI4:CT4)","v":1232.6223},{"$f":"SUM(Balance!CU4:DF4)","v":1811.4277999999999},{"$f":"SUM(Balance!DG4:DR4)","v":2566.4659999999999},{"$f":"SUM(Balance!DS4:ED4)","v":3434.8202000000001},{"$f":"SUM(Balance!EE4:EP4)","v":2891.8847999999998},{"$f":"SUM(Balance!EQ4:FB4)","v":4869.6773999999987},{"$f":"SUM(Balance!FC4:FN4)","v":3274.6938},{"$f":"SUM(Balance!FO4:FZ4)","v":3223.2948999999999},{"$f":"SUM(Balance!GA4:GL4)","v":4449.8628999999992},{"$f":"SUM(Balance!GM4:GX4)","v":3743.8611000000001},{"$f":"SUM(Balance!GY4:HJ4)","v":3102.6008999999999},{"$f":"SUM(Balance!HK4:HV4)","v":2661.7513999999996},{"$f":"SUM(Balance!HW4:IH4)","v":2655.9322999999999},{"$f":"SUM(Balance!II4:IT4)","v":3120.4478038999996},{"$f":"SUM(Balance!IU4:JF4)","v":2183.53623079},{"$f":"SUM(Balance!JG4:JR4)","v":3201.889743702},{"$f":"SUM(Balance!JS4:KD4)","v":3289.6771840599995},{"$f":"SUM(Balance!KE4:KP4)","v":3415.9960267959996},{"$f":"SUM(Balance!KQ4:LB4)","v":2895.3657881499998},{"$f":"SUM(Balance!LC4:LN4)","v":3134.3289102280005},{"$f":"SUM(Balance!LO4:LZ4)","v":2248.9938579640002},{"$f":"SUM(Balance!MA4:ML4)","v":737.83555886399995},"-","-","-"]
[null,"Nuclear",{"$f":"SUM(Balance!C5:N5)","v":51905.668000000005},{"$f":"SUM(Balance!O5:Z5)","v":53162.400000000009},{"$f":"SUM(Balance!AA5:AL5)","v":53360.06},{"$f":"SUM(Balance!AM5:AX5)","v":53665.29},{"$f":"SUM(Balance!AY5:BJ5)","v":52995.802999999993},{"$f":"SUM(Balance!BK5:BV5)","v":53138.097999999998},{"$f":"SUM(Balance!BW5:CH5)","v":54112.745999999999},{"$f":"SUM(Balance!CI5:CT5)","v":53048.341999999997},{"$f":"SUM(Balance!CU5:DF5)","v":56572.047000000013},{"$f":"SUM(Balance!DG5:DR5)","v":56378.196999999993},{"$f":"SUM(Balance!DS5:ED5)","v":59530.32},{"$f":"SUM(Balance!EE5:EP5)","v":60985.213000000003},{"$f":"SUM(Balance!EQ5:FB5)","v":60288.447},{"$f":"SUM(Balance!FC5:FN5)","v":59219.589999999989},{"$f":"SUM(Balance!FO5:FZ5)","v":60875.742000000006},{"$f":"SUM(Balance!GA5:GL5)","v":54901.832999999999},{"$f":"SUM(Balance!GM5:GX5)","v":57353.705999999998},{"$f":"SUM(Balance!GY5:HJ5)","v":52638.926999999996},{"$f":"SUM(Balance!HK5:HV5)","v":56460.290999999997},{"$f":"SUM(Balance!HW5:IH5)","v":50549.445000000007},{"$f":"SUM(Balance!II5:IT5)","v":59242.321647000004},{"$f":"SUM(Balance!IU5:JF5)","v":55103.931311},{"$f":"SUM(Balance!JG5:JR5)","v":58666.987000000008},{"$f":"SUM(Balance!JS5:KD5)","v":54306.887000000002},{"$f":"SUM(Balance!KE5:KP5)","v":54870.239000000009},{"$f":"SUM(Balance!KQ5:LB5)","v":54754.839048000002},{"$f":"SUM(Balance!LC5:LN5)","v":56098.972000000002},{"$f":"SUM(Balance!LO5:LZ5)","v":55608.922000000006},{"$f":"SUM(Balance!MA5:ML5)","v":14179.739099999999},"-","-","-"]
[null,"Carbón",{"$f":"SUM(Balance!C6:N6)","v":55338.808000000005},{"$f":"SUM(Balance!O6:Z6)","v":55804.307000000001},{"$f":"SUM(Balance!AA6:AL6)","v":59825.894999999997},{"$f":"SUM(Balance!AM6:AX6)","v":57851.097999999998},{"$f":"SUM(Balance!AY6:BJ6)","v":57174.709000000003},{"$f":"SUM(Balance!BK6:BV6)","v":61234.712},{"$f":"SUM(Balance!BW6:CH6)","v":49468.669000000002},{"$f":"SUM(Balance!CI6:CT6)","v":58519.805999999997},{"$f":"SUM(Balance!CU6:DF6)","v":56925.974999999999},{"$f":"SUM(Balance!DG6:DR6)","v":68405.633000000002},{"$f":"SUM(Balance!DS6:ED6)","v":72228.170999999988},{"$f":"SUM(Balance!EE6:EP6)","v":64448.903999999995},{"$f":"SUM(Balance!EQ6:FB6)","v":74555.690999999992},{"$f":"SUM(Balance!FC6:FN6)","v":68293.165999999997},{"$f":"SUM(Balance!FO6:FZ6)","v":72120.106},{"$f":"SUM(Balance!GA6:GL6)","v":72994.088999999993},{"$f":"SUM(Balance!GM6:GX6)","v":62126.065000000002},{"$f":"SUM(Balance!GY6:HJ6)","v":67686.248000000007},{"$f":"SUM(Balance!HK6:HV6)","v":43409.537000000004},{"$f":"SUM(Balance!HW6:IH6)","v":31622.562000000002},{"$f":"SUM(Balance!II6:IT6)","v":20599.255834},{"$f":"SUM(Balance!IU6:JF6)","v":40501.827407000004},{"$f":"SUM(Balance!JG6:JR6)","v":51130.886036999989},{"$f":"SUM(Balance!JS6:KD6)","v":37176.883000000002},{"$f":"SUM(Balance!KE6:KP6)","v":41132.677000000003},{"$f":"SUM(Balance!KQ6:LB6)","v":50923.77236699999},{"$f":"SUM(Balance!LC6:LN6)","v":35187.504000000001},{"$f":"SUM(Balance!LO6:LZ6)","v":42592.924458000009},{"$f":"SUM(Balance!MA6:ML6)","v":7862.6734999999999},"-","-","-"]
[null,"Fuel + Gas",{"$f":"SUM(Balance!C7:N7)","v":2865.9459999999999},{"$f":"SUM(Balance!O7:Z7)","v":4041.6849999999999},{"$f":"SUM(Balance!AA7:AL7)","v":7463.5830000000014},{"$f":"SUM(Balance!AM7:AX7)","v":1777.1469999999999},{"$f":"SUM(Balance!AY7:BJ7)","v":1412.1849999999999},{"$f":"SUM(Balance!BK7:BV7)","v":3661.1629999999996},{"$f":"SUM(Balance!BW7:CH7)","v":2043.33},{"$f":"SUM(Balance!CI7:CT7)","v":6552.5410000000002},{"$f":"SUM(Balance!CU7:DF7)","v":5338.8809999999994},{"$f":"SUM(Balance!DG7:DR7)","v":9350.6630000000005},{"$f":"SUM(Balance!DS7:ED7)","v":9565.2989999999991},{"$f":"SUM(Balance!EE7:EP7)","v":11579.619000000001},{"$f":"SUM(Balance!EQ7:FB7)","v":15545.682000000004},{"$f":"SUM(Balance!FC7:FN7)","v":7431.6419999999998},{"$f":"SUM(Balance!FO7:FZ7)","v":7089.4679999999998},{"$f":"SUM(Balance!GA7:GL7)","v":9294.3179999999993},{"$f":"SUM(Balance!GM7:GX7)","v":5396.0580000000009},{"$f":"SUM(Balance!GY7:HJ7)","v":2090.7650000000003},{"$f":"SUM(Balance!HK7:HV7)","v":2074.895},{"$f":"SUM(Balance!HW7:IH7)","v":1789.5900000000001},{"$f":"SUM(Balance!II7:IT7)","v":1566.0229999999999},{"$f":"SUM(Balance!IU7:JF7)","v":0},{"$f":"SUM(Balance!JG7:JR7)","v":0},{"$f":"SUM(Balance!JS7:KD7)","v":0},{"$f":"SUM(Balance!KE7:KP7)","v":0},{"$f":"SUM(Balance!KQ7:LB7)","v":0},{"$f":"SUM(Balance!LC7:LN7)","v":0},{"$f":"SUM(Balance!LO7:LZ7)","v":0},{"$f":"SUM(Balance!MA7:ML7)","v":0},"-","-","-"]
[null,"Ciclo combinado",{"$f":"SUM(Balance!C8:N8)","v":0},{"$f":"SUM(Balance!O8:Z8)","v":0},{"$f":"SUM(Balance!AA8:AL8)","v":0},{"$f":"SUM(Balance!AM8:AX8)","v":0.21299999999999999},{"$f":"SUM(Balance!AY8:BJ8)","v":0},{"$f":"SUM(Balance!BK8:BV8)","v":0},{"$f":"SUM(Balance!BW8:CH8)","v":0},{"$f":"SUM(Balance!CI8:CT8)","v":0},{"$f":"SUM(Balance!CU8:DF8)","v":0},{"$f":"SUM(Balance!DG8:DR8)","v":0},{"$f":"SUM(Balance!DS8:ED8)","v":0},{"$f":"SUM(Balance!EE8:EP8)","v":0},{"$f":"SUM(Balance!EQ8:FB8)","v":5155.6730000000007},{"$f":"SUM(Balance!FC8:FN8)","v":14626.086000000003},{"$f":"SUM(Balance!FO8:FZ8)","v":28312.845000000001},{"$f":"SUM(Balance!GA8:GL8)","v":47846.789000000004},{"$f":"SUM(Balance!GM8:GX8)","v":62122.434000000001},{"$f":"SUM(Balance!GY8:HJ8)","v":66572.867999999988},{"$f":"SUM(Balance!HK8:HV8)","v":89100.732000000004},{"$f":"SUM(Balance!HW8:IH8)","v":76379.284},{"$f":"SUM(Balance!II8:IT8)","v":62954.940244999991},{"$f":"SUM(Balance!IU8:JF8)","v":49411.657004999994},{"$f":"SUM(Balance!JG8:JR8)","v":37531.666771000004},{"$f":"SUM(Balance!JS8:KD8)","v":24360.581872000002},{"$f":"SUM(Balance!KE8:KP8)","v":21336.753903000001},{"$f":"SUM(Balance!KQ8:LB8)","v":25268.468001999998},{"$f":"SUM(Balance!LC8:LN8)","v":25686.148787999999},{"$f":"SUM(Balance!LO8:LZ8)","v":33854.527929999997},{"$f":"SUM(Balance!MA8:ML8)","v":5470.1787999999997},"-","-","-"]
[null,"Régimen ordinario",{"$f":"SUM(C108:C113)","v":134378.67300000001},{"$f":"SUM(D108:D113)","v":138739.239},139159.899,136129.52899999998,137533.13500000001,139730.269,143015.33499999999,151034.57399999999,152503.86600000001,157998.34100000001,168816.44500000001,176010.198,177741.04300000001,187853.541,197741.91500000001,203917.50599999999,211968.50899999999,215070.38700000002,212002.845,183729.11600000001,182492.44271799998,172243.32186299999,166509.31388199999,{"$f":"SUM(Z108:Z113)","v":149421.53362},"-","-","-","-","-","-","-","-"]
[null,"Hidráulica/Resto hidráulica",{"$f":"SUM(Balance!C10:N10)","v":982.63199996000014},{"$f":"SUM(Balance!O10:Z10)","v":1704.7810000000002},{"$f":"SUM(Balance!AA10:AL10)","v":2081.7730000000001},{"$f":"SUM(Balance!AM10:AX10)","v":2234.2280000000001},{"$f":"SUM(Balance!AY10:BJ10)","v":2475.268},{"$f":"SUM(Balance!BK10:BV10)","v":2222.8739999999998},{"$f":"SUM(Balance!BW10:CH10)","v":3543.8470000000002},{"$f":"SUM(Balance!CI10:CT10)","v":3428.9950000000003},{"$f":"SUM(Balance!CU10:DF10)","v":3578.4739169999993},{"$f":"SUM(Balance!DG10:DR10)","v":3740.3226119999995},{"$f":"SUM(Balance!DS10:ED10)","v":3836.0999330000004},{"$f":"SUM(Balance!EE10:EP10)","v":4287.5226330000005},{"$f":"SUM(Balance!EQ10:FB10)","v":3899.4523389999999},{"$f":"SUM(Balance!FC10:FN10)","v":5088.644045},{"$f":"SUM(Balance!FO10:FZ10)","v":4749.5783850000016},{"$f":"SUM(Balance!GA10:GL10)","v":3817.5829390000013},{"$f":"SUM(Balance!GM10:GX10)","v":4148.5638790000012},{"$f":"SUM(Balance!GY10:HJ10)","v":4125.3249999999998},{"$f":"SUM(Balance!HK10:HV10)","v":4638.143},{"$f":"SUM(Balance!HW10:IH10)","v":5453.6730000000007},{"$f":"SUM(Balance!II10:IT10)","v":6824.32},{"$f":"SUM(Balance!IU10:JF10)","v":5294.3149999999996},{"$f":"SUM(Balance!JG10:JR10)","v":4644.5460000000003},{"$f":"SUM(Balance!JS10:KD10)","v":7099.1549999999997},{"$f":"SUM(Balance!KE10:KP10)","v":7069.52},"-","-","-","-","-","-","-"]
[null,"Eólica",{"$f":"SUM(Balance!C11:N11)","v":2.18699998},{"$f":"SUM(Balance!O11:Z11)","v":2.8650000000000002},{"$f":"SUM(Balance!AA11:AL11)","v":17.361000000000001},{"$f":"SUM(Balance!AM11:AX11)","v":84.768000000000001},{"$f":"SUM(Balance!AY11:BJ11)","v":72.859999999999985},{"$f":"SUM(Balance!BK11:BV11)","v":159.85699999999997},{"$f":"SUM(Balance!BW11:CH11)","v":304.12899999999996},{"$f":"SUM(Balance!CI11:CT11)","v":619.88499999999999},{"$f":"SUM(Balance!CU11:DF11)","v":1236.6567059999998},{"$f":"SUM(Balance!DG11:DR11)","v":2474.0332980000003},{"$f":"SUM(Balance!DS11:ED11)","v":4462.4960500000007},{"$f":"SUM(Balance!EE11:EP11)","v":6594.1481130000002},{"$f":"SUM(Balance!EQ11:FB11)","v":9259.2966869999982},{"$f":"SUM(Balance!FC11:FN11)","v":11720.246133000002},{"$f":"SUM(Balance!FO11:FZ11)","v":15754.117769000002},{"$f":"SUM(Balance!GA11:GL11)","v":20857.665958999998},{"$f":"SUM(Balance!GM11:GX11)","v":22880.856075000003},{"$f":"SUM(Balance!GY11:HJ11)","v":27249.154999999999},{"$f":"SUM(Balance!HK11:HV11)","v":31757.850000000006},{"$f":"SUM(Balance!HW11:IH11)","v":37888.576999999997},{"$f":"SUM(Balance!II11:IT11)","v":43208.396000000001},{"$f":"SUM(Balance!IU11:JF11)","v":42105.433000000005},{"$f":"SUM(Balance!JG11:JR11)","v":48140.064999999995},{"$f":"SUM(Balance!JS11:KD11)","v":54344.351999999992},{"$f":"SUM(Balance!KE11:KP11)","v":50634.89},{"$f":"SUM(Balance!KQ11:LB11)","v":47713.149999999994},{"$f":"SUM(Balance!LC11:LN11)","v":47298.170000000006},{"$f":"SUM(Balance!LO11:LZ11)","v":47498.142000000007},{"$f":"SUM(Balance!MA11:ML11)","v":17589.002293999998},"-","-","-"]
[null,"Solar fotovoltaica",{"$f":"SUM(Balance!C12:N12)","v":0},{"$f":"SUM(Balance!O12:Z12)","v":0},{"$f":"SUM(Balance!AA12:AL12)","v":12.055999999999999},{"$f":"SUM(Balance!AM12:AX12)","v":12.000000000000002},{"$f":"SUM(Balance!AY12:BJ12)","v":15.295899999999996},{"$f":"SUM(Balance!BK12:BV12)","v":1.0619999999999998},{"$f":"SUM(Balance!BW12:CH12)","v":0.89100000000000001},{"$f":"SUM(Balance!CI12:CT12)","v":1.127},{"$f":"SUM(Balance!CU12:DF12)","v":1.1702970000000001},{"$f":"SUM(Balance!DG12:DR12)","v":1.341181},{"$f":"SUM(Balance!DS12:ED12)","v":1.269817},{"$f":"SUM(Balance!EE12:EP12)","v":1.639643},{"$f":"SUM(Balance!EQ12:FB12)","v":4.5614520000000001},{"$f":"SUM(Balance!FC12:FN12)","v":8.9301049999999957},{"$f":"SUM(Balance!FO12:FZ12)","v":17.794010999999976},{"$f":"SUM(Balance!GA12:GL12)","v":40.088349000000001},{"$f":"SUM(Balance!GM12:GX12)","v":102.37499899999992},{"$f":"SUM(Balance!GY12:HJ12)","v":462.577},{"$f":"SUM(Balance!HK12:HV12)","v":2406.0700000000002},{"$f":"SUM(Balance!HW12:IH12)","v":5829.0049999999992},{"$f":"SUM(Balance!II12:IT12)","v":6139.7820000000002},{"$f":"SUM(Balance!IU12:JF12)","v":7091.688000000001},{"$f":"SUM(Balance!JG12:JR12)","v":7829.9009999999998},{"$f":"SUM(Balance!JS12:KD12)","v":7918.0379999999996},{"$f":"SUM(Balance!KE12:KP12)","v":7802.4239999999991},{"$f":"SUM(Balance!KQ12:LB12)","v":7844.7979999999998},{"$f":"SUM(Balance!LC12:LN12)","v":7579.3129999999992},{"$f":"SUM(Balance!LO12:LZ12)","v":7988.2159999999985},{"$f":"SUM(Balance!MA12:ML12)","v":1454.348},"-","-","-"]
[null,"Solar térmica",{"$f":"SUM(Balance!C13:N13)","v":0},{"$f":"SUM(Balance!O13:Z13)","v":0},{"$f":"SUM(Balance!AA13:AL13)","v":0},{"$f":"SUM(Balance!AM13:AX13)","v":0},{"$f":"SUM(Balance!AY13:BJ13)","v":0},{"$f":"SUM(Balance!BK13:BV13)","v":0},{"$f":"SUM(Balance!BW13:CH13)","v":0},{"$f":"SUM(Balance!CI13:CT13)","v":0},{"$f":"SUM(Balance!CU13:DF13)","v":0},{"$f":"SUM(Balance!DG13:DR13)","v":0},{"$f":"SUM(Balance!DS13:ED13)","v":0},{"$f":"SUM(Balance!EE13:EP13)","v":0},{"$f":"SUM(Balance!EQ13:FB13)","v":0},{"$f":"SUM(Balance!FC13:FN13)","v":0},{"$f":"SUM(Balance!FO13:FZ13)","v":0},{"$f":"SUM(Balance!GA13:GL13)","v":0},{"$f":"SUM(Balance!GM13:GX13)","v":0},{"$f":"SUM(Balance!GY13:HJ13)","v":7.6269999999999998},{"$f":"SUM(Balance!HK13:HV13)","v":15.378},{"$f":"SUM(Balance!HW13:IH13)","v":129.82299999999998},{"$f":"SUM(Balance!II13:IT13)","v":691.62},{"$f":"SUM(Balance!IU13:JF13)","v":1832.357},{"$f":"SUM(Balance!JG13:JR13)","v":3444.1340000000005},{"$f":"SUM(Balance!JS13:KD13)","v":4441.527000000001},{"$f":"SUM(Balance!KE13:KP13)","v":4958.9149999999991},{"$f":"SUM(Balance!KQ13:LB13)","v":5085.2350000000006},{"$f":"SUM(Balance!LC13:LN13)","v":5071.2040000000006},{"$f":"SUM(Balance!LO13:LZ13)","v":5347.9489999999996},{"$f":"SUM(Balance!MA13:ML13)","v":570.10159999999996},"-","-","-"]
[null,"Térmica renovable/Otras renovables",{"$f":"SUM(Balance!C14:N14)","v":0},{"$f":"SUM(Balance!O14:Z14)","v":0.85399999999999987},{"$f":"SUM(Balance!AA14:AL14)","v":16.548999999999999},{"$f":"SUM(Balance!AM14:AX14)","v":58.82200000000001},{"$f":"SUM(Balance!AY14:BJ14)","v":322.45},{"$f":"SUM(Balance!BK14:BV14)","v":671.26900000000001},{"$f":"SUM(Balance!BW14:CH14)","v":815.08},{"$f":"SUM(Balance!CI14:CT14)","v":648.375},{"$f":"SUM(Balance!CU14:DF14)","v":748.74632699999995},{"$f":"SUM(Balance!DG14:DR14)","v":908.25367599999993},{"$f":"SUM(Balance!DS14:ED14)","v":961.11038600000018},{"$f":"SUM(Balance!EE14:EP14)","v":1738.4584279999999},{"$f":"SUM(Balance!EQ14:FB14)","v":1453.0152859999998},{"$f":"SUM(Balance!FC14:FN14)","v":1737.0417380000004},{"$f":"SUM(Balance!FO14:FZ14)","v":1818.0936319999998},{"$f":"SUM(Balance!GA14:GL14)","v":1987.8580699999998},{"$f":"SUM(Balance!GM14:GX14)","v":2182.6066820000001},{"$f":"SUM(Balance!GY14:HJ14)","v":2375.6849999999999},{"$f":"SUM(Balance!HK14:HV14)","v":2651.4889999999996},{"$f":"SUM(Balance!HW14:IH14)","v":3044.2870000000003},{"$f":"SUM(Balance!II14:IT14)","v":3171.7989999999995},{"$f":"SUM(Balance!IU14:JF14)","v":4284.8410000000003},{"$f":"SUM(Balance!JG14:JR14)","v":4746.1490000000003},{"$f":"SUM(Balance!JS14:KD14)","v":5065.5659999999998},{"$f":"SUM(Balance!KE14:KP14)","v":4717.9780000000001},{"$f":"SUM(Balance!KQ14:LB14)","v":3173.951},{"$f":"SUM(Balance!LC14:LN14)","v":3413.9139999999998},{"$f":"SUM(Balance!LO14:LZ14)","v":3602.913},{"$f":"SUM(Balance!MA14:ML14)","v":877.30560000000003},"-","-","-"]
[null,"Térmica no renovable/Cogeneración y resto/Cogeneración",{"$f":"SUM(Balance!C15:N15)","v":654.85700006000002},{"$f":"SUM(Balance!O15:Z15)","v":1435.9839999999997},{"$f":"SUM(Balance!AA15:AL15)","v":1902.8819999999998},{"$f":"SUM(Balance!AM15:AX15)","v":3307.5039999999999},{"$f":"SUM(Balance!AY15:BJ15)","v":5311.9911000000002},{"$f":"SUM(Balance!BK15:BV15)","v":6540.7530000000006},{"$f":"SUM(Balance!BW15:CH15)","v":8991.82},{"$f":"SUM(Balance!CI15:CT15)","v":11462.615999999998},{"$f":"SUM(Balance!CU15:DF15)","v":14168.280752999999},{"$f":"SUM(Balance!DG15:DR15)","v":17137.272233000003},{"$f":"SUM(Balance!DS15:ED15)","v":17379.554813999999},{"$f":"SUM(Balance!EE15:EP15)","v":17656.688182999998},{"$f":"SUM(Balance!EQ15:FB15)","v":20831.652236000002},{"$f":"SUM(Balance!FC15:FN15)","v":22845.346978999998},{"$f":"SUM(Balance!FO15:FZ15)","v":23528.704202999998},{"$f":"SUM(Balance!GA15:GL15)","v":23263.703683},{"$f":"SUM(Balance!GM15:GX15)","v":22318.939364999995},{"$f":"SUM(Balance!GY15:HJ15)","v":23327.756999999998},{"$f":"SUM(Balance!HK15:HV15)","v":26575.975999999999},{"$f":"SUM(Balance!HW15:IH15)","v":28465.934000000001},{"$f":"SUM(Balance!II15:IT15)","v":30789.052000000003},{"$f":"SUM(Balance!IU15:JF15)","v":32051.011999999995},{"$f":"SUM(Balance!JG15:JR15)","v":33492.864000000001},{"$f":"SUM(Balance!JS15:KD15)","v":32036.724999999999},{"$f":"SUM(Balance!KE15:KP15)","v":25595.536},{"$f":"SUM(Balance!KQ15:LB15)","v":25417.974999999999},{"$f":"SUM(Balance!LC15:LN15)","v":25871.911999999997},{"$f":"SUM(Balance!LO15:LZ15)","v":28134.275999999998},{"$f":"SUM(Balance!MA15:ML15)","v":7217.2237059999989},"-","-","-"]
[null,"Residuos no renovables","-","-","-","-","-","-","-","-","-","-","-","-","-","-","-","-","-","-","-","-","-","-","-","-","-",{"$f":"SUM(Balance!KQ16:LB16)","v":2324.7159999999999},{"$f":"SUM(Balance!LC16:LN16)","v":2471.3094999999998},{"$f":"SUM(Balance!LO16:LZ16)","v":2458.8085000000001},{"$f":"SUM(Balance!MA16:ML16)","v":646.07664999999997},"-","-","-"]
[null,"Residuos renovables","-","-","-","-","-","-","-","-","-","-","-","-","-","-","-","-","-","-","-","-","-","-","-","-","-",{"$f":"SUM(Balance!KQ17:LB17)","v":662.65500000000009},{"$f":"SUM(Balance!LC17:LN17)","v":649.74149999999997},{"$f":"SUM(Balance!LO17:LZ17)","v":728.15049999999997},{"$f":"SUM(Balance!MA17:ML17)","v":198.14954999999998},"-","-","-"]
[null,"Régimen especial",{"$f":"SUM(C115:C122)","v":1639.6760000000002},{"$f":"SUM(D115:D122)","v":3144.4839999999999},4030.6210000000001,5697.3220000000001,8197.8649999999998,9595.8150000000005,13655.767,16160.997999999998,19733.327999999998,24261.223000000005,26640.531000000003,30278.456999999999,35447.978000000003,41400.209000000003,45868.288,49966.898999999998,51633.341,57548.125999999997,68044.906000000003,80811.298999999999,90824.969000000012,92659.646000000008,102297.659,{"$f":"SUM(Z115:Z122)","v":110905.36299999998},"-","-","-","-","-","-","-","-"]
[null,"Generación",{"$f":"SUM(C114:C114,C123)","v":136018.34900000002},141883.723,143190.52000000002,{"$f":"SUM(F114:F114,F123)","v":141826.85099999997},145731,149326.084,156671.10199999998,167195.57199999999,172237.19400000002,182259.56400000001,195456.97600000002,206288.655,213189.02100000001,229253.75,243610.20300000001,253884.405,263601.84999999998,272618.51300000004,280047.75099999999,264540.41500000004,273317.41171799996,264902.967863,268806.97288199997,{"$f":"SUM(Z114:Z114,Z123)","v":260326.89661999998},{"$f":"SUM(AA108:AA113,AA115:AA122)","v":253577.80743699998},{"$f":"SUM(AB108:AB113,AB115:AB122)","v":254387.34949000002},248501.67141600003,248424.32339100001,65764.345468999993,"-","-","-"]
[null,"Consumos en bombeo",{"$f":"SUM(Balance!C20:N20)","v":-1039.2719999999997},{"$f":"SUM(Balance!O20:Z20)","v":-1432.7330000000002},{"$f":"SUM(Balance!AA20:AL20)","v":-2790.7050000000004},{"$f":"SUM(Balance!AM20:AX20)","v":-1887.5589999999997},{"$f":"SUM(Balance!AY20:BJ20)","v":-1345.3890000000001},{"$f":"SUM(Balance!BK20:BV20)","v":-2081.7260000000001},{"$f":"SUM(Balance!BW20:CH20)","v":-1522.6180000000002},{"$f":"SUM(Balance!CI20:CT20)","v":-1760.8889999999997},{"$f":"SUM(Balance!CU20:DF20)","v":-2587.7539999999999},{"$f":"SUM(Balance!DG20:DR20)","v":-3666.38},{"$f":"SUM(Balance!DS20:ED20)","v":-4906.8859999999995},{"$f":"SUM(Balance!EE20:EP20)","v":-4131.264000000001},{"$f":"SUM(Balance!EQ20:FB20)","v":-6956.6819999999998},{"$f":"SUM(Balance!FC20:FN20)","v":-4678.134},{"$f":"SUM(Balance!FO20:FZ20)","v":-4604.7070000000003},{"$f":"SUM(Balance!GA20:GL20)","v":-6356.9470000000001},{"$f":"SUM(Balance!GM20:GX20)","v":-5348.3729999999996},{"$f":"SUM(Balance!GY20:HJ20)","v":-4432.2870000000003},{"$f":"SUM(Balance!HK20:HV20)","v":-3802.502},{"$f":"SUM(Balance!HW20:IH20)","v":-3794.1889999999999},{"$f":"SUM(Balance!II20:IT20)","v":-4457.7825769999999},{"$f":"SUM(Balance!IU20:JF20)","v":-3214.9598150000002},{"$f":"SUM(Balance!JG20:JR20)","v":-5022.5477879999999},{"$f":"SUM(Balance!JS20:KD20)","v":-5957.8449899999996},{"$f":"SUM(Balance!KE20:KP20)","v":-5329.5900510000001},{"$f":"SUM(Balance!KQ20:LB20)","v":-4520.0941789999997},{"$f":"SUM(Balance!LC20:LN20)","v":-4819.4130750000004},{"$f":"SUM(Balance!LO20:LZ20)","v":-3675.2379039999996},{"$f":"SUM(Balance!MA20:ML20)","v":-1372.7395409999999},"-","-","-"]
[null,"Enlace Península-Baleares","-","-","-","-","-","-","-","-","-","-","-","-","-","-","-","-","-","-","-","-","-",{"$f":"SUM(Balance!IU21:JF21)","v":-0.47640899999999997},{"$f":"SUM(Balance!JG21:JR21)","v":-570.24920300000008},{"$f":"SUM(Balance!JS21:KD21)","v":-1268.5085999999999},{"$f":"SUM(Balance!KE21:KP21)","v":-1298.2644039999998},{"$f":"SUM(Balance!KQ21:LB21)","v":-1335.7828019999999},{"$f":"SUM(Balance!LC21:LN21)","v":-1250.5825009999999},{"$f":"SUM(Balance!LO21:LZ21)","v":-1179.300653},{"$f":"SUM(Balance!MA21:ML21)","v":-276.30392799999998},"-","-","-"]
[null,"Saldo intercambios internacionales",{"$f":"SUM(Balance!C22:N22)","v":-419.57900000000012},{"$f":"SUM(Balance!O22:Z22)","v":-676.58600000000001},{"$f":"SUM(Balance!AA22:AL22)","v":641.12400000000002},{"$f":"SUM(Balance!AM22:AX22)","v":1267.0719999999997},{"$f":"SUM(Balance!AY22:BJ22)","v":1855.105},{"$f":"SUM(Balance!BK22:BV22)","v":4489.0450000000001},{"$f":"SUM(Balance!BW22:CH22)","v":1059.3659999999998},{"$f":"SUM(Balance!CI22:CT22)","v":-3072.8720000000003},{"$f":"SUM(Balance!CU22:DF22)","v":3401.864},{"$f":"SUM(Balance!DG22:DR22)","v":5719.244999999999},{"$f":"SUM(Balance!DS22:ED22)","v":4440.5950000000003},{"$f":"SUM(Balance!EE22:EP22)","v":3457.9599999999996},{"$f":"SUM(Balance!EQ22:FB22)","v":5328.768},{"$f":"SUM(Balance!FC22:FN22)","v":1263.9020000000003},{"$f":"SUM(Balance!FO22:FZ22)","v":-3027.0179999999996},{"$f":"SUM(Balance!GA22:GL22)","v":-1343.394},{"$f":"SUM(Balance!GM22:GX22)","v":-3272.518},{"$f":"SUM(Balance!GY22:HJ22)","v":-5750.4650000000001},{"$f":"SUM(Balance!HK22:HV22)","v":-11039.585999999999},{"$f":"SUM(Balance!HW22:IH22)","v":-8086.4139999999998},{"$f":"SUM(Balance!II22:IT22)","v":-8332.6790579999997},{"$f":"SUM(Balance!IU22:JF22)","v":-6090.1263339999996},{"$f":"SUM(Balance!JG22:JR22)","v":-11199.953591},{"$f":"SUM(Balance!JS22:KD22)","v":-6732.1324500000001},{"$f":"SUM(Balance!KE22:KP22)","v":-3406.1249290000001},{"$f":"SUM(Balance!KQ22:LB22)","v":-133.16322499999978},{"$f":"SUM(Balance!LC22:LN22)","v":7667.313553},{"$f":"SUM(Balance!LO22:LZ22)","v":9170.5836430000018},{"$f":"SUM(Balance!MA22:ML22)","v":1904.5980349999998},"-","-","-"]
[null,"Demanda transporte (b.c.)",{"$f":"SUM(C124:C127)","v":134559.49800000002},139774.40399999998,141040.93900000004,141206.36399999994,146240.71600000001,151733.40300000002,156207.85,162361.81099999999,173051.30400000003,184312.429,194990.68500000003,205615.351,211561.10700000002,225839.51800000001,235978.478,246184.06399999998,254980.95899999997,262435.761,265205.663,252659.81200000003,260526.95008299997,255597.40530499999,252014.22229999996,{"$f":"SUM(Z124:Z127)","v":246368.41057999997},243543.82805299998,{"$f":"SUM(AB124:AB127)","v":248398.30928400002},{"$f":"SUM(AC124:AC127)","v":250098.98939300003},{"$f":"SUM(AD124:AD127)","v":252740.36847699998},{"$f":"SUM(AE124:AE127)","v":66019.900034999984},"-","-","-"]
[]
[null,"Balance eléctrico anual Islas Baleares (MWh)",2006,2007,2008,2009,2010,2011,2012,2013,2014,2015,2016,2017,2018,2019,2020,2021]
[null,"Carbón",{"$f":"SUM(Balance!C26:N26)","v":3077310},{"$f":"SUM(Balance!O26:Z26)","v":2943855},{"$f":"SUM(Balance!AA26:AL26)","v":3098826},{"$f":"SUM(Balance!AM26:AX26)","v":3170463},{"$f":"SUM(Balance!AY26:BJ26)","v":3101357.5659999996},{"$f":"SUM(Balance!BK26:BV26)","v":2764866.8510000007},{"$f":"SUM(Balance!BW26:CH26)","v":2682531.568},{"$f":"SUM(Balance!CI26:CT26)","v":2350680.7719999999},{"$f":"SUM(Balance!CU26:DF26)","v":2187625.804},{"$f":"SUM(Balance!DG26:DR26)","v":1865268.2970000003},{"$f":"SUM(Balance!DS26:ED26)","v":2303768.3020000001},{"$f":"SUM(Balance!EE26:EP26)","v":2603343.9639999997},{"$f":"SUM(Balance!EQ26:FB26)","v":591565.78499999992},"-","-","-"]
[null,"Motores diesel",{"$f":"SUM(Balance!C27:N27)","v":964902},{"$f":"SUM(Balance!O27:Z27)","v":1005606},{"$f":"SUM(Balance!AA27:AL27)","v":1047081},{"$f":"SUM(Balance!AM27:AX27)","v":971825},{"$f":"SUM(Balance!AY27:BJ27)","v":1027620.046},{"$f":"SUM(Balance!BK27:BV27)","v":923775.61600000004},{"$f":"SUM(Balance!BW27:CH27)","v":934769.9530000001},{"$f":"SUM(Balance!CI27:CT27)","v":743951.84400000004},{"$f":"SUM(Balance!CU27:DF27)","v":671248.32699999993},{"$f":"SUM(Balance!DG27:DR27)","v":729765.87399999995},{"$f":"SUM(Balance!DS27:ED27)","v":963404.14399999997},{"$f":"SUM(Balance!EE27:EP27)","v":798894.04299999995},{"$f":"SUM(Balance!EQ27:FB27)","v":114895.74099999999},"-","-","-"]
[null,"Turbina de gas",{"$f":"SUM(Balance!C28:N28)","v":292054.95199999999},{"$f":"SUM(Balance!O28:Z28)","v":311441},{"$f":"SUM(Balance!AA28:AL28)","v":272502},{"$f":"SUM(Balance!AM28:AX28)","v":339369},{"$f":"SUM(Balance!AY28:BJ28)","v":299414.36599999998},{"$f":"SUM(Balance!BK28:BV28)","v":350925.136},{"$f":"SUM(Balance!BW28:CH28)","v":340944.54099999997},{"$f":"SUM(Balance!CI28:CT28)","v":509306.95299999998},{"$f":"SUM(Balance!CU28:DF28)","v":581727.70699999994},{"$f":"SUM(Balance!DG28:DR28)","v":582137.98199999996},{"$f":"SUM(Balance!DS28:ED28)","v":338287.83099999995},{"$f":"SUM(Balance!EE28:EP28)","v":554119.88},{"$f":"SUM(Balance!EQ28:FB28)","v":180777.34},"-","-","-"]
[null,"Fuel + Gas",{"$f":"SUM(C132:C133)","v":1256956.952},1317047,1319583,1311194,1327034.412,1274700.7520000001,1275714.4939999999,1253258.797,1252976.034,{"$f":"SUM(Balance!DG29:DR29)","v":1311903.8559999999},{"$f":"SUM(Balance!DS29:ED29)","v":1301691.9750000001},{"$f":"SUM(Balance!EE29:EP29)","v":1353013.9230000002},{"$f":"SUM(Balance!EQ29:FB29)","v":295673.08100000001},"-","-","-"]
[null,"Ciclo combinado",{"$f":"SUM(Balance!C30:N30)","v":1341915},{"$f":"SUM(Balance!O30:Z30)","v":1583995},{"$f":"SUM(Balance!AA30:AL30)","v":1523490},{"$f":"SUM(Balance!AM30:AX30)","v":1292183},{"$f":"SUM(Balance!AY30:BJ30)","v":1135633.7220000001},{"$f":"SUM(Balance!BK30:BV30)","v":1326738.3859999999},{"$f":"SUM(Balance!BW30:CH30)","v":890560.32},{"$f":"SUM(Balance!CI30:CT30)","v":413575.82400000002},{"$f":"SUM(Balance!CU30:DF30)","v":426924.70399999997},{"$f":"SUM(Balance!DG30:DR30)","v":809239.36800000013},{"$f":"SUM(Balance!DS30:ED30)","v":542553.09600000002},{"$f":"SUM(Balance!EE30:EP30)","v":426188.67100000003},{"$f":"SUM(Balance!EQ30:FB30)","v":118681.98400000001},"-","-","-"]
[null,"Generación auxiliar",{"$f":"SUM(Balance!C31:N31)","v":6350.2199999999721},{"$f":"SUM(Balance!O31:Z31)","v":12612},{"$f":"SUM(Balance!AA31:AL31)","v":5931},{"$f":"SUM(Balance!AM31:AX31)","v":5566},{"$f":"SUM(Balance!AY31:BJ31)","v":6694.3319999999994},{"$f":"SUM(Balance!BK31:BV31)","v":8724.6810000000005},{"$f":"SUM(Balance!BW31:CH31)","v":8809.7250000000004},{"$f":"SUM(Balance!CI31:CT31)","v":6900.8020000000006},{"$f":"SUM(Balance!CU31:DF31)","v":7695.201},{"$f":"SUM(Balance!DG31:DR31)","v":10581.855},{"$f":"SUM(Balance!DS31:ED31)","v":10091.754999999999},{"$f":"SUM(Balance!EE31:EP31)","v":14745.847},{"$f":"SUM(Balance!EQ31:FB31)","v":0},"-","-","-"]
[null,"Régimen ordinario",{"$f":"SUM(C131,C134:C136)","v":5682532.1719999993},5857509,5947830,5779406,5570720.0320000006,5375030.6700000009,4857616.1069999998,4024416.1950000003,"-","-","-","-","-","-","-","-"]
[null,"Eólica",{"$f":"SUM(Balance!C33:N33)","v":4877.3560000000007},{"$f":"SUM(Balance!O33:Z33)","v":5656},{"$f":"SUM(Balance!AA33:AL33)","v":5497},{"$f":"SUM(Balance!AM33:AX33)","v":5543},{"$f":"SUM(Balance!AY33:BJ33)","v":5571},{"$f":"SUM(Balance!BK33:BV33)","v":5829},{"$f":"SUM(Balance!BW33:CH33)","v":6505},{"$f":"SUM(Balance!CI33:CT33)","v":6160},{"$f":"SUM(Balance!CU33:DF33)","v":5839},{"$f":"SUM(Balance!DG33:DR33)","v":5317.02},{"$f":"SUM(Balance!DS33:ED33)","v":5414.6399999999994},{"$f":"SUM(Balance!EE33:EP33)","v":2925},{"$f":"SUM(Balance!EQ33:FB33)","v":945.49},"-","-","-"]
[null,"Solar fotovoltaica",{"$f":"SUM(Balance!C34:N34)","v":1100.7949999999998},{"$f":"SUM(Balance!O34:Z34)","v":1952},{"$f":"SUM(Balance!AA34:AL34)","v":28380},{"$f":"SUM(Balance!AM34:AX34)","v":80933},{"$f":"SUM(Balance!AY34:BJ34)","v":87757},{"$f":"SUM(Balance!BK34:BV34)","v":101221},{"$f":"SUM(Balance!BW34:CH34)","v":115594},{"$f":"SUM(Balance!CI34:CT34)","v":122098},{"$f":"SUM(Balance!CU34:DF34)","v":122773},{"$f":"SUM(Balance!DG34:DR34)","v":122645.48},{"$f":"SUM(Balance!DS34:ED34)","v":120533.8},{"$f":"SUM(Balance!EE34:EP34)","v":123205},{"$f":"SUM(Balance!EQ34:FB34)","v":22094},"-","-","-"]
[null,"Térmica renovable/Otras renovables",{"$f":"SUM(Balance!C35:N35)","v":0},{"$f":"SUM(Balance!O35:Z35)","v":0},{"$f":"SUM(Balance!AA35:AL35)","v":0},{"$f":"SUM(Balance!AM35:AX35)","v":0},{"$f":"SUM(Balance!AY35:BJ35)","v":0},{"$f":"SUM(Balance!BK35:BV35)","v":0},{"$f":"SUM(Balance!BW35:CH35)","v":569},{"$f":"SUM(Balance!CI35:CT35)","v":743},{"$f":"SUM(Balance!CU35:DF35)","v":1944},{"$f":"SUM(Balance!DG35:DR35)","v":1972.55},{"$f":"SUM(Balance!DS35:ED35)","v":1309.52},{"$f":"SUM(Balance!EE35:EP35)","v":1625},{"$f":"SUM(Balance!EQ35:FB35)","v":606.06999999999994},"-","-","-"]
[null,"Térmica no renovable/Cogeneración y resto/Cogeneración",{"$f":"SUM(Balance!C36:N36)","v":139112.84899999999},{"$f":"SUM(Balance!O36:Z36)","v":113933},{"$f":"SUM(Balance!AA36:AL36)","v":140332},{"$f":"SUM(Balance!AM36:AX36)","v":127042},{"$f":"SUM(Balance!AY36:BJ36)","v":176244},{"$f":"SUM(Balance!BK36:BV36)","v":260748},{"$f":"SUM(Balance!BW36:CH36)","v":272076},{"$f":"SUM(Balance!CI36:CT36)","v":251615},{"$f":"SUM(Balance!CU36:DF36)","v":281390},{"$f":"SUM(Balance!DG36:DR36)","v":31519.32},{"$f":"SUM(Balance!DS36:ED36)","v":34698.850000000006},{"$f":"SUM(Balance!EE36:EP36)","v":36169},{"$f":"SUM(Balance!EQ36:FB36)","v":8662.49},"-","-","-"]
[null,"Residuos no renovables","-","-","-","-","-","-","-","-","-",{"$f":"SUM(Balance!DG37:DR37)","v":151098},{"$f":"SUM(Balance!DS37:ED37)","v":130805.5},{"$f":"SUM(Balance!EE37:EP37)","v":143878.5},{"$f":"SUM(Balance!EQ37:FB37)","v":23814.5},"-","-","-"]
[null,"Residuos renovables","-","-","-","-","-","-","-","-","-",{"$f":"SUM(Balance!DG38:DR38)","v":151098},{"$f":"SUM(Balance!DS38:ED38)","v":130805.5},{"$f":"SUM(Balance!EE38:EP38)","v":143878.5},{"$f":"SUM(Balance!EQ38:FB38)","v":23814.5},"-","-","-"]
[null,"Régimen especial",{"$f":"SUM(C138:C141)","v":145091},121541,174209,213518,269572,367798,394744,{"$f":"SUM(J138:J141)","v":380616},"-","-","-","-","-","-","-","-"]
[null,"Generación",{"$f":"SUM(C137:C137,C144)","v":5827623.1719999993},5979050,6122039,5992924,5840292.0320000006,5742828.6700000009,5252360.1069999998,4405032.1950000003,{"$f":"SUM(K131,K134:K136,K138:K141)","v":4287167.7429999998},{"$f":"SUM(L131,L134:L136,L138:L143)","v":4460643.7459999993},{"$f":"SUM(M131,M134:M136,M138:M143)","v":4581672.9379999992},{"$f":"SUM(N131,N134:N136,N138:N143)","v":4848973.4050000003},{"$f":"SUM(O131,O134:O136,O138:O143)","v":1085857.8999999999},"-","-","-"]
[null,"Enlace Península-Baleares","-","-","-","-","-",{"$f":"SUM(Balance!BK41:BV41)","v":476.40899999999993},{"$f":"SUM(Balance!BW41:CH41)","v":570249.2030000001},{"$f":"SUM(Balance!CI41:CT41)","v":1268508.5999999999},{"$f":"SUM(Balance!CU41:DF41)","v":1298257.4659999998},{"$f":"SUM(Balance!DG41:DR41)","v":1335791.8019999999},{"$f":"SUM(Balance!DS41:ED41)","v":1250582.5009999999},{"$f":"SUM(Balance!EE41:EP41)","v":1179300.6529999999},{"$f":"SUM(Balance!EQ41:FB41)","v":276303.92800000001},"-","-","-"]
[null,"Demanda transporte (b.c.)",{"$f":"SUM(C145:C146)","v":5827623.1719999993},5979050,6122039,5992924,5840292.0320000006,5743305.0790000008,5822609.3099999996,5673540.7949999999,5585425.2089999998,{"$f":"SUM(L145:L146)","v":5796435.5479999995},{"$f":"SUM(M145:M146)","v":5832255.4389999993},{"$f":"SUM(N145:N146)","v":6028274.0580000002},{"$f":"SUM(O145:O146)","v":1362161.828},"-","-","-"]
[]
[null,"Balance eléctrico anual Islas Canarias (MWh)",2006,2007,2008,2009,2010,2011,2012,2013,2014,2015,2016,2017,2018,2019,2020,2021]
[null,"Hidráulica",{"$f":"SUM(Balance!C45:N45)","v":0},{"$f":"SUM(Balance!O45:Z45)","v":0},{"$f":"SUM(Balance!AA45:AL45)","v":0},{"$f":"SUM(Balance!AM45:AX45)","v":0},{"$f":"SUM(Balance!AY45:BJ45)","v":0},{"$f":"SUM(Balance!BK45:BV45)","v":0},{"$f":"SUM(Balance!BW45:CH45)","v":0},{"$f":"SUM(Balance!CI45:CT45)","v":0},{"$f":"SUM(Balance!CU45:DF45)","v":0},{"$f":"SUM(Balance!DG45:DR45)","v":3585.2},{"$f":"SUM(Balance!DS45:ED45)","v":3472},{"$f":"SUM(Balance!EE45:EP45)","v":3282},{"$f":"SUM(Balance!EQ45:FB45)","v":314},"-","-","-"]
[null,"Motores diesel",{"$f":"SUM(Balance!C46:N46)","v":2007664},{"$f":"SUM(Balance!O46:Z46)","v":2042002},{"$f":"SUM(Balance!AA46:AL46)","v":2103766},{"$f":"SUM(Balance!AM46:AX46)","v":2140699},{"$f":"SUM(Balance!AY46:BJ46)","v":2183387.7719999999},{"$f":"SUM(Balance!BK46:BV46)","v":2163376.0950000002},{"$f":"SUM(Balance!BW46:CH46)","v":2110130.929},{"$f":"SUM(Balance!CI46:CT46)","v":2078558.186},{"$f":"SUM(Balance!CU46:DF46)","v":2145111.9040000001},{"$f":"SUM(Balance!DG46:DR46)","v":2207692.36},{"$f":"SUM(Balance!DS46:ED46)","v":2227665.5260000001},{"$f":"SUM(Balance!EE46:EP46)","v":2468714.2339999997},{"$f":"SUM(Balance!EQ46:FB46)","v":587158.00100000005},"-","-","-"]
[null,"Turbina de gas",{"$f":"SUM(Balance!C47:N47)","v":824431.12},{"$f":"SUM(Balance!O47:Z47)","v":699470},{"$f":"SUM(Balance!AA47:AL47)","v":473526},{"$f":"SUM(Balance!AM47:AX47)","v":342172.054},{"$f":"SUM(Balance!AY47:BJ47)","v":343281.65700000001},{"$f":"SUM(Balance!BK47:BV47)","v":529046.147},{"$f":"SUM(Balance!BW47:CH47)","v":590582.6939999999},{"$f":"SUM(Balance!CI47:CT47)","v":366528.71100000001},{"$f":"SUM(Balance!CU47:DF47)","v":363766.8459999999},{"$f":"SUM(Balance!DG47:DR47)","v":330903.78599999991},{"$f":"SUM(Balance!DS47:ED47)","v":279139.54399999999},{"$f":"SUM(Balance!EE47:EP47)","v":247327.67500000005},{"$f":"SUM(Balance!EQ47:FB47)","v":50770.14},"-","-","-"]
[null,"Turbina de  vapor",{"$f":"SUM(Balance!C48:N48)","v":3429991},{"$f":"SUM(Balance!O48:Z48)","v":3306805},{"$f":"SUM(Balance!AA48:AL48)","v":3414241},{"$f":"SUM(Balance!AM48:AX48)","v":3243628},{"$f":"SUM(Balance!AY48:BJ48)","v":2972587.1049999995},{"$f":"SUM(Balance!BK48:BV48)","v":2637819.2430000002},{"$f":"SUM(Balance!BW48:CH48)","v":2685938.8030000003},{"$f":"SUM(Balance!CI48:CT48)","v":2465049.5530000003},{"$f":"SUM(Balance!CU48:DF48)","v":2074036.0720000002},{"$f":"SUM(Balance!DG48:DR48)","v":2225313.5290000001},{"$f":"SUM(Balance!DS48:ED48)","v":2536663.6469999999},{"$f":"SUM(Balance!EE48:EP48)","v":2523836.9070000001},{"$f":"SUM(Balance!EQ48:FB48)","v":597374.10899999994},"-","-","-"]
[null,"Fuel + Gas",{"$f":"SUM(C151:C153)","v":6262086.1200000001},6048277,5991533,5726499.0539999995,5499256.534,5330241.4850000003,5386652.426,4910136.45,4582914.8220000006,{"$f":"SUM(Balance!DG49:DR49)+1","v":4763910.6749999998},{"$f":"SUM(Balance!DS49:ED49)","v":5043468.7169999992},{"$f":"SUM(Balance!EE49:EP49)","v":5239878.8160000006},{"$f":"SUM(Balance!EQ49:FB49)","v":1235302.25},"-","-","-"]
[null,"Ciclo combinado",{"$f":"SUM(Balance!C50:N50)","v":2007397},{"$f":"SUM(Balance!O50:Z50)","v":2443275},{"$f":"SUM(Balance!AA50:AL50)","v":2573317},{"$f":"SUM(Balance!AM50:AX50)","v":2552328},{"$f":"SUM(Balance!AY50:BJ50)","v":2708410.1850000001},{"$f":"SUM(Balance!BK50:BV50)","v":2918875.2369999997},{"$f":"SUM(Balance!BW50:CH50)","v":2877771.574},{"$f":"SUM(Balance!CI50:CT50)","v":3052680.0279999999},{"$f":"SUM(Balance!CU50:DF50)","v":3311448.9440000001},{"$f":"SUM(Balance!DG50:DR50)","v":3213042.0700000003},{"$f":"SUM(Balance!DS50:ED50)","v":3031699.5109999995},{"$f":"SUM(Balance!EE50:EP50)","v":3015772.0159999998},{"$f":"SUM(Balance!EQ50:FB50)","v":718182.25},"-","-","-"]
[null,"Generación auxiliar",{"$f":"SUM(Balance!C51:N51)","v":0},{"$f":"SUM(Balance!O51:Z51)","v":132840},{"$f":"SUM(Balance!AA51:AL51)","v":89747},{"$f":"SUM(Balance!AM51:AX51)","v":33788},{"$f":"SUM(Balance!AY51:BJ51)","v":0},{"$f":"SUM(Balance!BK51:BV51)","v":0},{"$f":"SUM(Balance!BW51:CH51)","v":0},{"$f":"SUM(Balance!CI51:CT51)","v":0},{"$f":"SUM(Balance!CU51:DF51)","v":0},{"$f":"SUM(Balance!DG51:DR51)","v":0},{"$f":"SUM(Balance!DS51:ED51)","v":0},{"$f":"SUM(Balance!EE51:EP51)","v":0},{"$f":"SUM(Balance!EQ51:FB51)","v":0},"-","-","-"]
[null,"Régimen ordinario",{"$f":"SUM(Balance!C52:N52)","v":8269483.1200000001},{"$f":"SUM(Balance!O52:Z52)","v":8624392},{"$f":"SUM(Balance!AA52:AL52)","v":8654597},{"$f":"SUM(Balance!AM52:AX52)","v":8312615.0540000005},{"$f":"SUM(Balance!AY52:BJ52)","v":8207666.7189999996},{"$f":"SUM(Balance!BK52:BV52)","v":8249116.7220000001},{"$f":"SUM(Balance!BW52:CH52)","v":8264423.9999999991},{"$f":"SUM(Balance!CI52:CT52)","v":7962816.4780000001},"-","-","-","-","-","-","-","-"]
[null,"Hidroeólica","-","-","-","-","-","-","-","-",{"$f":"SUM(Balance!CU53:DF53)","v":1071.8609999999999},{"$f":"SUM(Balance!DG53:DR53)","v":8557.0660000000007},{"$f":"SUM(Balance!DS53:ED53)","v":18102.638999999999},{"$f":"SUM(Balance!EE53:EP53)","v":20398.516},{"$f":"SUM(Balance!EQ53:FB53)","v":5715.9579999999996},"-","-","-"]
[null,"Hidráulica/Resto hidráulica",{"$f":"SUM(Balance!C54:N54)","v":0},{"$f":"SUM(Balance!O54:Z54)","v":1176},{"$f":"SUM(Balance!AA54:AL54)","v":1673},{"$f":"SUM(Balance!AM54:AX54)","v":398},{"$f":"SUM(Balance!AY54:BJ54)","v":0},{"$f":"SUM(Balance!BK54:BV54)","v":1675.4079999999999},{"$f":"SUM(Balance!BW54:CH54)","v":1789.3360000000005},{"$f":"SUM(Balance!CI54:CT54)","v":3047.306},{"$f":"SUM(Balance!CU54:DF54)","v":3479.0210000000002},"-","-","-","-","-","-","-"]
[null,"Eólica",{"$f":"SUM(Balance!C55:N55)","v":326063.57899999997},{"$f":"SUM(Balance!O55:Z55)","v":356840},{"$f":"SUM(Balance!AA55:AL55)","v":396475},{"$f":"SUM(Balance!AM55:AX55)","v":358707},{"$f":"SUM(Balance!AY55:BJ55)","v":331363},{"$f":"SUM(Balance!BK55:BV55)","v":354155},{"$f":"SUM(Balance!BW55:CH55)","v":361767.78899999999},{"$f":"SUM(Balance!CI55:CT55)","v":362734.29800000001},{"$f":"SUM(Balance!CU55:DF55)","v":389964},{"$f":"SUM(Balance!DG55:DR55)","v":396661.05200000003},{"$f":"SUM(Balance!DS55:ED55)","v":393086},{"$f":"SUM(Balance!EE55:EP55)","v":395943.174},{"$f":"SUM(Balance!EQ55:FB55)","v":157421.25200000001},"-","-","-"]
[null,"Solar fotovoltaica",{"$f":"SUM(Balance!C56:N56)","v":2915.5499999999997},{"$f":"SUM(Balance!O56:Z56)","v":19373},{"$f":"SUM(Balance!AA56:AL56)","v":63500},{"$f":"SUM(Balance!AM56:AX56)","v":162330},{"$f":"SUM(Balance!AY56:BJ56)","v":195166},{"$f":"SUM(Balance!BK56:BV56)","v":232139},{"$f":"SUM(Balance!BW56:CH56)","v":256511},{"$f":"SUM(Balance!CI56:CT56)","v":286702},{"$f":"SUM(Balance!CU56:DF56)","v":282291},{"$f":"SUM(Balance!DG56:DR56)","v":275554.16099999996},{"$f":"SUM(Balance!DS56:ED56)","v":277674},{"$f":"SUM(Balance!EE56:EP56)","v":273539},{"$f":"SUM(Balance!EQ56:FB56)","v":61499.07},"-","-","-"]
[null,"Térmica renovable/Otras renovables",{"$f":"SUM(Balance!C57:N57)","v":218199.68400000001},{"$f":"SUM(Balance!O57:Z57)","v":213283},{"$f":"SUM(Balance!AA57:AL57)","v":217219},{"$f":"SUM(Balance!AM57:AX57)","v":273055},{"$f":"SUM(Balance!AY57:BJ57)","v":160561},{"$f":"SUM(Balance!BK57:BV57)","v":33148.362999999998},{"$f":"SUM(Balance!BW57:CH57)","v":8050.4539999999997},{"$f":"SUM(Balance!CI57:CT57)","v":8387.0730000000003},{"$f":"SUM(Balance!CU57:DF57)","v":8806.7219999999998},{"$f":"SUM(Balance!DG57:DR57)","v":8053.2160000000003},{"$f":"SUM(Balance!DS57:ED57)","v":9336},{"$f":"SUM(Balance!EE57:EP57)","v":9565},{"$f":"SUM(Balance!EQ57:FB57)","v":1409},"-","-","-"]
[null,"Térmica no renovable/Cogeneración y resto/Cogeneración",{"$f":"SUM(Balance!C58:N58)","v":2832.1869999999999},{"$f":"SUM(Balance!O58:Z58)","v":0},{"$f":"SUM(Balance!AA58:AL58)","v":0},{"$f":"SUM(Balance!AM58:AX58)","v":20},{"$f":"SUM(Balance!AY58:BJ58)","v":0},{"$f":"SUM(Balance!BK58:BV58)","v":0},{"$f":"SUM(Balance!BW58:CH58)","v":0},{"$f":"SUM(Balance!CI58:CT58)","v":0},{"$f":"SUM(Balance!CU58:DF58)","v":0},{"$f":"SUM(Balance!DG58:DR58)","v":0},{"$f":"SUM(Balance!DS58:ED58)","v":0},{"$f":"SUM(Balance!EE58:EP58)","v":0},{"$f":"SUM(Balance!EQ58:FB58)","v":0},"-","-","-"]
[null,"Régimen especial",{"$f":"SUM(Balance!C59:N59)","v":550011},{"$f":"SUM(Balance!O59:Z59)","v":590672},{"$f":"SUM(Balance!AA59:AL59)","v":678867},{"$f":"SUM(Balance!AM59:AX59)","v":794510},{"$f":"SUM(Balance!AY59:BJ59)","v":687090},{"$f":"SUM(Balance!BK59:BV59)","v":621117.77099999995},{"$f":"SUM(Balance!BW59:CH59)","v":628118.57900000003},{"$f":"SUM(Balance!CI59:CT59)","v":660870.67699999991},"-","-","-","-","-","-","-","-"]
[null,"Generación",{"$f":"SUM(Balance!C60:N60)","v":8819494.120000001},{"$f":"SUM(Balance!O60:Z60)","v":9215064},{"$f":"SUM(Balance!AA60:AL60)","v":9333464},{"$f":"SUM(Balance!AM60:AX60)","v":9107125.0540000014},{"$f":"SUM(Balance!AY60:BJ60)","v":8894756.7190000005},{"$f":"SUM(Balance!BK60:BV60)","v":8870234.4930000007},{"$f":"SUM(Balance!BW60:CH60)","v":8892542.5789999999},{"$f":"SUM(Balance!CI60:CT60)","v":8623687.1550000012},{"$f":"SUM(Balance!CU60:DF60)","v":8579976.370000001},{"$f":"SUM(Balance!DG60:DR60)","v":8669362.4399999995},{"$f":"SUM(Balance!DS60:ED60)","v":8776838.8670000006},{"$f":"SUM(Balance!EE60:EP60)","v":8958378.5219999999},{"$f":"SUM(Balance!EQ60:FB60)","v":2179843.7800000003},"-","-","-"]
[null,"Demanda transporte (b.c.)",{"$f":"SUM(Balance!C61:N61)","v":8819494.120000001},{"$f":"SUM(Balance!O61:Z61)","v":9215064},{"$f":"SUM(Balance!AA61:AL61)","v":9333464},{"$f":"SUM(Balance!AM61:AX61)","v":9107125.0540000014},{"$f":"SUM(Balance!AY61:BJ61)","v":8894756.7190000005},{"$f":"SUM(Balance!BK61:BV61)","v":8870234.4930000007},{"$f":"SUM(Balance!BW61:CH61)","v":8892542.5789999999},{"$f":"SUM(Balance!CI61:CT61)","v":8623687.1550000012},{"$f":"SUM(Balance!CU61:DF61)","v":8579976.370000001},{"$f":"+L165","v":8669362.4399999995},{"$f":"+M165","v":8776838.8670000006},{"$f":"+N165","v":8958378.5219999999},{"$f":"+O165","v":2179843.7800000003},{"$f":"P165","v":"-"},"-","-"]
[]
[null,"Balance eléctrico anual Ceuta (MWh)",2007,2008,2009,2010,2011,2012,2013,2014,2015,2016,2017,2018,2019,2020]
[null,"Motores diesel",{"$f":"SUM(Balance!C64:N64)","v":202644},{"$f":"SUM(Balance!O64:Z64)","v":209671},{"$f":"SUM(Balance!AA64:AL64)","v":208316},{"$f":"SUM(Balance!AM64:AX64)","v":214666.24400000001},{"$f":"SUM(Balance!AY64:BJ64)","v":202671.921},{"$f":"SUM(Balance!BK64:BV64)","v":211523.35500000001},{"$f":"SUM(Balance!BW64:CH64)","v":201711.97},{"$f":"SUM(Balance!CI64:CT64)","v":212164.56700000004},{"$f":"SUM(Balance!CU64:DF64)","v":204715.61900000001},{"$f":"SUM(Balance!DG64:DR64)","v":210611.989},{"$f":"SUM(Balance!DS64:ED64)","v":202665.00700000001},{"$f":"SUM(Balance!EE64:EP64)","v":53796.402000000002},"-","-"]
[null,"Turbina de gas",{"$f":"SUM(Balance!C65:N65)","v":0},{"$f":"SUM(Balance!O65:Z65)","v":0},{"$f":"SUM(Balance!AA65:AL65)","v":3253},{"$f":"SUM(Balance!AM65:AX65)","v":2868.8669999999997},{"$f":"SUM(Balance!AY65:BJ65)","v":300.97500000000002},{"$f":"SUM(Balance!BK65:BV65)","v":548.54099999999994},{"$f":"SUM(Balance!BW65:CH65)","v":248.09399999999997},{"$f":"SUM(Balance!CI65:CT65)","v":89.154999999999973},{"$f":"SUM(Balance!CU65:DF65)","v":723.98099999999999},{"$f":"SUM(Balance!DG65:DR65)","v":116.15799999999999},{"$f":"SUM(Balance!DS65:ED65)","v":200.56},{"$f":"SUM(Balance!EE65:EP65)","v":6.8929999999999998},"-","-"]
[null,"Fuel + Gas",{"$f":"SUM(C169:C170)","v":202644},209671,211569,217535.111,202972.89600000001,212071.89600000001,201960.06400000001,212253.72200000004,{"$f":"SUM(Balance!CU66:DF66)","v":205439.6},{"$f":"SUM(Balance!DG66:DR66)","v":210728.147},{"$f":"SUM(Balance!DS66:ED66)","v":202865.56699999998},{"$f":"SUM(Balance!EE66:EP66)","v":53803.294999999998},"-","-"]
[null,"Régimen ordinario",{"$f":"C171","v":202644},209671,211569,217535.111,202972.89600000001,212071.89600000001,201960.06400000001,212253.72200000004,"-","-","-","-","-","-"]
[null,"Generación",{"$f":"SUM(C172:C172)","v":202644},209671,211569,217535.111,202972.89600000001,212071.89600000001,201960.06400000001,{"$f":"SUM(J172:J172)","v":212253.72200000004},{"$f":"SUM(Balance!CU68:DF68)","v":205439.6},{"$f":"SUM(Balance!DG68:DR68)","v":210728.147},{"$f":"SUM(Balance!DS68:ED68)","v":202865.56699999998},{"$f":"SUM(Balance!EE68:EP68)","v":53803.294999999998},"-","-"]
[null,"Demanda transporte (b.c.)",{"$f":"C173","v":202644},209671,211569,217535.111,202972.89600000001,212071.89600000001,201960.06400000001,{"$f":"J173","v":212253.72200000004},{"$f":"SUM(Balance!CU69:DF69)","v":205439.6},{"$f":"SUM(Balance!DG69:DR69)","v":210728.147},{"$f":"SUM(Balance!DS69:ED69)","v":202865.56699999998},{"$f":"SUM(Balance!EE69:EP69)","v":53803.294999999998},"-","-"]
[]
[null,"Balance eléctrico anual Melilla (MWh)",2007,2008,2009,2010,2011,2012,2013,2014,2015,2016,2017,2018,2019,2020]
[null,"Motores diesel",{"$f":"SUM(Balance!C72:N72)","v":181867.74},{"$f":"SUM(Balance!O72:Z72)","v":193125},{"$f":"SUM(Balance!AA72:AL72)","v":197553},{"$f":"SUM(Balance!AM72:AX72)","v":204717.97099999996},{"$f":"SUM(Balance!AY72:BJ72)","v":207296.853},{"$f":"SUM(Balance!BK72:BV72)","v":214850.84300000002},{"$f":"SUM(Balance!BW72:CH72)","v":201463.861},{"$f":"SUM(Balance!CI72:CT72)","v":200163.61000000002},{"$f":"SUM(Balance!CU72:DF72)","v":204228.133},{"$f":"SUM(Balance!DG72:DR72)","v":198326.31299999997},{"$f":"SUM(Balance!DS72:ED72)","v":200491.94299999997},{"$f":"SUM(Balance!EE72:EP72)","v":50177.456999999995},"-","-"]
[null,"Turbina de gas",{"$f":"SUM(Balance!C73:N73)","v":2412.2599999999998},{"$f":"SUM(Balance!O73:Z73)","v":3081},{"$f":"SUM(Balance!AA73:AL73)","v":545},{"$f":"SUM(Balance!AM73:AX73)","v":498.45600000000002},{"$f":"SUM(Balance!AY73:BJ73)","v":503.041},{"$f":"SUM(Balance!BK73:BV73)","v":112.349},{"$f":"SUM(Balance!BW73:CH73)","v":84.787000000000006},{"$f":"SUM(Balance!CI73:CT73)","v":724.20299999999997},{"$f":"SUM(Balance!CU73:DF73)","v":587.85799999999995},{"$f":"SUM(Balance!DG73:DR73)","v":241.53300000000002},{"$f":"SUM(Balance!DS73:ED73)","v":73.228999999999999},{"$f":"SUM(Balance!EE73:EP73)","v":50.262999999999998},"-","-"]
[null,"Fuel + gas",{"$f":"SUM(C177:C178)","v":184280},196206,198098,205216.42699999997,207799.894,214963.19200000001,201548.64800000002,200887.81300000002,{"$f":"SUM(Balance!CU74:DF74)","v":204815.99100000004},{"$f":"SUM(Balance!DG74:DR74)","v":198567.84600000002},{"$f":"SUM(Balance!DS74:ED74)","v":200565.17200000002},{"$f":"SUM(Balance!EE74:EP74)","v":50227.72},"-","-"]
[null,"Régimen ordinario",{"$f":"SUM(C179:C179)","v":184280},196206,198098,205216.42699999997,207799.894,214963.19200000001,201548.64800000002,"-","-","-","-","-","-","-"]
[null,"Solar fotovoltaica",{"$f":"SUM(Balance!C76:N76)","v":0},{"$f":"SUM(Balance!O76:Z76)","v":6},{"$f":"SUM(Balance!AA76:AL76)","v":122},{"$f":"SUM(Balance!AM76:AX76)","v":67},{"$f":"SUM(Balance!AY76:BJ76)","v":72},{"$f":"SUM(Balance!BK76:BV76)","v":84},{"$f":"SUM(Balance!BW76:CH76)","v":81},{"$f":"SUM(Balance!CI76:CT76)","v":85},{"$f":"SUM(Balance!CU76:DF76)","v":78},{"$f":"SUM(Balance!DG76:DR76)","v":78},{"$f":"SUM(Balance!DS76:ED76)","v":76},{"$f":"SUM(Balance!EE76:EP76)","v":10},"-","-"]
[null,"Térmica no renovable/Cogeneración y resto/Cogeneración",{"$f":"SUM(Balance!C77:N77)","v":8740},{"$f":"SUM(Balance!O77:Z77)","v":4842},{"$f":"SUM(Balance!AA77:AL77)","v":7735},{"$f":"SUM(Balance!AM77:AX77)","v":8028},{"$f":"SUM(Balance!AY77:BJ77)","v":7036},{"$f":"SUM(Balance!BK77:BV77)","v":2309},{"$f":"SUM(Balance!BW77:CH77)","v":8039},{"$f":"SUM(Balance!CI77:CT77)","v":8898},"-","-","-","-","-","-"]
[null,"Residuos no renovables","-","-","-","-","-","-","-","-",{"$f":"SUM(Balance!CU78:DF78)","v":4295.5},{"$f":"SUM(Balance!DG78:DR78)","v":4850},{"$f":"SUM(Balance!DS78:ED78)","v":4977.5},{"$f":"SUM(Balance!EE78:EP78)","v":1400.95},"-","-"]
[null,"Residuos renovables","-","-","-","-","-","-","-","-",{"$f":"SUM(Balance!CU79:DF79)","v":4295.5},{"$f":"SUM(Balance!DG79:DR79)","v":4850},{"$f":"SUM(Balance!DS79:ED79)","v":4977.5},{"$f":"SUM(Balance!EE79:EP79)","v":1400.95},"-","-"]
[null,"Régimen especial",{"$f":"SUM(C181:C182)","v":8740},4848,7857,8095,7108,2393,{"$f":"SUM(I181:I182)","v":8120},"-","-","-","-","-","-","-"]
[null,"Generación",{"$f":"SUM(C180:C180,C185)","v":193020},201054,205955,213311.42699999997,214907.894,217356.19200000001,{"$f":"SUM(I180:I180,I185)","v":209668.64800000002},{"$f":"SUM(J179,J181:J182)","v":209870.81300000002},{"$f":"SUM(Balance!CU81:DF81)","v":213484.99100000004},{"$f":"SUM(Balance!DG81:DR81)","v":208345.84600000002},{"$f":"SUM(Balance!DS81:ED81)","v":210596.17200000002},{"$f":"SUM(Balance!EE81:EP81)","v":53039.619999999995},"-","-"]
[null,"Demanda transporte (b.c.)",{"$f":"C186","v":193020},201054,205955,213311.42699999997,214907.894,217356.19200000001,209668.64800000002,209870.81300000002,{"$f":"SUM(Balance!CU82:DF82)","v":213484.99100000004},{"$f":"SUM(Balance!DG82:DR82)","v":208345.84600000002},{"$f":"SUM(Balance!DS82:ED82)","v":210596.17200000002},{"$f":"SUM(Balance!EE82:EP82)","v":53039.619999999995},"-","-"]
[]
[null,"Balance eléctrico anual nacional (GWh)",2007,2008,2009,2010,2011,2012,2013,2014,2015,2016,2017,2018,2019,2020]
[null,"Hidráulica",{"$f":"T108+(D150)/1000","v":22978.978099999993},18295.638600000002,20732.3027,35009.454188100004,25042.369909209996,15977.884330298002,30287.504563939998,32042.878507204001,28326.009484850005,36042.625717771996,18363.782145035999,8962.0251101360009,"-","-"]
[null,"Turbinación bombeo",{"$f":"T109","v":3102.6008999999999},{"$f":"U109","v":2661.7513999999996},{"$f":"V109","v":2655.9322999999999},{"$f":"W109","v":3120.4478038999996},{"$f":"X109","v":2183.53623079},{"$f":"Y109","v":3201.889743702},{"$f":"Z109","v":3289.6771840599995},{"$f":"AA109","v":3415.9960267959996},{"$f":"AB109","v":2895.3657881499998},{"$f":"AC109","v":3134.3289102280005},{"$f":"AD109","v":2248.9938579640002},737.83555886399995,"-","-"]
[null,"Nuclear",{"$f":"T110","v":52638.926999999996},56460.290999999997,50549.445000000007,59242.321647000004,55103.931311,58666.987000000008,54306.887000000002,54870.239000000009,54754.839048000002,56098.972000000002,55608.922000000006,14179.739099999999,"-","-"]
[null,"Carbón",{"$f":"T111+(D131)/1000","v":70630.103000000003},46508.363000000005,34793.025000000001,23700.613399999998,43266.694258000003,53813.417604999988,39527.563772000001,43320.302804000006,52789.040663999993,37491.272301999998,45196.268422000008,8454.2392849999997,"-","-"]
[null,"Fuel + Gas",{"$f":"T112+SUM(D134,D136,D154,D156,C171,C179)/1000","v":9988.4650000000001},9887.5660000000007,9276.3040540000002,8821.7598159999998,7024.4397080000008,7098.2117329999992,6573.8047610000012,6256.7275920000002,6496.6519769999995,6764.5484399999987,7011.0693250000013,1635.0063459999999,"-","-"]
[null,"Ciclo combinado",{"$f":"T113+SUM(D135,D155)/1000","v":70600.137999999992},93197.539000000004,80223.794999999998,66798.98415199999,53657.270627999991,41299.998665000006,27826.837724000001,25075.127551000001,29290.74944,29260.401394999997,37296.488616999995,6307.0430339999994,"-","-"]
[null,"Régimen ordinario",{"$f":"SUM(C190:C195)","v":229939.212},{"$f":"SUM(D190:D195)","v":227011.14899999998},198230.80405400001,196693.581007,186278.24204499999,180058.38907700003,{"$f":"SUM(I190:I195)","v":161812.275005},"-","-","-","-","-","-","-"]
[null,"Hidroeólica","-","-","-","-","-","-","-",{"$f":"+K158/1000","v":1.071861},{"$f":"+L158/1000","v":8.5570660000000007},{"$f":"+M158/1000","v":18.102639},{"$f":"+N158/1000","v":20.398516000000001},{"$f":"+O158/1000","v":5.7159579999999997},"-","-"]
[null,"Hidráulica/Resto hidráulica",{"$f":"T115+(D159)/1000","v":4126.5010000000002},4639.8159999999998,5454.0710000000008,6824.32,5295.9904079999997,4646.3353360000001,7102.2023060000001,7072.9990210000005,"-","-","-","-","-","-"]
[null,"Eólica",{"$f":"T116+SUM(D138,D160)/1000","v":27611.650999999998},32159.822000000007,38252.826999999997,43545.33,42465.417000000001,48508.337788999997,54713.246297999991,51030.692999999999,48115.128071999992,47696.670640000004,47897.01017400001,17747.369035999996,"-","-"]
[null,"Solar fotovoltaica",{"$f":"T117+SUM(D139,D161,C181)/1000","v":483.90199999999999},2497.9560000000001,6072.3899999999994,6422.7719999999999,7425.1200000000008,8202.09,8326.9189999999999,8207.5729999999985,8243.0756409999995,7977.5987999999988,8385.0359999999982,1537.9510700000001,"-","-"]
[null,"Solar térmica",{"$f":"T118","v":7.6269999999999998},15.378,129.82299999999998,691.62,1832.357,3444.1340000000005,4441.527000000001,4958.9149999999991,5085.2350000000006,5071.2040000000006,5347.9489999999996,570.10159999999996,"-","-"]
[null,"Térmica renovable/Otras renovables",{"$f":"T119+SUM(D140,D162)/1000","v":2588.9679999999998},2868.7079999999996,3317.3420000000001,3332.3599999999997,4317.9893630000006,4754.768454,5074.6960730000001,4728.7287219999998,3183.9767660000002,3424.5595199999998,3614.1030000000001,879.32067000000006,"-","-"]
[null,"Térmica no renovable/Cogeneración y resto/Cogeneración",{"$f":"T120+SUM(D141,D163,C182)/1000","v":23450.429999999997},26721.149999999998,28600.731,30973.324000000004,32318.795999999995,33767.249000000003,32296.378999999997,25885.824000000001,25449.494319999998,25906.610849999997,28170.445,7225.8861959999986,"-","-"]
[null,"Residuos no renovables","-","-","-","-","-","-","-","-",{"$f":"AB121+SUM(L142,K183)/1000","v":2480.1095},2606.9649999999997,2607.6644999999999,671.2921,"-","-"]
[null,"Residuos renovables","-","-","-","-","-","-","-","-",818.0485000000001,785.39699999999993,877.00649999999996,223.36499999999998,"-","-"]
[null,"Régimen especial",{"$f":"SUM(C198:C203)","v":58269.078999999998},{"$f":"SUM(D198:D203)","v":68902.83},{"$f":"SUM(E198:E203)","v":81827.183999999994},91789.72600000001,93655.669770999986,103322.914579,{"$f":"SUM(I198:I203)","v":111954.96967699999},"-","-","-","-","-","-","-"]
[null,"Generación",{"$f":"SUM(C196:C196,C206)","v":288208.29099999997},{"$f":"SUM(D196:D196,D206)","v":295913.97899999999},280057.98805400002,288483.30700700002,279933.91181600001,283381.30365600006,{"$f":"SUM(I196:I196,I206)","v":273767.24468200002},{"$f":"SUM(J190:J195,J197:J203)","v":266867.07608500007},{"$f":"SUM(K190:K195,K197:K205)","v":267936.28126699995},{"$f":"SUM(L190:L195,L197:L205)","v":262279.25721399998},262645.13705700001,{"$f":"SUM(N190:N195,N197:N205)","v":69136.890064000007},"-","-"]
[null,"Consumos en bombeo",{"$f":"T125","v":-4432.2870000000003},-3802.502,-3794.1889999999999,-4457.7825769999999,-3214.9598150000002,-5022.5477879999999,-5957.8449899999996,-5329.5900510000001,-4520.0941789999997,-4819.4130750000004,-3675.2379039999996,-1372.7395409999999,"-","-"]
[null,"Saldo intercambios internacionales",{"$f":"T127","v":-5750.4650000000001},-11039.585999999999,-8086.4139999999998,-8332.6790579999997,-6090.1263339999996,-11199.953591,-6732.1324500000001,-3406.1249290000001,-133.16322499999978,7667.313553,9170.5836430000018,1904.5980349999998,"-","-"]
[null,"Demanda transporte (b.c.)",{"$f":"SUM(C207:C209)","v":278025.53899999993},{"$f":"SUM(D207:D209)","v":281071.891},268177.38505400001,275692.84537200007,270628.82566700003,267158.80227700004,261077.267242,{"$f":"SUM(J207:J209)","v":258131.36110500005},{"$f":"SUM(K207:K209)","v":263283.02386299992},{"$f":"SUM(L207:L209)","v":265127.15769199998},{"$f":"SUM(M207:M209)","v":268140.48279600003},{"$f":"SUM(N207:N209)","v":69668.748558000007},"-","-"]

{"sheet":"Año","index":14,"n_rows":30,"n_cols":26,"rows_kept":30,"cut":false,"hidden":true,"merged":[]}
[null,null,null,null,null,null,null,null,null,null,null,null,null,null,null,null,null,null,null,null,null,null,null,null,1,1]
["Mensual","1990-1991",1990,"1990-1997","2006-2013","2007-2013",null,null,null,null,null,null,null,null,"Nacional","Mensual"]
["Trimestral","1992-1993",1991,"1998-2005","2014-2021","2014-2020",null,null,null,null,null,null,null,null,"Peninsular","Anual"]
["Anual","1994-1995",1992,"2006-2013",null,null,null,null,null,null,null,null,null,null,"Canarias"]
[null,"1996-1997",1993,"2014-2021",null,null,null,null,null,null,null,null,null,null,"Baleares"]
[null,"1998-1999",1994,null,null,null,null,null,null,null,null,null,null,null,"Ceuta"]
[null,"2000-2001",1995,null,null,null,null,null,null,null,null,null,null,null,"Melilla"]
[null,"2002-2003",1996]
[null,"2004-2005",1997]
[null,"2006-2007",1998]
[null,"2008-2009",1999]
[null,"2010-2011",2000]
[null,"2012-2013",2001]
[null,"2014-2015",2002]
[null,"2016-2017",2003]
[null,null,2004]
[null,null,2005]
[null,null,2006]
[null,null,2007]
[null,null,2008]
[null,null,2009]
[null,null,2010]
[null,null,2011]
[null,null,2012]
[null,null,2013]
[null,null,2014]
[null,null,2015]
[null,null,2016]
[null,null,2017]
[null,null,2018]