{"text_format":"1","workbook":"xlsx","n_sheets":9,"sheets":["AVISO LEGAL","Potencia nacional","Potencia peninsular","Potencia Baleares","Potencia Canarias","Potencia Ceuta","Potencia Melilla","Potencia","Año"],"not_rendered":{"charts":0,"images":1,"macros":1,"external_links":0,"defined_names":7,"comments":0,"pivot_tables":0},"unopened":[],"bounds":{"document_bytes":16777216,"sheet_cells":100000,"rows_first":2000,"rows_last":500,"rows_between":2000,"halvings":0,"cell_chars":16384,"cell_head_chars":4096},"cells_cut":0,"cells_raw":0,"read":"whole","date_system":"1900"}

{"sheet":"AVISO LEGAL","index":0,"n_rows":23,"n_cols":9,"rows_kept":23,"cut":false,"hidden":false,"merged":[]}
[]
[null,null,null,null,null,null,"Fecha de actualización:",null,"2017-07-09"]
[]
[]
[]
[]
[]
[]
[]
[]
[]
[]
[]
[]
[]
[]
[]
[]
[]
[]
[]
[]
[null,null,null,null,null,null,null,null,"www.ree.es"]

{"sheet":"Potencia nacional","index":1,"n_rows":31,"n_cols":12,"rows_kept":31,"cut":false,"hidden":false,"merged":[[41,1,41,8],[25,1,25,11],[29,1,29,11],[26,1,26,11],[27,1,27,11],[28,1,28,5],[30,1,30,11]]}
[null,null,null,null,null,null,null,null,null,null,null,2]
[]
[]
[]
[null,null,null,null,null,null,null,null,null,"Sistema eléctrico"]
[null,null,null,null,null,null,null,null,null,"Periodo"]
[]
[null,null,{"$f":"OFFSET(Potencia!C64,0,($L$1-1)*10)","v":2016},{"$f":"OFFSET(Potencia!D64,0,($L$1-1)*10)","v":2017},{"$f":"OFFSET(Potencia!E64,0,($L$1-1)*10)","v":2018},{"$f":"OFFSET(Potencia!F64,0,($L$1-1)*10)","v":2019},{"$f":"OFFSET(Potencia!G64,0,($L$1-1)*10)","v":2020},{"$f":"OFFSET(Potencia!H64,0,($L$1-1)*10)","v":2021},{"$f":"OFFSET(Potencia!I64,0,($L$1-1)*10)","v":2022},{"$f":"OFFSET(Potencia!J64,0,($L$1-1)*10)","v":2023},{"$f":"OFFSET(Potencia!K64,0,($L$1-1)*10)","v":2024},{"$f":"OFFSET(Potencia!L64,0,($L$1-1)*10)","v":2025}]
[]
[null,"Hidráulica convencional y mixta",{"$f":"OFFSET(Potencia!C65,0,($L$1-1)*10)","v":17024.556779999999},{"$f":"OFFSET(Potencia!D65,0,($L$1-1)*10)","v":17000.75978},{"$f":"OFFSET(Potencia!E65,0,($L$1-1)*10)","v":"-"},{"$f":"OFFSET(Potencia!F65,0,($L$1-1)*10)","v":"-"},{"$f":"OFFSET(Potencia!G65,0,($L$1-1)*10)","v":"-"},{"$f":"OFFSET(Potencia!H65,0,($L$1-1)*10)","v":"-"},{"$f":"OFFSET(Potencia!I65,0,($L$1-1)*10)","v":"-"},{"$f":"OFFSET(Potencia!J65,0,($L$1-1)*10)","v":"-"},{"$f":"OFFSET(Potencia!K65,0,($L$1-1)*10)","v":"-"},{"$f":"OFFSET(Potencia!L65,0,($L$1-1)*10)","v":"-"}]
[null,"Bombeo puro",{"$f":"OFFSET(Potencia!C66,0,($L$1-1)*10)","v":3328.89},{"$f":"OFFSET(Potencia!D66,0,($L$1-1)*10)","v":3328.89},{"$f":"OFFSET(Potencia!E66,0,($L$1-1)*10)","v":"-"},{"$f":"OFFSET(Potencia!F66,0,($L$1-1)*10)","v":"-"},{"$f":"OFFSET(Potencia!G66,0,($L$1-1)*10)","v":"-"},{"$f":"OFFSET(Potencia!H66,0,($L$1-1)*10)","v":"-"},{"$f":"OFFSET(Potencia!I66,0,($L$1-1)*10)","v":"-"},{"$f":"OFFSET(Potencia!J66,0,($L$1-1)*10)","v":"-"},{"$f":"OFFSET(Potencia!K66,0,($L$1-1)*10)","v":"-"},{"$f":"OFFSET(Potencia!L66,0,($L$1-1)*10)","v":"-"}]
[null,"Hidráulica",{"$f":"OFFSET(Potencia!C67,0,($L$1-1)*10)","v":20353.446779999998},{"$f":"OFFSET(Potencia!D67,0,($L$1-1)*10)","v":20329.64978},{"$f":"OFFSET(Potencia!E67,0,($L$1-1)*10)","v":"-"},{"$f":"OFFSET(Potencia!F67,0,($L$1-1)*10)","v":"-"},{"$f":"OFFSET(Potencia!G67,0,($L$1-1)*10)","v":"-"},{"$f":"OFFSET(Potencia!H67,0,($L$1-1)*10)","v":"-"},{"$f":"OFFSET(Potencia!I67,0,($L$1-1)*10)","v":"-"},{"$f":"OFFSET(Potencia!J67,0,($L$1-1)*10)","v":"-"},{"$f":"OFFSET(Potencia!K67,0,($L$1-1)*10)","v":"-"},{"$f":"OFFSET(Potencia!L67,0,($L$1-1)*10)","v":"-"}]
[null,"Nuclear",{"$f":"OFFSET(Potencia!C68,0,($L$1-1)*10)","v":7572.58},{"$f":"OFFSET(Potencia!D68,0,($L$1-1)*10)","v":7572.58},{"$f":"OFFSET(Potencia!E68,0,($L$1-1)*10)","v":"-"},{"$f":"OFFSET(Potencia!F68,0,($L$1-1)*10)","v":"-"},{"$f":"OFFSET(Potencia!G68,0,($L$1-1)*10)","v":"-"},{"$f":"OFFSET(Potencia!H68,0,($L$1-1)*10)","v":"-"},{"$f":"OFFSET(Potencia!I68,0,($L$1-1)*10)","v":"-"},{"$f":"OFFSET(Potencia!J68,0,($L$1-1)*10)","v":"-"},{"$f":"OFFSET(Potencia!K68,0,($L$1-1)*10)","v":"-"},{"$f":"OFFSET(Potencia!L68,0,($L$1-1)*10)","v":"-"}]
[null,"Carbón",{"$f":"OFFSET(Potencia!C69,0,($L$1-1)*10)","v":10004.27},{"$f":"OFFSET(Potencia!D69,0,($L$1-1)*10)","v":10004.27},{"$f":"OFFSET(Potencia!E69,0,($L$1-1)*10)","v":"-"},{"$f":"OFFSET(Potencia!F69,0,($L$1-1)*10)","v":"-"},{"$f":"OFFSET(Potencia!G69,0,($L$1-1)*10)","v":"-"},{"$f":"OFFSET(Potencia!H69,0,($L$1-1)*10)","v":"-"},{"$f":"OFFSET(Potencia!I69,0,($L$1-1)*10)","v":"-"},{"$f":"OFFSET(Potencia!J69,0,($L$1-1)*10)","v":"-"},{"$f":"OFFSET(Potencia!K69,0,($L$1-1)*10)","v":"-"},{"$f":"OFFSET(Potencia!L69,0,($L$1-1)*10)","v":"-"}]
[null,"Fuel + Gas",{"$f":"OFFSET(Potencia!C70,0,($L$1-1)*10)","v":2490.0600000000004},{"$f":"OFFSET(Potencia!D70,0,($L$1-1)*10)","v":2502.7800000000002},{"$f":"OFFSET(Potencia!E70,0,($L$1-1)*10)","v":"-"},{"$f":"OFFSET(Potencia!F70,0,($L$1-1)*10)","v":"-"},{"$f":"OFFSET(Potencia!G70,0,($L$1-1)*10)","v":"-"},{"$f":"OFFSET(Potencia!H70,0,($L$1-1)*10)","v":"-"},{"$f":"OFFSET(Potencia!I70,0,($L$1-1)*10)","v":"-"},{"$f":"OFFSET(Potencia!J70,0,($L$1-1)*10)","v":"-"},{"$f":"OFFSET(Potencia!K70,0,($L$1-1)*10)","v":"-"},{"$f":"OFFSET(Potencia!L70,0,($L$1-1)*10)","v":"-"}]
[null,"Ciclo combinado",{"$f":"OFFSET(Potencia!C71,0,($L$1-1)*10)","v":26669.86},{"$f":"OFFSET(Potencia!D71,0,($L$1-1)*10)","v":26669.86},{"$f":"OFFSET(Potencia!E71,0,($L$1-1)*10)","v":"-"},{"$f":"OFFSET(Potencia!F71,0,($L$1-1)*10)","v":"-"},{"$f":"OFFSET(Potencia!G71,0,($L$1-1)*10)","v":"-"},{"$f":"OFFSET(Potencia!H71,0,($L$1-1)*10)","v":"-"},{"$f":"OFFSET(Potencia!I71,0,($L$1-1)*10)","v":"-"},{"$f":"OFFSET(Potencia!J71,0,($L$1-1)*10)","v":"-"},{"$f":"OFFSET(Potencia!K71,0,($L$1-1)*10)","v":"-"},{"$f":"OFFSET(Potencia!L71,0,($L$1-1)*10)","v":"-"}]
[null,"Hidroeólica",{"$f":"OFFSET(Potencia!C72,0,($L$1-1)*10)","v":11.39},{"$f":"OFFSET(Potencia!D72,0,($L$1-1)*10)","v":11.39},{"$f":"OFFSET(Potencia!E72,0,($L$1-1)*10)","v":"-"},{"$f":"OFFSET(Potencia!F72,0,($L$1-1)*10)","v":"-"},{"$f":"OFFSET(Potencia!G72,0,($L$1-1)*10)","v":"-"},{"$f":"OFFSET(Potencia!H72,0,($L$1-1)*10)","v":"-"},{"$f":"OFFSET(Potencia!I72,0,($L$1-1)*10)","v":"-"},{"$f":"OFFSET(Potencia!J72,0,($L$1-1)*10)","v":"-"},{"$f":"OFFSET(Potencia!K72,0,($L$1-1)*10)","v":"-"},{"$f":"OFFSET(Potencia!L72,0,($L$1-1)*10)","v":"-"}]
[null,"Resto hidráulica (1)",{"$f":"OFFSET(Potencia!C73,0,($L$1-1)*10)","v":"-"},{"$f":"OFFSET(Potencia!D73,0,($L$1-1)*10)","v":"-"},{"$f":"OFFSET(Potencia!E73,0,($L$1-1)*10)","v":"-"},{"$f":"OFFSET(Potencia!F73,0,($L$1-1)*10)","v":"-"},{"$f":"OFFSET(Potencia!G73,0,($L$1-1)*10)","v":"-"},{"$f":"OFFSET(Potencia!H73,0,($L$1-1)*10)","v":"-"},{"$f":"OFFSET(Potencia!I73,0,($L$1-1)*10)","v":"-"},{"$f":"OFFSET(Potencia!J73,0,($L$1-1)*10)","v":"-"},{"$f":"OFFSET(Potencia!K73,0,($L$1-1)*10)","v":"-"},{"$f":"OFFSET(Potencia!L73,0,($L$1-1)*10)","v":"-"}]
[null,"Eólica",{"$f":"OFFSET(Potencia!C74,0,($L$1-1)*10)","v":23056.510849999995},{"$f":"OFFSET(Potencia!D74,0,($L$1-1)*10)","v":22980.520849999997},{"$f":"OFFSET(Potencia!E74,0,($L$1-1)*10)","v":"-"},{"$f":"OFFSET(Potencia!F74,0,($L$1-1)*10)","v":"-"},{"$f":"OFFSET(Potencia!G74,0,($L$1-1)*10)","v":"-"},{"$f":"OFFSET(Potencia!H74,0,($L$1-1)*10)","v":"-"},{"$f":"OFFSET(Potencia!I74,0,($L$1-1)*10)","v":"-"},{"$f":"OFFSET(Potencia!J74,0,($L$1-1)*10)","v":"-"},{"$f":"OFFSET(Potencia!K74,0,($L$1-1)*10)","v":"-"},{"$f":"OFFSET(Potencia!L74,0,($L$1-1)*10)","v":"-"}]
[null,"Solar fotovoltaica",{"$f":"OFFSET(Potencia!C75,0,($L$1-1)*10)","v":4673.8900400001476},{"$f":"OFFSET(Potencia!D75,0,($L$1-1)*10)","v":4674.3856400001478},{"$f":"OFFSET(Potencia!E75,0,($L$1-1)*10)","v":"-"},{"$f":"OFFSET(Potencia!F75,0,($L$1-1)*10)","v":"-"},{"$f":"OFFSET(Potencia!G75,0,($L$1-1)*10)","v":"-"},{"$f":"OFFSET(Potencia!H75,0,($L$1-1)*10)","v":"-"},{"$f":"OFFSET(Potencia!I75,0,($L$1-1)*10)","v":"-"},{"$f":"OFFSET(Potencia!J75,0,($L$1-1)*10)","v":"-"},{"$f":"OFFSET(Potencia!K75,0,($L$1-1)*10)","v":"-"},{"$f":"OFFSET(Potencia!L75,0,($L$1-1)*10)","v":"-"}]
[null,"Solar térmica",{"$f":"OFFSET(Potencia!C76,0,($L$1-1)*10)","v":2299.4275000000002},{"$f":"OFFSET(Potencia!D76,0,($L$1-1)*10)","v":2299.4275000000002},{"$f":"OFFSET(Potencia!E76,0,($L$1-1)*10)","v":"-"},{"$f":"OFFSET(Potencia!F76,0,($L$1-1)*10)","v":"-"},{"$f":"OFFSET(Potencia!G76,0,($L$1-1)*10)","v":"-"},{"$f":"OFFSET(Potencia!H76,0,($L$1-1)*10)","v":"-"},{"$f":"OFFSET(Potencia!I76,0,($L$1-1)*10)","v":"-"},{"$f":"OFFSET(Potencia!J76,0,($L$1-1)*10)","v":"-"},{"$f":"OFFSET(Potencia!K76,0,($L$1-1)*10)","v":"-"},{"$f":"OFFSET(Potencia!L76,0,($L$1-1)*10)","v":"-"}]
[null,"Térmica renovable/Otras renovables (2)",{"$f":"OFFSET(Potencia!C77,0,($L$1-1)*10)","v":748.61541000000022},{"$f":"OFFSET(Potencia!D77,0,($L$1-1)*10)","v":747.95841000000019},{"$f":"OFFSET(Potencia!E77,0,($L$1-1)*10)","v":"-"},{"$f":"OFFSET(Potencia!F77,0,($L$1-1)*10)","v":"-"},{"$f":"OFFSET(Potencia!G77,0,($L$1-1)*10)","v":"-"},{"$f":"OFFSET(Potencia!H77,0,($L$1-1)*10)","v":"-"},{"$f":"OFFSET(Potencia!I77,0,($L$1-1)*10)","v":"-"},{"$f":"OFFSET(Potencia!J77,0,($L$1-1)*10)","v":"-"},{"$f":"OFFSET(Potencia!K77,0,($L$1-1)*10)","v":"-"},{"$f":"OFFSET(Potencia!L77,0,($L$1-1)*10)","v":"-"}]
[null,"Térmica no renovable/Cogeneración y resto/Cogeneración (3)",{"$f":"OFFSET(Potencia!C78,0,($L$1-1)*10)","v":6644.546199999998},{"$f":"OFFSET(Potencia!D78,0,($L$1-1)*10)","v":6547.8391999999976},{"$f":"OFFSET(Potencia!E78,0,($L$1-1)*10)","v":"-"},{"$f":"OFFSET(Potencia!F78,0,($L$1-1)*10)","v":"-"},{"$f":"OFFSET(Potencia!G78,0,($L$1-1)*10)","v":"-"},{"$f":"OFFSET(Potencia!H78,0,($L$1-1)*10)","v":"-"},{"$f":"OFFSET(Potencia!I78,0,($L$1-1)*10)","v":"-"},{"$f":"OFFSET(Potencia!J78,0,($L$1-1)*10)","v":"-"},{"$f":"OFFSET(Potencia!K78,0,($L$1-1)*10)","v":"-"},{"$f":"OFFSET(Potencia!L78,0,($L$1-1)*10)","v":"-"}]
[null,"Residuos (4)",{"$f":"OFFSET(Potencia!C79,0,($L$1-1)*10)","v":754.37400000000002},{"$f":"OFFSET(Potencia!D79,0,($L$1-1)*10)","v":746.96399999999994},{"$f":"OFFSET(Potencia!E79,0,($L$1-1)*10)","v":"-"},{"$f":"OFFSET(Potencia!F79,0,($L$1-1)*10)","v":"-"},{"$f":"OFFSET(Potencia!G79,0,($L$1-1)*10)","v":"-"},{"$f":"OFFSET(Potencia!H79,0,($L$1-1)*10)","v":"-"},{"$f":"OFFSET(Potencia!I79,0,($L$1-1)*10)","v":"-"},{"$f":"OFFSET(Potencia!J79,0,($L$1-1)*10)","v":"-"},{"$f":"OFFSET(Potencia!K79,0,($L$1-1)*10)","v":"-"},{"$f":"OFFSET(Potencia!L79,0,($L$1-1)*10)","v":"-"}]
[null,"Total",{"$f":"OFFSET(Potencia!C80,0,($L$1-1)*10)","v":105278.97078000013},{"$f":"OFFSET(Potencia!D80,0,($L$1-1)*10)","v":105087.62538000016},{"$f":"OFFSET(Potencia!E80,0,($L$1-1)*10)","v":"-"},{"$f":"OFFSET(Potencia!F80,0,($L$1-1)*10)","v":"-"},{"$f":"OFFSET(Potencia!G80,0,($L$1-1)*10)","v":"-"},{"$f":"OFFSET(Potencia!H80,0,($L$1-1)*10)","v":"-"},{"$f":"OFFSET(Potencia!I80,0,($L$1-1)*10)","v":"-"},{"$f":"OFFSET(Potencia!J80,0,($L$1-1)*10)","v":"-"},{"$f":"OFFSET(Potencia!K80,0,($L$1-1)*10)","v":"-"},{"$f":"OFFSET(Potencia!L80,0,($L$1-1)*10)","v":"-"}]
[null,"(1) Incluye todas aquellas unidades menores de 50 MW que no pertenecen a ninguna unidad de gestión hidráulica (UGH)."]
[null,"(2) Otras renovables incluyen biogás, biomasa, hidráulica marina y geotérmica. Los valores de potencia incluyen residuos hasta el 31/12/2014."]
[null,"(3) Los valores de potencia incluyen residuos hasta el 31/12/2014."]
[null,"(4) Potencia incluída en térmica renovable y térmica no renovable/cogeneración y resto/cogeneración hasta el 31/12/2014."]
[null,"Fuente Comisión Nacional de los Mercados y la Competencia (CNMC) en: resto hidráulica, eólica, solar fotovoltaica, solar térmica, térmica renovable/otras renovables, térmica no renovable/cogeneración y resto/cogeneración y residuos."]
[null,{"$f":"IF(L1=2,IF(MONTH(FACT)=1,\"Datos a 31 de diciembre.\",(CONCATENATE(\"Datos a 31 de diciembre. Para el año \",YEAR(FACT), \" datos a \",TEXT(FACT-30,\"mmmm\"),\" de \",YEAR(FACT),\".\"))),\"Datos a 31 de diciembre.\")","v":"Datos a 31 de diciembre. Para el año 2017 datos a junio de 2017."}]

{"sheet":"Potencia peninsular","index":2,"n_rows":32,"n_cols":12,"rows_kept":32,"cut":false,"hidden":false,"merged":[[29,1,29,11],[24,1,24,11],[28,1,28,11],[25,1,25,11],[26,1,26,11],[27,1,27,5]]}
[null,null,null,null,null,null,null,null,null,null,null,3]
[]
[]
[]
[null,null,null,null,null,null,null,null,null,"Sistema eléctrico"]
[null,null,null,null,null,null,null,null,null,"Periodo"]
[]
[null,null,{"$f":"OFFSET(Potencia!C2,0,($L$1-1)*10)","v":2010},{"$f":"OFFSET(Potencia!D2,0,($L$1-1)*10)","v":2011},{"$f":"OFFSET(Potencia!E2,0,($L$1-1)*10)","v":2012},{"$f":"OFFSET(Potencia!F2,0,($L$1-1)*10)","v":2013},{"$f":"OFFSET(Potencia!G2,0,($L$1-1)*10)","v":2014},{"$f":"OFFSET(Potencia!H2,0,($L$1-1)*10)","v":2015},{"$f":"OFFSET(Potencia!I2,0,($L$1-1)*10)","v":2016},{"$f":"OFFSET(Potencia!J2,0,($L$1-1)*10)","v":2017},{"$f":"OFFSET(Potencia!K2,0,($L$1-1)*10)","v":2018},{"$f":"OFFSET(Potencia!L2,0,($L$1-1)*10)","v":2019}]
[]
[null,"Hidráulica convencional y mixta",{"$f":"OFFSET(Potencia!C3,0,($L$1-1)*10)","v":14655.31},{"$f":"OFFSET(Potencia!D3,0,($L$1-1)*10)","v":14667.21},{"$f":"OFFSET(Potencia!E3,0,($L$1-1)*10)","v":14886.65},{"$f":"OFFSET(Potencia!F3,0,($L$1-1)*10)","v":14889.69},{"$f":"OFFSET(Potencia!G3,0,($L$1-1)*10)","v":14895.92},{"$f":"OFFSET(Potencia!H3,0,($L$1-1)*10)","v":17017.638780000001},{"$f":"OFFSET(Potencia!I3,0,($L$1-1)*10)","v":17023.29378},{"$f":"OFFSET(Potencia!J3,0,($L$1-1)*10)","v":16999.496780000001},{"$f":"OFFSET(Potencia!K3,0,($L$1-1)*10)","v":"-"},{"$f":"OFFSET(Potencia!L3,0,($L$1-1)*10)","v":"-"}]
[null,"Bombeo puro",{"$f":"OFFSET(Potencia!C4,0,($L$1-1)*10)","v":2450.9399999999996},{"$f":"OFFSET(Potencia!D4,0,($L$1-1)*10)","v":2450.9399999999996},{"$f":"OFFSET(Potencia!E4,0,($L$1-1)*10)","v":2450.9399999999996},{"$f":"OFFSET(Potencia!F4,0,($L$1-1)*10)","v":2450.9399999999996},{"$f":"OFFSET(Potencia!G4,0,($L$1-1)*10)","v":2450.9399999999996},{"$f":"OFFSET(Potencia!H4,0,($L$1-1)*10)","v":3328.89},{"$f":"OFFSET(Potencia!I4,0,($L$1-1)*10)","v":3328.89},{"$f":"OFFSET(Potencia!J4,0,($L$1-1)*10)","v":3328.89},{"$f":"OFFSET(Potencia!K4,0,($L$1-1)*10)","v":"-"},{"$f":"OFFSET(Potencia!L4,0,($L$1-1)*10)","v":"-"}]
[null,"Hidráulica",{"$f":"OFFSET(Potencia!C5,0,($L$1-1)*10)","v":17106.25},{"$f":"OFFSET(Potencia!D5,0,($L$1-1)*10)","v":17118.149999999998},{"$f":"OFFSET(Potencia!E5,0,($L$1-1)*10)","v":17337.59},{"$f":"OFFSET(Potencia!F5,0,($L$1-1)*10)","v":17340.63},{"$f":"OFFSET(Potencia!G5,0,($L$1-1)*10)","v":17346.86},{"$f":"OFFSET(Potencia!H5,0,($L$1-1)*10)","v":20346.528780000001},{"$f":"OFFSET(Potencia!I5,0,($L$1-1)*10)","v":20352.183779999999},{"$f":"OFFSET(Potencia!J5,0,($L$1-1)*10)","v":20328.386780000001},{"$f":"OFFSET(Potencia!K5,0,($L$1-1)*10)","v":"-"},{"$f":"OFFSET(Potencia!L5,0,($L$1-1)*10)","v":"-"}]
[null,"Nuclear",{"$f":"OFFSET(Potencia!C6,0,($L$1-1)*10)","v":7515.3700000000008},{"$f":"OFFSET(Potencia!D6,0,($L$1-1)*10)","v":7572.58},{"$f":"OFFSET(Potencia!E6,0,($L$1-1)*10)","v":7572.58},{"$f":"OFFSET(Potencia!F6,0,($L$1-1)*10)","v":7572.58},{"$f":"OFFSET(Potencia!G6,0,($L$1-1)*10)","v":7572.58},{"$f":"OFFSET(Potencia!H6,0,($L$1-1)*10)","v":7572.58},{"$f":"OFFSET(Potencia!I6,0,($L$1-1)*10)","v":7572.58},{"$f":"OFFSET(Potencia!J6,0,($L$1-1)*10)","v":7572.58},{"$f":"OFFSET(Potencia!K6,0,($L$1-1)*10)","v":"-"},{"$f":"OFFSET(Potencia!L6,0,($L$1-1)*10)","v":"-"}]
[null,"Carbón",{"$f":"OFFSET(Potencia!C7,0,($L$1-1)*10)","v":10873.95},{"$f":"OFFSET(Potencia!D7,0,($L$1-1)*10)","v":11103.390000000001},{"$f":"OFFSET(Potencia!E7,0,($L$1-1)*10)","v":10595.47},{"$f":"OFFSET(Potencia!F7,0,($L$1-1)*10)","v":10610.37},{"$f":"OFFSET(Potencia!G7,0,($L$1-1)*10)","v":10468.02},{"$f":"OFFSET(Potencia!H7,0,($L$1-1)*10)","v":10468.02},{"$f":"OFFSET(Potencia!I7,0,($L$1-1)*10)","v":9535.8700000000008},{"$f":"OFFSET(Potencia!J7,0,($L$1-1)*10)","v":9535.8700000000008},{"$f":"OFFSET(Potencia!K7,0,($L$1-1)*10)","v":"-"},{"$f":"OFFSET(Potencia!L7,0,($L$1-1)*10)","v":"-"}]
[null,"Fuel + Gas",{"$f":"OFFSET(Potencia!C8,0,($L$1-1)*10)","v":2144.79},{"$f":"OFFSET(Potencia!D8,0,($L$1-1)*10)","v":806.52},{"$f":"OFFSET(Potencia!E8,0,($L$1-1)*10)","v":505.52},{"$f":"OFFSET(Potencia!F8,0,($L$1-1)*10)","v":505.52},{"$f":"OFFSET(Potencia!G8,0,($L$1-1)*10)","v":505.52},{"$f":"OFFSET(Potencia!H8,0,($L$1-1)*10)","v":0},{"$f":"OFFSET(Potencia!I8,0,($L$1-1)*10)","v":0},{"$f":"OFFSET(Potencia!J8,0,($L$1-1)*10)","v":0},{"$f":"OFFSET(Potencia!K8,0,($L$1-1)*10)","v":"-"},{"$f":"OFFSET(Potencia!L8,0,($L$1-1)*10)","v":"-"}]
[null,"Ciclo combinado",{"$f":"OFFSET(Potencia!C9,0,($L$1-1)*10)","v":24844.380000000005},{"$f":"OFFSET(Potencia!D9,0,($L$1-1)*10)","v":24911.730000000003},{"$f":"OFFSET(Potencia!E9,0,($L$1-1)*10)","v":24947.71},{"$f":"OFFSET(Potencia!F9,0,($L$1-1)*10)","v":24947.71},{"$f":"OFFSET(Potencia!G9,0,($L$1-1)*10)","v":24947.71},{"$f":"OFFSET(Potencia!H9,0,($L$1-1)*10)","v":24947.71},{"$f":"OFFSET(Potencia!I9,0,($L$1-1)*10)","v":24947.71},{"$f":"OFFSET(Potencia!J9,0,($L$1-1)*10)","v":24947.71},{"$f":"OFFSET(Potencia!K9,0,($L$1-1)*10)","v":"-"},{"$f":"OFFSET(Potencia!L9,0,($L$1-1)*10)","v":"-"}]
[null,"Resto hidráulica (1)",{"$f":"OFFSET(Potencia!C10,0,($L$1-1)*10)","v":2030.9589800000001},{"$f":"OFFSET(Potencia!D10,0,($L$1-1)*10)","v":2036.4207800000001},{"$f":"OFFSET(Potencia!E10,0,($L$1-1)*10)","v":2039.9287800000002},{"$f":"OFFSET(Potencia!F10,0,($L$1-1)*10)","v":2094.9217799999997},{"$f":"OFFSET(Potencia!G10,0,($L$1-1)*10)","v":2094.9217799999997},{"$f":"OFFSET(Potencia!H10,0,($L$1-1)*10)","v":"-"},{"$f":"OFFSET(Potencia!I10,0,($L$1-1)*10)","v":"-"},{"$f":"OFFSET(Potencia!J10,0,($L$1-1)*10)","v":"-"},{"$f":"OFFSET(Potencia!K10,0,($L$1-1)*10)","v":"-"},{"$f":"OFFSET(Potencia!L10,0,($L$1-1)*10)","v":"-"}]
[null,"Eólica",{"$f":"OFFSET(Potencia!C11,0,($L$1-1)*10)","v":19561.053450000003},{"$f":"OFFSET(Potencia!D11,0,($L$1-1)*10)","v":21018.087449999999},{"$f":"OFFSET(Potencia!E11,0,($L$1-1)*10)","v":22608.70205},{"$f":"OFFSET(Potencia!F11,0,($L$1-1)*10)","v":22852.974049999993},{"$f":"OFFSET(Potencia!G11,0,($L$1-1)*10)","v":22871.444549999997},{"$f":"OFFSET(Potencia!H11,0,($L$1-1)*10)","v":22873.244549999996},{"$f":"OFFSET(Potencia!I11,0,($L$1-1)*10)","v":22900.244549999996},{"$f":"OFFSET(Potencia!J11,0,($L$1-1)*10)","v":22841.444549999997},{"$f":"OFFSET(Potencia!K11,0,($L$1-1)*10)","v":"-"},{"$f":"OFFSET(Potencia!L11,0,($L$1-1)*10)","v":"-"}]
[null,"Solar fotovoltaica",{"$f":"OFFSET(Potencia!C12,0,($L$1-1)*10)","v":3645.2139100000977},{"$f":"OFFSET(Potencia!D12,0,($L$1-1)*10)","v":4032.0594600000986},{"$f":"OFFSET(Potencia!E12,0,($L$1-1)*10)","v":4293.5912300000982},{"$f":"OFFSET(Potencia!F12,0,($L$1-1)*10)","v":4396.5001700001485},{"$f":"OFFSET(Potencia!G12,0,($L$1-1)*10)","v":4402.664610000149},{"$f":"OFFSET(Potencia!H12,0,($L$1-1)*10)","v":4418.107080000148},{"$f":"OFFSET(Potencia!I12,0,($L$1-1)*10)","v":4429.5942300001498},{"$f":"OFFSET(Potencia!J12,0,($L$1-1)*10)","v":4430.0938300001499},{"$f":"OFFSET(Potencia!K12,0,($L$1-1)*10)","v":"-"},{"$f":"OFFSET(Potencia!L12,0,($L$1-1)*10)","v":"-"}]
[null,"Solar térmica",{"$f":"OFFSET(Potencia!C13,0,($L$1-1)*10)","v":531.91999999999996},{"$f":"OFFSET(Potencia!D13,0,($L$1-1)*10)","v":998.52},{"$f":"OFFSET(Potencia!E13,0,($L$1-1)*10)","v":1949.92},{"$f":"OFFSET(Potencia!F13,0,($L$1-1)*10)","v":2299.4275000000002},{"$f":"OFFSET(Potencia!G13,0,($L$1-1)*10)","v":2299.4275000000002},{"$f":"OFFSET(Potencia!H13,0,($L$1-1)*10)","v":2299.4275000000002},{"$f":"OFFSET(Potencia!I13,0,($L$1-1)*10)","v":2299.4275000000002},{"$f":"OFFSET(Potencia!J13,0,($L$1-1)*10)","v":2299.4275000000002},{"$f":"OFFSET(Potencia!K13,0,($L$1-1)*10)","v":"-"},{"$f":"OFFSET(Potencia!L13,0,($L$1-1)*10)","v":"-"}]
[null,"Térmica renovable/Otras renovables (2)",{"$f":"OFFSET(Potencia!C14,0,($L$1-1)*10)","v":778.78391000000011},{"$f":"OFFSET(Potencia!D14,0,($L$1-1)*10)","v":882.91990999999996},{"$f":"OFFSET(Potencia!E14,0,($L$1-1)*10)","v":968.43241},{"$f":"OFFSET(Potencia!F14,0,($L$1-1)*10)","v":944.44241000000011},{"$f":"OFFSET(Potencia!G14,0,($L$1-1)*10)","v":981.96541000000002},{"$f":"OFFSET(Potencia!H14,0,($L$1-1)*10)","v":742.16241000000014},{"$f":"OFFSET(Potencia!I14,0,($L$1-1)*10)","v":743.11741000000018},{"$f":"OFFSET(Potencia!J14,0,($L$1-1)*10)","v":742.46041000000014},{"$f":"OFFSET(Potencia!K14,0,($L$1-1)*10)","v":"-"},{"$f":"OFFSET(Potencia!L14,0,($L$1-1)*10)","v":"-"}]
[null,"Térmica no renovable/Cogeneración y resto/Cogeneración (3)",{"$f":"OFFSET(Potencia!C15,0,($L$1-1)*10)","v":7098.0841999999993},{"$f":"OFFSET(Potencia!D15,0,($L$1-1)*10)","v":7179.0716999999986},{"$f":"OFFSET(Potencia!E15,0,($L$1-1)*10)","v":7117.1501999999982},{"$f":"OFFSET(Potencia!F15,0,($L$1-1)*10)","v":7057.8806999999997},{"$f":"OFFSET(Potencia!G15,0,($L$1-1)*10)","v":7047.8021999999992},{"$f":"OFFSET(Potencia!H15,0,($L$1-1)*10)","v":6607.908199999998},{"$f":"OFFSET(Potencia!I15,0,($L$1-1)*10)","v":6600.4531999999981},{"$f":"OFFSET(Potencia!J15,0,($L$1-1)*10)","v":6503.7461999999978},{"$f":"OFFSET(Potencia!K15,0,($L$1-1)*10)","v":"-"},{"$f":"OFFSET(Potencia!L15,0,($L$1-1)*10)","v":"-"}]
[null,"Residuos (4)",{"$f":"OFFSET(Potencia!C16,0,($L$1-1)*10)","v":"-"},{"$f":"OFFSET(Potencia!D16,0,($L$1-1)*10)","v":"-"},{"$f":"OFFSET(Potencia!E16,0,($L$1-1)*10)","v":"-"},{"$f":"OFFSET(Potencia!F16,0,($L$1-1)*10)","v":"-"},{"$f":"OFFSET(Potencia!G16,0,($L$1-1)*10)","v":"-"},{"$f":"OFFSET(Potencia!H16,0,($L$1-1)*10)","v":677.40600000000006},{"$f":"OFFSET(Potencia!I16,0,($L$1-1)*10)","v":677.40600000000006},{"$f":"OFFSET(Potencia!J16,0,($L$1-1)*10)","v":669.99599999999998},{"$f":"OFFSET(Potencia!K16,0,($L$1-1)*10)","v":"-"},{"$f":"OFFSET(Potencia!L16,0,($L$1-1)*10)","v":"-"}]
[null,"Total",{"$f":"OFFSET(Potencia!C17,0,($L$1-1)*10)","v":96130.75445000011},{"$f":"OFFSET(Potencia!D17,0,($L$1-1)*10)","v":97659.449300000109},{"$f":"OFFSET(Potencia!E17,0,($L$1-1)*10)","v":99936.594670000093},{"$f":"OFFSET(Potencia!F17,0,($L$1-1)*10)","v":100622.95661000014},{"$f":"OFFSET(Potencia!G17,0,($L$1-1)*10)","v":100538.91605000016},{"$f":"OFFSET(Potencia!H17,0,($L$1-1)*10)","v":100953.09452000014},{"$f":"OFFSET(Potencia!I17,0,($L$1-1)*10)","v":100058.58667000016},{"$f":"OFFSET(Potencia!J17,0,($L$1-1)*10)","v":99871.715270000146},{"$f":"OFFSET(Potencia!K17,0,($L$1-1)*10)","v":"-"},{"$f":"OFFSET(Potencia!L17,0,($L$1-1)*10)","v":"-"}]
[null,"(1) Incluye todas aquellas unidades menores de 50 MW que no pertenecen a ninguna unidad de gestión hidráulica (UGH)."]
[null,"(2) Otras renovables incluyen biogás, biomasa, hidráulica marina y geotérmica. Los valores de potencia incluyen residuos hasta el 31/12/2014."]
[null,"(34) Los valores de potencia incluyen residuos hasta el 31/12/2014."]
[null,"(4) Potencia incluída en térmica renovable y térmica no renovable/cogeneración y resto/cogeneración hasta el 31/12/2014."]
[null,"Fuente Comisión Nacional de los Mercados y la Competencia (CNMC) en: resto hidráulica, eólica, solar fotovoltaica, solar térmica, térmica renovable/otras renovables, térmica no renovable/cogeneración y resto/cogeneración y residuos."]
[null,{"$f":"IF(L1=3,IF(MONTH(FACT)=1,\"Datos a 31 de diciembre.\",(CONCATENATE(\"Datos a 31 de diciembre. Para el año \",YEAR(FACT), \" datos a \",TEXT(FACT-30,\"mmmm\"),\" de \",YEAR(FACT),\".\"))),\"Datos a 31 de diciembre.\")","v":"Datos a 31 de diciembre. Para el año 2017 datos a junio de 2017."}]
[null,"A partir del 1/7/1996 se incluye GICC (Elcogás) en fuel/gas."]
[null,"A partir del 1/1/2011 se incluye GICC (Elcogás) en carbón, anteriormente en fuel/gas. Según el R.D. 134/2010 esta central está obligada a participar, como unidad vendedora que utiliza carbón autóctono como combustible, en el proceso de resolucion de restricciones por garantía de suministro."]

{"sheet":"Potencia Baleares","index":3,"n_rows":27,"n_cols":12,"rows_kept":27,"cut":false,"hidden":false,"merged":[[26,1,26,11],[21,1,21,11],[25,1,25,11],[22,1,22,11],[23,1,23,11],[24,1,24,5]]}
[null,null,null,null,null,null,null,null,null,null,null,2]
[]
[]
[]
[null,null,null,null,null,null,null,null,null,"Sistema eléctrico"]
[null,null,null,null,null,null,null,null,null,"Periodo"]
[]
[null,null,{"$f":"OFFSET(Potencia!C19,0,($L$1-1)*10)","v":2016},{"$f":"OFFSET(Potencia!D19,0,($L$1-1)*10)","v":2017},{"$f":"OFFSET(Potencia!E19,0,($L$1-1)*10)","v":2018},{"$f":"OFFSET(Potencia!F19,0,($L$1-1)*10)","v":2019},{"$f":"OFFSET(Potencia!G19,0,($L$1-1)*10)","v":2020},{"$f":"OFFSET(Potencia!H19,0,($L$1-1)*10)","v":2021},{"$f":"OFFSET(Potencia!I19,0,($L$1-1)*10)","v":2022},{"$f":"OFFSET(Potencia!J19,0,($L$1-1)*10)","v":2023},{"$f":"OFFSET(Potencia!K19,0,($L$1-1)*10)","v":2024},{"$f":"OFFSET(Potencia!L19,0,($L$1-1)*10)","v":2025}]
[]
[null,"Carbón",{"$f":"OFFSET(Potencia!C20,0,($L$1-1)*10)","v":468.4},{"$f":"OFFSET(Potencia!D20,0,($L$1-1)*10)","v":468.4},{"$f":"OFFSET(Potencia!E20,0,($L$1-1)*10)","v":"-"},{"$f":"OFFSET(Potencia!F20,0,($L$1-1)*10)","v":"-"},{"$f":"OFFSET(Potencia!G20,0,($L$1-1)*10)","v":"-"},{"$f":"OFFSET(Potencia!H20,0,($L$1-1)*10)","v":"-"},{"$f":"OFFSET(Potencia!I20,0,($L$1-1)*10)","v":"-"},{"$f":"OFFSET(Potencia!J20,0,($L$1-1)*10)","v":"-"},{"$f":"OFFSET(Potencia!K20,0,($L$1-1)*10)","v":"-"},{"$f":"OFFSET(Potencia!L20,0,($L$1-1)*10)","v":"-"}]
[null,"Motores diesel",{"$f":"OFFSET(Potencia!C21,0,($L$1-1)*10)","v":182},{"$f":"OFFSET(Potencia!D21,0,($L$1-1)*10)","v":182},{"$f":"OFFSET(Potencia!E21,0,($L$1-1)*10)","v":"-"},{"$f":"OFFSET(Potencia!F21,0,($L$1-1)*10)","v":"-"},{"$f":"OFFSET(Potencia!G21,0,($L$1-1)*10)","v":"-"},{"$f":"OFFSET(Potencia!H21,0,($L$1-1)*10)","v":"-"},{"$f":"OFFSET(Potencia!I21,0,($L$1-1)*10)","v":"-"},{"$f":"OFFSET(Potencia!J21,0,($L$1-1)*10)","v":"-"},{"$f":"OFFSET(Potencia!K21,0,($L$1-1)*10)","v":"-"},{"$f":"OFFSET(Potencia!L21,0,($L$1-1)*10)","v":"-"}]
[null,"Turbina de gas",{"$f":"OFFSET(Potencia!C22,0,($L$1-1)*10)","v":605.4},{"$f":"OFFSET(Potencia!D22,0,($L$1-1)*10)","v":605.4},{"$f":"OFFSET(Potencia!E22,0,($L$1-1)*10)","v":"-"},{"$f":"OFFSET(Potencia!F22,0,($L$1-1)*10)","v":"-"},{"$f":"OFFSET(Potencia!G22,0,($L$1-1)*10)","v":"-"},{"$f":"OFFSET(Potencia!H22,0,($L$1-1)*10)","v":"-"},{"$f":"OFFSET(Potencia!I22,0,($L$1-1)*10)","v":"-"},{"$f":"OFFSET(Potencia!J22,0,($L$1-1)*10)","v":"-"},{"$f":"OFFSET(Potencia!K22,0,($L$1-1)*10)","v":"-"},{"$f":"OFFSET(Potencia!L22,0,($L$1-1)*10)","v":"-"}]
[null,"Fuel + Gas",{"$f":"OFFSET(Potencia!C23,0,($L$1-1)*10)","v":787.4},{"$f":"OFFSET(Potencia!D23,0,($L$1-1)*10)","v":787.4},{"$f":"OFFSET(Potencia!E23,0,($L$1-1)*10)","v":"-"},{"$f":"OFFSET(Potencia!F23,0,($L$1-1)*10)","v":"-"},{"$f":"OFFSET(Potencia!G23,0,($L$1-1)*10)","v":"-"},{"$f":"OFFSET(Potencia!H23,0,($L$1-1)*10)","v":"-"},{"$f":"OFFSET(Potencia!I23,0,($L$1-1)*10)","v":"-"},{"$f":"OFFSET(Potencia!J23,0,($L$1-1)*10)","v":"-"},{"$f":"OFFSET(Potencia!K23,0,($L$1-1)*10)","v":"-"},{"$f":"OFFSET(Potencia!L23,0,($L$1-1)*10)","v":"-"}]
[null,"Ciclo combinado",{"$f":"OFFSET(Potencia!C24,0,($L$1-1)*10)","v":857.95},{"$f":"OFFSET(Potencia!D24,0,($L$1-1)*10)","v":857.95},{"$f":"OFFSET(Potencia!E24,0,($L$1-1)*10)","v":"-"},{"$f":"OFFSET(Potencia!F24,0,($L$1-1)*10)","v":"-"},{"$f":"OFFSET(Potencia!G24,0,($L$1-1)*10)","v":"-"},{"$f":"OFFSET(Potencia!H24,0,($L$1-1)*10)","v":"-"},{"$f":"OFFSET(Potencia!I24,0,($L$1-1)*10)","v":"-"},{"$f":"OFFSET(Potencia!J24,0,($L$1-1)*10)","v":"-"},{"$f":"OFFSET(Potencia!K24,0,($L$1-1)*10)","v":"-"},{"$f":"OFFSET(Potencia!L24,0,($L$1-1)*10)","v":"-"}]
[null,"Generación auxiliar (1)",{"$f":"OFFSET(Potencia!C25,0,($L$1-1)*10)","v":"-"},{"$f":"OFFSET(Potencia!D25,0,($L$1-1)*10)","v":12.72},{"$f":"OFFSET(Potencia!E25,0,($L$1-1)*10)","v":"-"},{"$f":"OFFSET(Potencia!F25,0,($L$1-1)*10)","v":"-"},{"$f":"OFFSET(Potencia!G25,0,($L$1-1)*10)","v":"-"},{"$f":"OFFSET(Potencia!H25,0,($L$1-1)*10)","v":"-"},{"$f":"OFFSET(Potencia!I25,0,($L$1-1)*10)","v":"-"},{"$f":"OFFSET(Potencia!J25,0,($L$1-1)*10)","v":"-"},{"$f":"OFFSET(Potencia!K25,0,($L$1-1)*10)","v":"-"},{"$f":"OFFSET(Potencia!L25,0,($L$1-1)*10)","v":"-"}]
[null,"Eólica",{"$f":"OFFSET(Potencia!C26,0,($L$1-1)*10)","v":3.6762999999999999},{"$f":"OFFSET(Potencia!D26,0,($L$1-1)*10)","v":3.6762999999999999},{"$f":"OFFSET(Potencia!E26,0,($L$1-1)*10)","v":"-"},{"$f":"OFFSET(Potencia!F26,0,($L$1-1)*10)","v":"-"},{"$f":"OFFSET(Potencia!G26,0,($L$1-1)*10)","v":"-"},{"$f":"OFFSET(Potencia!H26,0,($L$1-1)*10)","v":"-"},{"$f":"OFFSET(Potencia!I26,0,($L$1-1)*10)","v":"-"},{"$f":"OFFSET(Potencia!J26,0,($L$1-1)*10)","v":"-"},{"$f":"OFFSET(Potencia!K26,0,($L$1-1)*10)","v":"-"},{"$f":"OFFSET(Potencia!L26,0,($L$1-1)*10)","v":"-"}]
[null,"Solar fotovoltaica",{"$f":"OFFSET(Potencia!C27,0,($L$1-1)*10)","v":77.769779999999898},{"$f":"OFFSET(Potencia!D27,0,($L$1-1)*10)","v":77.765779999999907},{"$f":"OFFSET(Potencia!E27,0,($L$1-1)*10)","v":"-"},{"$f":"OFFSET(Potencia!F27,0,($L$1-1)*10)","v":"-"},{"$f":"OFFSET(Potencia!G27,0,($L$1-1)*10)","v":"-"},{"$f":"OFFSET(Potencia!H27,0,($L$1-1)*10)","v":"-"},{"$f":"OFFSET(Potencia!I27,0,($L$1-1)*10)","v":"-"},{"$f":"OFFSET(Potencia!J27,0,($L$1-1)*10)","v":"-"},{"$f":"OFFSET(Potencia!K27,0,($L$1-1)*10)","v":"-"},{"$f":"OFFSET(Potencia!L27,0,($L$1-1)*10)","v":"-"}]
[null,"Térmica renovable/Otras renovables (2)",{"$f":"OFFSET(Potencia!C28,0,($L$1-1)*10)","v":2.13},{"$f":"OFFSET(Potencia!D28,0,($L$1-1)*10)","v":2.13},{"$f":"OFFSET(Potencia!E28,0,($L$1-1)*10)","v":"-"},{"$f":"OFFSET(Potencia!F28,0,($L$1-1)*10)","v":"-"},{"$f":"OFFSET(Potencia!G28,0,($L$1-1)*10)","v":"-"},{"$f":"OFFSET(Potencia!H28,0,($L$1-1)*10)","v":"-"},{"$f":"OFFSET(Potencia!I28,0,($L$1-1)*10)","v":"-"},{"$f":"OFFSET(Potencia!J28,0,($L$1-1)*10)","v":"-"},{"$f":"OFFSET(Potencia!K28,0,($L$1-1)*10)","v":"-"},{"$f":"OFFSET(Potencia!L28,0,($L$1-1)*10)","v":"-"}]
[null,"Térmica no renovable/Cogeneración y resto/Cogeneración (3)",{"$f":"OFFSET(Potencia!C29,0,($L$1-1)*10)","v":10.824999999999999},{"$f":"OFFSET(Potencia!D29,0,($L$1-1)*10)","v":10.824999999999999},{"$f":"OFFSET(Potencia!E29,0,($L$1-1)*10)","v":"-"},{"$f":"OFFSET(Potencia!F29,0,($L$1-1)*10)","v":"-"},{"$f":"OFFSET(Potencia!G29,0,($L$1-1)*10)","v":"-"},{"$f":"OFFSET(Potencia!H29,0,($L$1-1)*10)","v":"-"},{"$f":"OFFSET(Potencia!I29,0,($L$1-1)*10)","v":"-"},{"$f":"OFFSET(Potencia!J29,0,($L$1-1)*10)","v":"-"},{"$f":"OFFSET(Potencia!K29,0,($L$1-1)*10)","v":"-"},{"$f":"OFFSET(Potencia!L29,0,($L$1-1)*10)","v":"-"}]
[null,"Residuos (4)",{"$f":"OFFSET(Potencia!C30,0,($L$1-1)*10)","v":74.8},{"$f":"OFFSET(Potencia!D30,0,($L$1-1)*10)","v":74.8},{"$f":"OFFSET(Potencia!E30,0,($L$1-1)*10)","v":"-"},{"$f":"OFFSET(Potencia!F30,0,($L$1-1)*10)","v":"-"},{"$f":"OFFSET(Potencia!G30,0,($L$1-1)*10)","v":"-"},{"$f":"OFFSET(Potencia!H30,0,($L$1-1)*10)","v":"-"},{"$f":"OFFSET(Potencia!I30,0,($L$1-1)*10)","v":"-"},{"$f":"OFFSET(Potencia!J30,0,($L$1-1)*10)","v":"-"},{"$f":"OFFSET(Potencia!K30,0,($L$1-1)*10)","v":"-"},{"$f":"OFFSET(Potencia!L30,0,($L$1-1)*10)","v":"-"}]
[null,"Total",{"$f":"OFFSET(Potencia!C31,0,($L$1-1)*10)","v":2282.9510800000003},{"$f":"OFFSET(Potencia!D31,0,($L$1-1)*10)","v":2295.6670799999997},{"$f":"OFFSET(Potencia!E31,0,($L$1-1)*10)","v":"-"},{"$f":"OFFSET(Potencia!F31,0,($L$1-1)*10)","v":"-"},{"$f":"OFFSET(Potencia!G31,0,($L$1-1)*10)","v":"-"},{"$f":"OFFSET(Potencia!H31,0,($L$1-1)*10)","v":"-"},{"$f":"OFFSET(Potencia!I31,0,($L$1-1)*10)","v":"-"},{"$f":"OFFSET(Potencia!J31,0,($L$1-1)*10)","v":"-"},{"$f":"OFFSET(Potencia!K31,0,($L$1-1)*10)","v":"-"},{"$f":"OFFSET(Potencia!L31,0,($L$1-1)*10)","v":"-"}]
[null,"(1) Grupos de emergencia que se instalan de forma transitoria en determinadas zonas para cubrir un déficit de generación."]
[null,"(2) Otras renovables incluyen biogás y biomasa. Los valores de potencia incluyen residuos hasta el 31/12/2014."]
[null,"(3) Los valores de potencia incluyen residuos hasta el 31/12/2014."]
[null,"(4) Potencia incluída en térmica renovable y térmica no renovable/cogeneración y resto/cogeneración hasta el 31/12/2014."]
[null,"Fuente Comisión Nacional de los Mercados y la Competencia (CNMC) en: eólica, solar fotovoltaica, térmica renovable/otras renovables, térmica no renovable/cogeneración y resto/cogeneración y residuos."]
[null,{"$f":"IF(L1=2,IF(MONTH(FACT)=1,\"Datos a 31 de diciembre.\",(CONCATENATE(\"Datos a 31 de diciembre. Para el año \",YEAR(FACT), \" datos a \",TEXT(FACT-30,\"mmmm\"),\" de \",YEAR(FACT),\".\"))),\"Datos a 31 de diciembre.\")","v":"Datos a 31 de diciembre. Para el año 2017 datos a junio de 2017."}]

{"sheet":"Potencia Canarias","index":4,"n_rows":28,"n_cols":12,"rows_kept":28,"cut":false,"hidden":false,"merged":[[24,1,24,11],[23,1,23,11],[26,1,26,11],[25,1,25,11],[27,1,27,11]]}
[null,null,null,null,null,null,null,null,null,null,null,2]
[]
[]
[]
[null,null,null,null,null,null,null,null,null,"Sistema eléctrico"]
[null,null,null,null,null,null,null,null,null,"Periodo"]
[]
[null,null,{"$f":"OFFSET(Potencia!C33,0,($L$1-1)*10)","v":2016},{"$f":"OFFSET(Potencia!D33,0,($L$1-1)*10)","v":2017},{"$f":"OFFSET(Potencia!E33,0,($L$1-1)*10)","v":2018},{"$f":"OFFSET(Potencia!F33,0,($L$1-1)*10)","v":2019},{"$f":"OFFSET(Potencia!G33,0,($L$1-1)*10)","v":2020},{"$f":"OFFSET(Potencia!H33,0,($L$1-1)*10)","v":2021},{"$f":"OFFSET(Potencia!I33,0,($L$1-1)*10)","v":2022},{"$f":"OFFSET(Potencia!J33,0,($L$1-1)*10)","v":2023},{"$f":"OFFSET(Potencia!K33,0,($L$1-1)*10)","v":2024},{"$f":"OFFSET(Potencia!L33,0,($L$1-1)*10)","v":2025}]
[]
[null,"Hidráulica",{"$f":"OFFSET(Potencia!C34,0,($L$1-1)*10)","v":1.2630000000000001},{"$f":"OFFSET(Potencia!D34,0,($L$1-1)*10)","v":1.2630000000000001},{"$f":"OFFSET(Potencia!E34,0,($L$1-1)*10)","v":"-"},{"$f":"OFFSET(Potencia!F34,0,($L$1-1)*10)","v":"-"},{"$f":"OFFSET(Potencia!G34,0,($L$1-1)*10)","v":"-"},{"$f":"OFFSET(Potencia!H34,0,($L$1-1)*10)","v":"-"},{"$f":"OFFSET(Potencia!I34,0,($L$1-1)*10)","v":"-"},{"$f":"OFFSET(Potencia!J34,0,($L$1-1)*10)","v":"-"},{"$f":"OFFSET(Potencia!K34,0,($L$1-1)*10)","v":"-"},{"$f":"OFFSET(Potencia!L34,0,($L$1-1)*10)","v":"-"}]
[null,"Motores diesel",{"$f":"OFFSET(Potencia!C35,0,($L$1-1)*10)","v":495.92000000000013},{"$f":"OFFSET(Potencia!D35,0,($L$1-1)*10)","v":495.92000000000013},{"$f":"OFFSET(Potencia!E35,0,($L$1-1)*10)","v":"-"},{"$f":"OFFSET(Potencia!F35,0,($L$1-1)*10)","v":"-"},{"$f":"OFFSET(Potencia!G35,0,($L$1-1)*10)","v":"-"},{"$f":"OFFSET(Potencia!H35,0,($L$1-1)*10)","v":"-"},{"$f":"OFFSET(Potencia!I35,0,($L$1-1)*10)","v":"-"},{"$f":"OFFSET(Potencia!J35,0,($L$1-1)*10)","v":"-"},{"$f":"OFFSET(Potencia!K35,0,($L$1-1)*10)","v":"-"},{"$f":"OFFSET(Potencia!L35,0,($L$1-1)*10)","v":"-"}]
[null,"Turbina de gas",{"$f":"OFFSET(Potencia!C36,0,($L$1-1)*10)","v":557.1400000000001},{"$f":"OFFSET(Potencia!D36,0,($L$1-1)*10)","v":557.1400000000001},{"$f":"OFFSET(Potencia!E36,0,($L$1-1)*10)","v":"-"},{"$f":"OFFSET(Potencia!F36,0,($L$1-1)*10)","v":"-"},{"$f":"OFFSET(Potencia!G36,0,($L$1-1)*10)","v":"-"},{"$f":"OFFSET(Potencia!H36,0,($L$1-1)*10)","v":"-"},{"$f":"OFFSET(Potencia!I36,0,($L$1-1)*10)","v":"-"},{"$f":"OFFSET(Potencia!J36,0,($L$1-1)*10)","v":"-"},{"$f":"OFFSET(Potencia!K36,0,($L$1-1)*10)","v":"-"},{"$f":"OFFSET(Potencia!L36,0,($L$1-1)*10)","v":"-"}]
[null,"Turbina de  vapor",{"$f":"OFFSET(Potencia!C37,0,($L$1-1)*10)","v":482.64},{"$f":"OFFSET(Potencia!D37,0,($L$1-1)*10)","v":482.64},{"$f":"OFFSET(Potencia!E37,0,($L$1-1)*10)","v":"-"},{"$f":"OFFSET(Potencia!F37,0,($L$1-1)*10)","v":"-"},{"$f":"OFFSET(Potencia!G37,0,($L$1-1)*10)","v":"-"},{"$f":"OFFSET(Potencia!H37,0,($L$1-1)*10)","v":"-"},{"$f":"OFFSET(Potencia!I37,0,($L$1-1)*10)","v":"-"},{"$f":"OFFSET(Potencia!J37,0,($L$1-1)*10)","v":"-"},{"$f":"OFFSET(Potencia!K37,0,($L$1-1)*10)","v":"-"},{"$f":"OFFSET(Potencia!L37,0,($L$1-1)*10)","v":"-"}]
[null,"Fuel + Gas",{"$f":"OFFSET(Potencia!C38,0,($L$1-1)*10)","v":1535.7000000000003},{"$f":"OFFSET(Potencia!D38,0,($L$1-1)*10)","v":1535.7000000000003},{"$f":"OFFSET(Potencia!E38,0,($L$1-1)*10)","v":"-"},{"$f":"OFFSET(Potencia!F38,0,($L$1-1)*10)","v":"-"},{"$f":"OFFSET(Potencia!G38,0,($L$1-1)*10)","v":"-"},{"$f":"OFFSET(Potencia!H38,0,($L$1-1)*10)","v":"-"},{"$f":"OFFSET(Potencia!I38,0,($L$1-1)*10)","v":"-"},{"$f":"OFFSET(Potencia!J38,0,($L$1-1)*10)","v":"-"},{"$f":"OFFSET(Potencia!K38,0,($L$1-1)*10)","v":"-"},{"$f":"OFFSET(Potencia!L38,0,($L$1-1)*10)","v":"-"}]
[null,"Ciclo combinado (1)",{"$f":"OFFSET(Potencia!C39,0,($L$1-1)*10)","v":864.2},{"$f":"OFFSET(Potencia!D39,0,($L$1-1)*10)","v":864.2},{"$f":"OFFSET(Potencia!E39,0,($L$1-1)*10)","v":"-"},{"$f":"OFFSET(Potencia!F39,0,($L$1-1)*10)","v":"-"},{"$f":"OFFSET(Potencia!G39,0,($L$1-1)*10)","v":"-"},{"$f":"OFFSET(Potencia!H39,0,($L$1-1)*10)","v":"-"},{"$f":"OFFSET(Potencia!I39,0,($L$1-1)*10)","v":"-"},{"$f":"OFFSET(Potencia!J39,0,($L$1-1)*10)","v":"-"},{"$f":"OFFSET(Potencia!K39,0,($L$1-1)*10)","v":"-"},{"$f":"OFFSET(Potencia!L39,0,($L$1-1)*10)","v":"-"}]
[null,"Generación auxiliar (2)",{"$f":"OFFSET(Potencia!C40,0,($L$1-1)*10)","v":"-"},{"$f":"OFFSET(Potencia!D40,0,($L$1-1)*10)","v":"-"},{"$f":"OFFSET(Potencia!E40,0,($L$1-1)*10)","v":"-"},{"$f":"OFFSET(Potencia!F40,0,($L$1-1)*10)","v":"-"},{"$f":"OFFSET(Potencia!G40,0,($L$1-1)*10)","v":"-"},{"$f":"OFFSET(Potencia!H40,0,($L$1-1)*10)","v":"-"},{"$f":"OFFSET(Potencia!I40,0,($L$1-1)*10)","v":"-"},{"$f":"OFFSET(Potencia!J40,0,($L$1-1)*10)","v":"-"},{"$f":"OFFSET(Potencia!K40,0,($L$1-1)*10)","v":"-"},{"$f":"OFFSET(Potencia!L40,0,($L$1-1)*10)","v":"-"}]
[null,"Hidroeólica",{"$f":"OFFSET(Potencia!C41,0,($L$1-1)*10)","v":11.39},{"$f":"OFFSET(Potencia!D41,0,($L$1-1)*10)","v":11.39},{"$f":"OFFSET(Potencia!E41,0,($L$1-1)*10)","v":"-"},{"$f":"OFFSET(Potencia!F41,0,($L$1-1)*10)","v":"-"},{"$f":"OFFSET(Potencia!G41,0,($L$1-1)*10)","v":"-"},{"$f":"OFFSET(Potencia!H41,0,($L$1-1)*10)","v":"-"},{"$f":"OFFSET(Potencia!I41,0,($L$1-1)*10)","v":"-"},{"$f":"OFFSET(Potencia!J41,0,($L$1-1)*10)","v":"-"},{"$f":"OFFSET(Potencia!K41,0,($L$1-1)*10)","v":"-"},{"$f":"OFFSET(Potencia!L41,0,($L$1-1)*10)","v":"-"}]
[null,"Resto hidráulica",{"$f":"OFFSET(Potencia!C42,0,($L$1-1)*10)","v":"-"},{"$f":"OFFSET(Potencia!D42,0,($L$1-1)*10)","v":"-"},{"$f":"OFFSET(Potencia!E42,0,($L$1-1)*10)","v":"-"},{"$f":"OFFSET(Potencia!F42,0,($L$1-1)*10)","v":"-"},{"$f":"OFFSET(Potencia!G42,0,($L$1-1)*10)","v":"-"},{"$f":"OFFSET(Potencia!H42,0,($L$1-1)*10)","v":"-"},{"$f":"OFFSET(Potencia!I42,0,($L$1-1)*10)","v":"-"},{"$f":"OFFSET(Potencia!J42,0,($L$1-1)*10)","v":"-"},{"$f":"OFFSET(Potencia!K42,0,($L$1-1)*10)","v":"-"},{"$f":"OFFSET(Potencia!L42,0,($L$1-1)*10)","v":"-"}]
[null,"Eólica",{"$f":"OFFSET(Potencia!C43,0,($L$1-1)*10)","v":152.59},{"$f":"OFFSET(Potencia!D43,0,($L$1-1)*10)","v":135.4},{"$f":"OFFSET(Potencia!E43,0,($L$1-1)*10)","v":"-"},{"$f":"OFFSET(Potencia!F43,0,($L$1-1)*10)","v":"-"},{"$f":"OFFSET(Potencia!G43,0,($L$1-1)*10)","v":"-"},{"$f":"OFFSET(Potencia!H43,0,($L$1-1)*10)","v":"-"},{"$f":"OFFSET(Potencia!I43,0,($L$1-1)*10)","v":"-"},{"$f":"OFFSET(Potencia!J43,0,($L$1-1)*10)","v":"-"},{"$f":"OFFSET(Potencia!K43,0,($L$1-1)*10)","v":"-"},{"$f":"OFFSET(Potencia!L43,0,($L$1-1)*10)","v":"-"}]
[null,"Solar fotovoltaica",{"$f":"OFFSET(Potencia!C44,0,($L$1-1)*10)","v":166.46812999999801},{"$f":"OFFSET(Potencia!D44,0,($L$1-1)*10)","v":166.46812999999801},{"$f":"OFFSET(Potencia!E44,0,($L$1-1)*10)","v":"-"},{"$f":"OFFSET(Potencia!F44,0,($L$1-1)*10)","v":"-"},{"$f":"OFFSET(Potencia!G44,0,($L$1-1)*10)","v":"-"},{"$f":"OFFSET(Potencia!H44,0,($L$1-1)*10)","v":"-"},{"$f":"OFFSET(Potencia!I44,0,($L$1-1)*10)","v":"-"},{"$f":"OFFSET(Potencia!J44,0,($L$1-1)*10)","v":"-"},{"$f":"OFFSET(Potencia!K44,0,($L$1-1)*10)","v":"-"},{"$f":"OFFSET(Potencia!L44,0,($L$1-1)*10)","v":"-"}]
[null,"Térmica renovable/Otras renovables (3)",{"$f":"OFFSET(Potencia!C45,0,($L$1-1)*10)","v":3.3679999999999999},{"$f":"OFFSET(Potencia!D45,0,($L$1-1)*10)","v":3.3679999999999999},{"$f":"OFFSET(Potencia!E45,0,($L$1-1)*10)","v":"-"},{"$f":"OFFSET(Potencia!F45,0,($L$1-1)*10)","v":"-"},{"$f":"OFFSET(Potencia!G45,0,($L$1-1)*10)","v":"-"},{"$f":"OFFSET(Potencia!H45,0,($L$1-1)*10)","v":"-"},{"$f":"OFFSET(Potencia!I45,0,($L$1-1)*10)","v":"-"},{"$f":"OFFSET(Potencia!J45,0,($L$1-1)*10)","v":"-"},{"$f":"OFFSET(Potencia!K45,0,($L$1-1)*10)","v":"-"},{"$f":"OFFSET(Potencia!L45,0,($L$1-1)*10)","v":"-"}]
[null,"Térmica no renovable/Cogeneración y resto/Cogeneración",{"$f":"OFFSET(Potencia!C46,0,($L$1-1)*10)","v":33.268000000000001},{"$f":"OFFSET(Potencia!D46,0,($L$1-1)*10)","v":33.268000000000001},{"$f":"OFFSET(Potencia!E46,0,($L$1-1)*10)","v":"-"},{"$f":"OFFSET(Potencia!F46,0,($L$1-1)*10)","v":"-"},{"$f":"OFFSET(Potencia!G46,0,($L$1-1)*10)","v":"-"},{"$f":"OFFSET(Potencia!H46,0,($L$1-1)*10)","v":"-"},{"$f":"OFFSET(Potencia!I46,0,($L$1-1)*10)","v":"-"},{"$f":"OFFSET(Potencia!J46,0,($L$1-1)*10)","v":"-"},{"$f":"OFFSET(Potencia!K46,0,($L$1-1)*10)","v":"-"},{"$f":"OFFSET(Potencia!L46,0,($L$1-1)*10)","v":"-"}]
[null,"Total",{"$f":"OFFSET(Potencia!C47,0,($L$1-1)*10)","v":2768.2471299999984},{"$f":"OFFSET(Potencia!D47,0,($L$1-1)*10)","v":2751.0571299999983},{"$f":"OFFSET(Potencia!E47,0,($L$1-1)*10)","v":"-"},{"$f":"OFFSET(Potencia!F47,0,($L$1-1)*10)","v":"-"},{"$f":"OFFSET(Potencia!G47,0,($L$1-1)*10)","v":"-"},{"$f":"OFFSET(Potencia!H47,0,($L$1-1)*10)","v":"-"},{"$f":"OFFSET(Potencia!I47,0,($L$1-1)*10)","v":"-"},{"$f":"OFFSET(Potencia!J47,0,($L$1-1)*10)","v":"-"},{"$f":"OFFSET(Potencia!K47,0,($L$1-1)*10)","v":"-"},{"$f":"OFFSET(Potencia!L47,0,($L$1-1)*10)","v":"-"}]
[null,"(1) Utiliza gasoil como combustible principal."]
[null,"(2) Grupos de emergencia que se instalan de forma transitoria en determinadas zonas para cubrir un déficit de generación."]
[null,"(3) Otras renovables incluyen biogás y biomasa."]
[null,"Fuente Comisión Nacional de los Mercados y la Competencia (CNMC) en: resto hidráulica, eólica, solar fotovoltaica, térmica renovable/otras renovables y térmica no renovable/cogeneración y resto/cogeneración."]
[null,{"$f":"IF(L1=2,IF(MONTH(FACT)=1,\"Datos a 31 de diciembre.\",(CONCATENATE(\"Datos a 31 de diciembre. Para el año \",YEAR(FACT), \" datos a \",TEXT(FACT-30,\"mmmm\"),\" de \",YEAR(FACT),\".\"))),\"Datos a 31 de diciembre.\")","v":"Datos a 31 de diciembre. Para el año 2017 datos a junio de 2017."}]

{"sheet":"Potencia Ceuta","index":5,"n_rows":14,"n_cols":12,"rows_kept":14,"cut":false,"hidden":false,"merged":[[13,1,13,11]]}
[null,null,null,null,null,null,null,null,null,null,null,2]
[]
[]
[]
[null,null,null,null,null,null,null,null,null,"Sistema eléctrico"]
[null,null,null,null,null,null,null,null,null,"Periodo"]
[]
[null,null,{"$f":"OFFSET(Potencia!C49,0,($L$1-1)*10)","v":2016},{"$f":"OFFSET(Potencia!D49,0,($L$1-1)*10)","v":2017},{"$f":"OFFSET(Potencia!E49,0,($L$1-1)*10)","v":2018},{"$f":"OFFSET(Potencia!F49,0,($L$1-1)*10)","v":2019},{"$f":"OFFSET(Potencia!G49,0,($L$1-1)*10)","v":2020},{"$f":"OFFSET(Potencia!H49,0,($L$1-1)*10)","v":2021},{"$f":"OFFSET(Potencia!I49,0,($L$1-1)*10)","v":2022},{"$f":"OFFSET(Potencia!J49,0,($L$1-1)*10)","v":2023},{"$f":"OFFSET(Potencia!K49,0,($L$1-1)*10)","v":2024},{"$f":"OFFSET(Potencia!L49,0,($L$1-1)*10)","v":2025}]
[]
[null,"Motores diesel",{"$f":"OFFSET(Potencia!C50,0,($L$1-1)*10)","v":77.52},{"$f":"OFFSET(Potencia!D50,0,($L$1-1)*10)","v":77.52},{"$f":"OFFSET(Potencia!E50,0,($L$1-1)*10)","v":"-"},{"$f":"OFFSET(Potencia!F50,0,($L$1-1)*10)","v":"-"},{"$f":"OFFSET(Potencia!G50,0,($L$1-1)*10)","v":"-"},{"$f":"OFFSET(Potencia!H50,0,($L$1-1)*10)","v":"-"},{"$f":"OFFSET(Potencia!I50,0,($L$1-1)*10)","v":"-"},{"$f":"OFFSET(Potencia!J50,0,($L$1-1)*10)","v":"-"},{"$f":"OFFSET(Potencia!K50,0,($L$1-1)*10)","v":"-"},{"$f":"OFFSET(Potencia!L50,0,($L$1-1)*10)","v":"-"}]
[null,"Turbina de gas",{"$f":"OFFSET(Potencia!C51,0,($L$1-1)*10)","v":13.3},{"$f":"OFFSET(Potencia!D51,0,($L$1-1)*10)","v":13.3},{"$f":"OFFSET(Potencia!E51,0,($L$1-1)*10)","v":"-"},{"$f":"OFFSET(Potencia!F51,0,($L$1-1)*10)","v":"-"},{"$f":"OFFSET(Potencia!G51,0,($L$1-1)*10)","v":"-"},{"$f":"OFFSET(Potencia!H51,0,($L$1-1)*10)","v":"-"},{"$f":"OFFSET(Potencia!I51,0,($L$1-1)*10)","v":"-"},{"$f":"OFFSET(Potencia!J51,0,($L$1-1)*10)","v":"-"},{"$f":"OFFSET(Potencia!K51,0,($L$1-1)*10)","v":"-"},{"$f":"OFFSET(Potencia!L51,0,($L$1-1)*10)","v":"-"}]
[null,"Fuel + Gas",{"$f":"OFFSET(Potencia!C52,0,($L$1-1)*10)","v":90.82},{"$f":"OFFSET(Potencia!D52,0,($L$1-1)*10)","v":90.82},{"$f":"OFFSET(Potencia!E52,0,($L$1-1)*10)","v":"-"},{"$f":"OFFSET(Potencia!F52,0,($L$1-1)*10)","v":"-"},{"$f":"OFFSET(Potencia!G52,0,($L$1-1)*10)","v":"-"},{"$f":"OFFSET(Potencia!H52,0,($L$1-1)*10)","v":"-"},{"$f":"OFFSET(Potencia!I52,0,($L$1-1)*10)","v":"-"},{"$f":"OFFSET(Potencia!J52,0,($L$1-1)*10)","v":"-"},{"$f":"OFFSET(Potencia!K52,0,($L$1-1)*10)","v":"-"},{"$f":"OFFSET(Potencia!L52,0,($L$1-1)*10)","v":"-"}]
[null,"Total",{"$f":"OFFSET(Potencia!C53,0,($L$1-1)*10)","v":90.82},{"$f":"OFFSET(Potencia!D53,0,($L$1-1)*10)","v":90.82},{"$f":"OFFSET(Potencia!E53,0,($L$1-1)*10)","v":"-"},{"$f":"OFFSET(Potencia!F53,0,($L$1-1)*10)","v":"-"},{"$f":"OFFSET(Potencia!G53,0,($L$1-1)*10)","v":"-"},{"$f":"OFFSET(Potencia!H53,0,($L$1-1)*10)","v":"-"},{"$f":"OFFSET(Potencia!I53,0,($L$1-1)*10)","v":"-"},{"$f":"OFFSET(Potencia!J53,0,($L$1-1)*10)","v":"-"},{"$f":"OFFSET(Potencia!K53,0,($L$1-1)*10)","v":"-"},{"$f":"OFFSET(Potencia!L53,0,($L$1-1)*10)","v":"-"}]
[null,{"$f":"IF(L1=2,IF(MONTH(FACT)=1,\"Datos a 31 de diciembre.\",(CONCATENATE(\"Datos a 31 de diciembre. Para el año \",YEAR(FACT), \" datos a \",TEXT(FACT-30,\"mmmm\"),\" de \",YEAR(FACT),\".\"))),\"Datos a 31 de diciembre.\")","v":"Datos a 31 de diciembre. Para el año 2017 datos a junio de 2017."}]

{"sheet":"Potencia Melilla","index":6,"n_rows":19,"n_cols":12,"rows_kept":19,"cut":false,"hidden":false,"merged":[[18,1,18,11],[17,1,17,11],[19,1,19,11],[16,1,16,5]]}
[null,null,null,null,null,null,null,null,null,null,null,2]
[]
[]
[]
[null,null,null,null,null,null,null,null,null,"Sistema eléctrico"]
[null,null,null,null,null,null,null,null,null,"Periodo"]
[]
[null,null,{"$f":"OFFSET(Potencia!C55,0,($L$1-1)*10)","v":2016},{"$f":"OFFSET(Potencia!D55,0,($L$1-1)*10)","v":2017},{"$f":"OFFSET(Potencia!E55,0,($L$1-1)*10)","v":2018},{"$f":"OFFSET(Potencia!F55,0,($L$1-1)*10)","v":2019},{"$f":"OFFSET(Potencia!G55,0,($L$1-1)*10)","v":2020},{"$f":"OFFSET(Potencia!H55,0,($L$1-1)*10)","v":2021},{"$f":"OFFSET(Potencia!I55,0,($L$1-1)*10)","v":2022},{"$f":"OFFSET(Potencia!J55,0,($L$1-1)*10)","v":2023},{"$f":"OFFSET(Potencia!K55,0,($L$1-1)*10)","v":2024},{"$f":"OFFSET(Potencia!L55,0,($L$1-1)*10)","v":2025}]
[]
[null,"Motores diesel",{"$f":"OFFSET(Potencia!C56,0,($L$1-1)*10)","v":64.64},{"$f":"OFFSET(Potencia!D56,0,($L$1-1)*10)","v":64.64},{"$f":"OFFSET(Potencia!E56,0,($L$1-1)*10)","v":"-"},{"$f":"OFFSET(Potencia!F56,0,($L$1-1)*10)","v":"-"},{"$f":"OFFSET(Potencia!G56,0,($L$1-1)*10)","v":"-"},{"$f":"OFFSET(Potencia!H56,0,($L$1-1)*10)","v":"-"},{"$f":"OFFSET(Potencia!I56,0,($L$1-1)*10)","v":"-"},{"$f":"OFFSET(Potencia!J56,0,($L$1-1)*10)","v":"-"},{"$f":"OFFSET(Potencia!K56,0,($L$1-1)*10)","v":"-"},{"$f":"OFFSET(Potencia!L56,0,($L$1-1)*10)","v":"-"}]
[null,"Turbina de gas",{"$f":"OFFSET(Potencia!C57,0,($L$1-1)*10)","v":11.5},{"$f":"OFFSET(Potencia!D57,0,($L$1-1)*10)","v":11.5},{"$f":"OFFSET(Potencia!E57,0,($L$1-1)*10)","v":"-"},{"$f":"OFFSET(Potencia!F57,0,($L$1-1)*10)","v":"-"},{"$f":"OFFSET(Potencia!G57,0,($L$1-1)*10)","v":"-"},{"$f":"OFFSET(Potencia!H57,0,($L$1-1)*10)","v":"-"},{"$f":"OFFSET(Potencia!I57,0,($L$1-1)*10)","v":"-"},{"$f":"OFFSET(Potencia!J57,0,($L$1-1)*10)","v":"-"},{"$f":"OFFSET(Potencia!K57,0,($L$1-1)*10)","v":"-"},{"$f":"OFFSET(Potencia!L57,0,($L$1-1)*10)","v":"-"}]
[null,"Fuel + Gas",{"$f":"OFFSET(Potencia!C58,0,($L$1-1)*10)","v":76.14},{"$f":"OFFSET(Potencia!D58,0,($L$1-1)*10)","v":76.14},{"$f":"OFFSET(Potencia!E58,0,($L$1-1)*10)","v":"-"},{"$f":"OFFSET(Potencia!F58,0,($L$1-1)*10)","v":"-"},{"$f":"OFFSET(Potencia!G58,0,($L$1-1)*10)","v":"-"},{"$f":"OFFSET(Potencia!H58,0,($L$1-1)*10)","v":"-"},{"$f":"OFFSET(Potencia!I58,0,($L$1-1)*10)","v":"-"},{"$f":"OFFSET(Potencia!J58,0,($L$1-1)*10)","v":"-"},{"$f":"OFFSET(Potencia!K58,0,($L$1-1)*10)","v":"-"},{"$f":"OFFSET(Potencia!L58,0,($L$1-1)*10)","v":"-"}]
[null,"Solar fotovoltaica",{"$f":"OFFSET(Potencia!C59,0,($L$1-1)*10)","v":5.79E-2},{"$f":"OFFSET(Potencia!D59,0,($L$1-1)*10)","v":5.79E-2},{"$f":"OFFSET(Potencia!E59,0,($L$1-1)*10)","v":"-"},{"$f":"OFFSET(Potencia!F59,0,($L$1-1)*10)","v":"-"},{"$f":"OFFSET(Potencia!G59,0,($L$1-1)*10)","v":"-"},{"$f":"OFFSET(Potencia!H59,0,($L$1-1)*10)","v":"-"},{"$f":"OFFSET(Potencia!I59,0,($L$1-1)*10)","v":"-"},{"$f":"OFFSET(Potencia!J59,0,($L$1-1)*10)","v":"-"},{"$f":"OFFSET(Potencia!K59,0,($L$1-1)*10)","v":"-"},{"$f":"OFFSET(Potencia!L59,0,($L$1-1)*10)","v":"-"}]
[null,"Térmica no renovable/Cogeneración y resto/Cogeneración",{"$f":"OFFSET(Potencia!C60,0,($L$1-1)*10)","v":"-"},{"$f":"OFFSET(Potencia!D60,0,($L$1-1)*10)","v":"-"},{"$f":"OFFSET(Potencia!E60,0,($L$1-1)*10)","v":"-"},{"$f":"OFFSET(Potencia!F60,0,($L$1-1)*10)","v":"-"},{"$f":"OFFSET(Potencia!G60,0,($L$1-1)*10)","v":"-"},{"$f":"OFFSET(Potencia!H60,0,($L$1-1)*10)","v":"-"},{"$f":"OFFSET(Potencia!I60,0,($L$1-1)*10)","v":"-"},{"$f":"OFFSET(Potencia!J60,0,($L$1-1)*10)","v":"-"},{"$f":"OFFSET(Potencia!K60,0,($L$1-1)*10)","v":"-"},{"$f":"OFFSET(Potencia!L60,0,($L$1-1)*10)","v":"-"}]
[null,"Residuos (1)",{"$f":"OFFSET(Potencia!C61,0,($L$1-1)*10)","v":2.1680000000000001},{"$f":"OFFSET(Potencia!D61,0,($L$1-1)*10)","v":2.1680000000000001},{"$f":"OFFSET(Potencia!E61,0,($L$1-1)*10)","v":"-"},{"$f":"OFFSET(Potencia!F61,0,($L$1-1)*10)","v":"-"},{"$f":"OFFSET(Potencia!G61,0,($L$1-1)*10)","v":"-"},{"$f":"OFFSET(Potencia!H61,0,($L$1-1)*10)","v":"-"},{"$f":"OFFSET(Potencia!I61,0,($L$1-1)*10)","v":"-"},{"$f":"OFFSET(Potencia!J61,0,($L$1-1)*10)","v":"-"},{"$f":"OFFSET(Potencia!K61,0,($L$1-1)*10)","v":"-"},{"$f":"OFFSET(Potencia!L61,0,($L$1-1)*10)","v":"-"}]
[null,"Total",{"$f":"OFFSET(Potencia!C62,0,($L$1-1)*10)","v":78.365900000000011},{"$f":"OFFSET(Potencia!D62,0,($L$1-1)*10)","v":78.365900000000011},{"$f":"OFFSET(Potencia!E62,0,($L$1-1)*10)","v":"-"},{"$f":"OFFSET(Potencia!F62,0,($L$1-1)*10)","v":"-"},{"$f":"OFFSET(Potencia!G62,0,($L$1-1)*10)","v":"-"},{"$f":"OFFSET(Potencia!H62,0,($L$1-1)*10)","v":"-"},{"$f":"OFFSET(Potencia!I62,0,($L$1-1)*10)","v":"-"},{"$f":"OFFSET(Potencia!J62,0,($L$1-1)*10)","v":"-"},{"$f":"OFFSET(Potencia!K62,0,($L$1-1)*10)","v":"-"},{"$f":"OFFSET(Potencia!L62,0,($L$1-1)*10)","v":"-"}]
[null,"(1) Potencia incluída en térmica no renovable/cogeneración y resto/cogeneración hasta el 31/12/2014."]
[null,"Fuente Comisión Nacional de los Mercados y la Competencia (CNMC) en: solar fotovoltaica, térmica no renovable/cogeneración y resto/cogeneración y residuos."]
[null,{"$f":"IF(L1=2,IF(MONTH(FACT)=1,\"Datos a 31 de diciembre.\",(CONCATENATE(\"Datos a 31 de diciembre. Para el año \",YEAR(FACT), \" datos a \",TEXT(FACT-30,\"mmmm\"),\" de \",YEAR(FACT),\".\"))),\"Datos a 31 de diciembre.\")","v":"Datos a 31 de diciembre. Para el año 2017 datos a junio de 2017."}]

{"sheet":"Potencia","index":7,"n_rows":80,"n_cols":32,"rows_kept":80,"cut":false,"hidden":true,"merged":[]}
[]
[null,"Potencia instalada peninsular (MW)",1990,1991,1992,1993,1994,1995,1996,1997,1998,1999,2000,2001,2002,2003,2004,2005,2006,2007,2008,2009,2010,2011,2012,2013,2014,2015,2016,2017,2018,2019]
[null,"Hidráulica convencional y mixta",13792.61,13795.26,13848.85,13848.85,14063.97,14088.07,14143.08,14143.08,14143.08,14299.34,14299.34,14301.27,14304.68,14462.1,14492.17,14534.06,14566.41,14579.41,14635.51,14635.51,14655.31,14667.21,14886.65,14889.69,14895.92,{"$f":"(14919.03)+2098.60878","v":17017.638780000001},{"$f":"(14919.03+2.78)+2101.48378","v":17023.29378},{"$f":"(14921.81)+2077.68678","v":16999.496780000001},"-","-"]
[null,"Bombeo puro",2428.44,2428.44,2428.44,2428.44,2428.44,2428.44,2428.44,2428.44,2428.44,2428.44,2428.44,2428.44,2428.44,2428.44,2428.44,2428.44,2450.9399999999996,2450.9399999999996,2450.9399999999996,2450.9399999999996,2450.9399999999996,2450.9399999999996,2450.9399999999996,2450.9399999999996,2450.9399999999996,{"$f":"3300.54+28.35","v":3328.89},3328.89,3328.89,"-","-"]
[null,"Hidráulica",16221.050000000001,16223.7,16277.29,16277.29,16492.41,16516.509999999998,16571.52,16571.52,16571.52,16727.78,16727.78,16729.71,16733.12,16890.54,16920.61,16962.5,17017.349999999999,17030.349999999999,17086.45,17086.45,17106.25,17118.149999999998,17337.59,17340.63,17346.86,{"$f":"SUM(AB3:AB4)","v":20346.528780000001},{"$f":"SUM(AC3:AC4)","v":20352.183779999999},{"$f":"SUM(AD3:AD4)","v":20328.386780000001},"-","-"]
[null,"Nuclear",7329.28,7343.28,7391,7391,7391,7391,7391,7559.1,7606.09,7650.09,7677.39,7694.1,7694.1,7614.3099999999995,7590.15,7597.2799999999988,7455.58,7455.58,7455.58,7455.58,7515.3700000000008,7572.58,7572.58,7572.58,7572.58,7572.58,7572.58,7572.58,"-","-"]
[null,"Carbón",10243,10310,10310,10310,10310,10310,10310,10859.9,10859.9,10859.9,11048.67,11058.880000000001,11051.18,11053.22,11036.69,10909.960000000001,10924.300000000001,10857.650000000001,10856.400000000001,10856.400000000001,10873.95,11103.390000000001,10595.47,10610.37,10468.02,10468.02,{"$f":"9587.7-51.83","v":9535.8700000000008},{"$f":"9587.7-51.83","v":9535.8700000000008},"-","-"]
[null,"Fuel + Gas",7259.3499999999995,7247.2199999999993,7247.2199999999993,7247.2199999999993,7247.2199999999993,7247.2199999999993,7521.2199999999993,7521.2199999999993,7521.2199999999993,7521.2199999999993,7521.2199999999993,7521.2199999999993,7220.05,6655.2799999999988,6663.9199999999992,6369.9199999999992,6369.9199999999992,4521.99,4179.99,2826.07,2144.79,806.52,505.52,505.52,505.52,0,0,0,"-","-"]
[null,"Ciclo combinado","-","-","-","-","-","-","-","-","-","-","-","-",2619.4699999999998,4123.13,8062.079999999999,11992.369999999999,15304.920000000004,20672.210000000003,21374.120000000003,22750.110000000008,24844.380000000005,24911.730000000003,24947.71,24947.71,24947.71,24947.71,24947.71,24947.71,"-","-"]
[null,"Resto hidráulica",594.21899999999994,644.23300000000006,727.77200000000005,793.65499999999997,897.16899999999976,1123.8878,1186.0117999999998,1233.3739499999999,1279.3079499999999,1331.8859499999999,1390.6804499999998,1473.1629499999999,1512.3313500000002,1567.29655,1629.9055500000002,1694.9185499999999,1796.3650500000001,1869.6106499999996,1977.2756499999998,2020.3066500000002,2030.9589800000001,2036.4207800000001,2039.9287800000002,2094.9217799999997,2094.9217799999997,"-","-","-","-","-"]
[null,"Eólica",0.54,0.54,30.439999999999998,33.630000000000003,38.910000000000004,96.559999999999988,146.35999999999999,375.44499999999999,633.77499999999998,1021.942,1828.9220000000003,2816.9320000000002,4390.9845000000005,5816.0565000000006,7777.1265000000003,9654.0224999999991,11285.709699999999,13525.789700000001,15992.826700000003,18714.441700000003,19561.053450000003,21018.087449999999,22608.70205,22852.974049999993,22871.444549999997,22873.244549999996,22900.244549999996,22841.444549999997,"-","-"]
[null,"Solar fotovoltaica",0.1,0.1,0.1,0.1,1.1000000000000001,1.1000000000000001,1.1000000000000001,1.137,1.159,1.2201599999999999,1.7157400000000003,2.1768100000000001,4.8429000000000002,11.375629999999969,20.925459999999859,42.94620000000004,118.85114000000021,594.27135000000033,3205.1997500001021,3243.2076300001027,3645.2139100000977,4032.0594600000986,4293.5912300000982,4396.5001700001485,4402.664610000149,4418.107080000148,4429.5942300001498,4430.0938300001499,"-","-"]
[null,"Solar térmica","-","-","-","-","-","-","-","-","-","-","-","-","-","-","-","-",11.02,11.02,60.92,232.22,531.91999999999996,998.52,1949.92,2299.4275000000002,2299.4275000000002,2299.4275000000002,2299.4275000000002,2299.4275000000002,"-","-"]
[null,"Térmica renovable/Otras renovables","-","-",15.459999999999999,20.96,20.96,62.134999999999998,80.031000000000006,101.988,114.72999999999999,128.54599999999999,181.30199999999999,229.33800000000002,341.29250000000002,433.44349999999997,451.07850000000008,478.67449999999997,554.42849999999999,572.6689100000001,612.49491,740.10491000000002,778.78391000000011,882.91990999999996,968.43241,944.44241000000011,981.96541000000002,742.16241000000014,743.11741000000018,742.46041000000014,"-","-"]
[null,"Térmica no renovable/Cogeneración y resto/Cogeneración",159.155,225.50699999999998,334.25400000000002,534.61200000000008,682.43600000000004,1162.9033000000002,1834.3803,2336.5797000000002,2956.4976999999994,3610.6446999999998,4216.4216999999999,4969.2517000000007,5377.3337000000001,5731.7867000000015,5987.431700000001,6162.5016999999998,6370.5046999999995,6482.9881000000005,6736.6391000000003,6968.1220000000003,7098.0841999999993,7179.0716999999986,7117.1501999999982,7057.8806999999997,7047.8021999999992,6607.908199999998,6600.4531999999981,6503.7461999999978,"-","-"]
[null,"Residuos","-","-","-","-","-","-","-","-","-","-","-","-","-","-","-","-","-","-","-","-","-","-","-","-","-",677.40600000000006,677.40600000000006,669.99599999999998,"-","-"]
[null,"Total",{"$f":"SUM(C5:C16)","v":41806.693999999996},{"$f":"SUM(D5:D16)","v":41994.579999999994},42333.536,42608.466999999997,43081.205000000009,43911.316099999989,45041.623100000004,46560.263650000008,47544.19965000001,48853.228810000001,50594.101889999998,52494.771460000004,56944.704950000014,59896.438880000002,66139.917710000009,71865.093449999986,77208.949090000009,83594.128710000005,89537.896110000103,92893.012890000115,96130.75445000011,97659.449300000109,99936.594670000093,100622.95661000014,100538.91605000016,{"$f":"SUM(AB5:AB16)","v":100953.09452000014},{"$f":"SUM(AC5:AC16)","v":100058.58667000016},{"$f":"SUM(AD5:AD16)","v":99871.715270000146},"-","-"]
[]
[null,"Potencia instalada Islas Baleares (MW)",2006,2007,2008,2009,2010,2011,2012,2013,2014,2015,2016,2017,2018,2019,2020,2021,2022,2023,2024,2025]
[null,"Carbón",468.4,468.4,468.4,468.4,468.4,468.4,468.4,468.4,468.4,468.4,468.4,468.4,"-","-","-","-","-","-","-","-"]
[null,"Motores diesel",175.6,210.4,203.3,196.2,196.2,182,182,182,182,182,182,182,"-","-","-","-","-","-","-","-"]
[null,"Turbina de gas",541.89999999999986,387.9,460.7999999999999,531.79999999999995,533.4,533.4,557.4,605.4,605.4,605.4,605.4,605.4,"-","-","-","-","-","-","-","-"]
[null,"Fuel + Gas",{"$f":"SUM(C21:C22)","v":717.49999999999989},598.29999999999995,664.09999999999991,728,729.59999999999991,715.4,739.4,787.4,787.4,{"$f":"SUM(L21:L22)","v":787.4},{"$f":"SUM(M21:M22)","v":787.4},787.4,"-","-","-","-","-","-","-","-"]
[null,"Ciclo combinado",418.15,643.45000000000005,643.45000000000005,793.65000000000009,857.95,857.95,857.95,857.95,857.95,857.95,857.95,857.95,"-","-","-","-","-","-","-","-"]
[null,"Generación auxiliar","-","-","-","-","-","-","-","-","-","-","-",12.72,"-","-","-","-","-","-","-","-"]
[null,"Eólica",3.6762999999999901,3.6762999999999999,3.6762999999999999,3.6762999999999999,3.6762999999999999,3.6762999999999901,3.6762999999999901,3.6762999999999999,3.6762999999999999,3.6762999999999999,3.6762999999999999,3.6762999999999999,"-","-","-","-","-","-","-","-"]
[null,"Solar fotovoltaica",1.1128899999999999,1.4766900000000001,51.537539999999701,52.584539999999699,59.013529999999705,63.132079999999704,77.5061299999997,77.674929999999904,77.733829999999898,77.769779999999898,77.769779999999898,77.765779999999907,"-","-","-","-","-","-","-","-"]
[null,"Térmica renovable/Otras renovables","-","-","-","-","-","-",2.13,2.13,2.13,2.13,2.13,2.13,"-","-","-","-","-","-","-","-"]
[null,"Térmica no renovable/Cogeneración y resto/Cogeneración",38.31,39.167999999999999,38.188000000000002,40.402000000000001,81.170999999999992,82.170999999999992,85.625,85.625,85.625,10.824999999999999,10.824999999999999,10.824999999999999,"-","-","-","-","-","-","-","-"]
[null,"Residuos","-","-","-","-","-","-","-","-","-",74.8,74.8,74.8,"-","-","-","-","-","-","-","-"]
[null,"Total",{"$f":"SUM(C20,C23:C30)","v":1647.1491899999999},{"$f":"SUM(D20,D23:D30)","v":1754.4709899999998},1869.35184,2086.7128399999997,2199.8108299999994,2190.7293799999998,2234.6874299999999,2282.8562300000003,2282.9151300000003,2282.9510800000003,2282.9510800000003,{"$f":"SUM(N20,N23:N30)","v":2295.6670799999997},"-","-","-","-","-","-","-","-"]
[]
[null,"Potencia instalada Islas Canarias (MW)",2006,2007,2008,2009,2010,2011,2012,2013,2014,2015,2016,2017,2018,2019,2020,2021,2022,2023,2024,2025]
[null,"Hidráulica",0.8,0.8,0.8,0.8,0.8,0.8,0.8,0.8,0.8,1.2630000000000001,1.2630000000000001,{"$f":"0.8+0.463","v":1.2630000000000001},"-","-","-","-","-","-","-","-"]
[null,"Motores diesel",476.73000000000008,476.73000000000008,476.73000000000008,476.73000000000008,476.73000000000008,476.73000000000008,476.73000000000008,496.2000000000001,495.92000000000013,495.92000000000013,495.92000000000013,495.92000000000013,"-","-","-","-","-","-","-","-"]
[null,"Turbina de gas",520.17000000000007,520.17000000000007,520.17000000000007,520.17000000000007,520.17000000000007,557.16000000000008,557.16000000000008,557.16000000000008,557.16000000000008,557.1400000000001,557.1400000000001,557.1400000000001,"-","-","-","-","-","-","-","-"]
[null,"Turbina de vapor",659.78,659.78,659.78,659.78,659.78,659.78,659.78,482.64,482.64,482.64,482.64,482.64,"-","-","-","-","-","-","-","-"]
[null,"Fuel + Gas",{"$f":"SUM(C35:C37)","v":1656.68},{"$f":"SUM(D35:D37)","v":1656.68},{"$f":"SUM(E35:E37)","v":1656.68},1656.68,1656.68,1693.67,1693.67,1536,1535.7200000000003,1535.7000000000003,1535.7000000000003,{"$f":"SUM(N35:N37)","v":1535.7000000000003},"-","-","-","-","-","-","-","-"]
[null,"Ciclo combinado",635.20000000000005,635.20000000000005,635.20000000000005,640.20000000000005,870.60000000000014,864.2,864.2,864.2,864.2,864.2,864.2,864.2,"-","-","-","-","-","-","-","-"]
[null,"Generación auxiliar",41.269999999999996,41.35,16.18,16.100000000000001,"-","-","-","-","-","-","-","-","-","-","-","-","-","-","-","-"]
[null,"Hidroéolica","-","-","-","-","-","-","-","-",11.39,11.39,11.39,11.39,"-","-","-","-","-","-","-","-"]
[null,"Resto hidráulica",0.46300000000000002,0.46300000000000002,0.46300000000000002,0.46300000000000002,0.46300000000000002,0.46300000000000002,0.46300000000000002,0.46300000000000002,0.46300000000000002,"-","-","-","-","-","-","-","-","-","-","-"]
[null,"Eólica",126.645,134.95499999999998,136.98499999999999,142.58500000000001,142.58500000000001,145.13499999999999,145.47499999999999,152.59,152.59,152.59,152.59,135.4,"-","-","-","-","-","-","-","-"]
[null,"Solar fotovoltaica",5.4037799999999896,22.222709999999999,93.754159999999203,95.706609999999202,125.0978099999992,138.04025999999908,161.15557999999911,164.19107999999801,165.24327999999801,165.768129999998,166.46812999999801,166.46812999999801,"-","-","-","-","-","-","-","-"]
[null,"Térmica renovable/Otras renovables",38.200000000000003,40.296000000000006,41.568000000000005,41.568000000000005,41.568000000000005,3.3679999999999999,3.3679999999999999,3.3679999999999999,3.3679999999999999,3.3679999999999999,3.3679999999999999,3.3679999999999999,"-","-","-","-","-","-","-","-"]
[null,"Térmica no renovable/Cogeneración y resto/Cogeneración",33.268000000000001,33.268000000000001,33.268000000000001,33.268000000000001,33.268000000000001,33.268000000000001,33.268000000000001,33.268000000000001,33.268000000000001,33.268000000000001,33.268000000000001,33.268000000000001,"-","-","-","-","-","-","-","-"]
[null,"Total",{"$f":"SUM(C34,C38:C46)","v":2537.9297800000004},2565.2347100000002,2614.8981599999997,2627.3706099999999,2871.0618099999997,2878.9442599999988,2902.3995799999993,2754.8800799999985,2767.0422799999983,2767.5471299999986,2768.2471299999984,{"$f":"SUM(N34,N38:N46)","v":2751.0571299999983},"-","-","-","-","-","-","-","-"]
[]
[null,"Potencia instalada Ceuta (MW)",2006,2007,2008,2009,2010,2011,2012,2013,2014,2015,2016,2017,2018,2019,2020,2021,2022,2023,2024,2025]
[null,"Motores diesel",53.3,64.47999999999999,65.72,65.72,77.52,77.52,77.52,77.52,77.52,77.52,77.52,77.52,"-","-","-","-","-","-","-","-"]
[null,"Turbina de gas","-","-","-","-",13.3,13.3,13.3,13.3,13.3,13.3,13.3,13.3,"-","-","-","-","-","-","-","-"]
[null,"Fuel + Gas",{"$f":"SUM(C50:C51)","v":53.3},{"$f":"SUM(D50:D51)","v":64.47999999999999},65.72,65.72,90.82,90.82,90.82,90.82,90.82,90.82,90.82,{"$f":"SUM(N50:N51)","v":90.82},"-","-","-","-","-","-","-","-"]
[null,"Total",{"$f":"C52","v":53.3},{"$f":"D52","v":64.47999999999999},65.72,65.72,90.82,90.82,90.82,90.82,90.82,90.82,90.82,{"$f":"N52","v":90.82},{"$f":"O52","v":"-"},"-","-","-","-","-","-","-"]
[]
[null,"Potencia instalada Melilla (MW)",2006,2007,2008,2009,2010,2011,2012,2013,2014,2015,2016,2017,2018,2019,2020,2021,2022,2023,2024,2025]
[null,"Motores diesel",49.81,64.510000000000005,64.64,64.64,64.64,64.64,64.64,64.64,64.64,64.64,64.64,64.64,"-","-","-","-","-","-","-","-"]
[null,"Turbina de gas",11.5,11.5,11.5,11.5,11.5,11.5,11.5,11.5,11.5,11.5,11.5,11.5,"-","-","-","-","-","-","-","-"]
[null,"Fuel + Gas",{"$f":"SUM(C56:C57)","v":61.31},{"$f":"SUM(D56:D57)","v":76.010000000000005},76.14,76.14,76.14,76.14,76.14,76.14,76.14,76.14,76.14,{"$f":"SUM(N56:N57)","v":76.14},"-","-","-","-","-","-","-","-"]
[null,"Solar fotovoltaica",7.4999999999999997E-3,8.3999999999999995E-3,5.79E-2,5.79E-2,5.79E-2,5.79E-2,5.79E-2,5.79E-2,5.79E-2,5.79E-2,5.79E-2,5.79E-2,"-","-","-","-","-","-","-","-"]
[null,"Térmica no renovable/Cogeneración y resto/Cogeneración",0,2.1680000000000001,2.1680000000000001,2.1680000000000001,2.1680000000000001,2.1680000000000001,2.1680000000000001,2.1680000000000001,2.1680000000000001,"-","-","-","-","-","-","-","-","-","-","-"]
[null,"Residuos","-","-","-","-","-","-","-","-","-",2.1680000000000001,2.1680000000000001,2.1680000000000001,"-","-","-","-","-","-","-","-"]
[null,"Total",{"$f":"SUM(C58:C61)","v":61.317500000000003},{"$f":"SUM(D58:D61)","v":78.186400000000006},78.365900000000011,78.365900000000011,78.365900000000011,78.365900000000011,78.365900000000011,78.365900000000011,78.365900000000011,78.365900000000011,78.365900000000011,{"$f":"SUM(N58:N61)","v":78.365900000000011},"-","-","-","-","-","-","-","-"]
[]
[null,"Potencia instalada nacional (MW)",2006,2007,2008,2009,2010,2011,2012,2013,2014,2015,2016,2017,2018,2019,2020,2021,2022,2023,2024,2025]
[null,"Hidráulica convencional y mixta",{"$f":"SUM(S3,C34)","v":14567.21},{"$f":"SUM(T3,D34)","v":14580.21},14636.31,14636.31,14656.109999999999,14668.009999999998,14887.449999999999,14890.49,14896.72,17018.90178,{"$f":"SUM(AC3,M34)","v":17024.556779999999},17000.75978,"-","-","-","-","-","-","-","-"]
[null,"Bombeo puro",{"$f":"\nS4","v":2450.9399999999996},{"$f":"\nT4","v":2450.9399999999996},2450.9399999999996,2450.9399999999996,2450.9399999999996,2450.9399999999996,2450.9399999999996,2450.9399999999996,2450.9399999999996,3328.89,{"$f":"\nAC4","v":3328.89},3328.89,"-","-","-","-","-","-","-","-"]
[null,"Hidráulica",{"$f":"SUM(C65:C66)","v":17018.149999999998},{"$f":"SUM(D65:D66)","v":17031.149999999998},17087.25,17087.25,17107.05,17118.949999999997,17338.39,17341.43,17347.66,20347.79178,{"$f":"SUM(M65:M66)","v":20353.446779999998},{"$f":"SUM(N65:N66)","v":20329.64978},"-","-","-","-","-","-","-","-"]
[null,"Nuclear",{"$f":"S6","v":7455.58},{"$f":"T6","v":7455.58},7455.58,7455.58,7515.3700000000008,7572.58,7572.58,7572.58,7572.58,7572.58,{"$f":"AC6","v":7572.58},7572.58,"-","-","-","-","-","-","-","-"]
[null,"Carbón",{"$f":"SUM(S7,C20)","v":11392.7},{"$f":"SUM(T7,D20)","v":11326.050000000001},11324.800000000001,11324.800000000001,11342.35,11571.79,11063.869999999999,11078.77,10936.42,10936.42,{"$f":"SUM(AC7,M20)","v":10004.27},10004.27,"-","-","-","-","-","-","-","-"]
[null,"Fuel + Gas",{"$f":"SUM(S8,C23,C25,C40,C38,C52,C58)","v":8899.9799999999977},{"$f":"SUM(T8,D23,D25,D40,D38,D52,D58)","v":6958.81},6658.8100000000013,5368.7100000000009,4698.03,3382.55,3105.55,2995.88,2995.6000000000004,2490.0600000000004,{"$f":"SUM(AC8,M23,M25,M40,M38,M52,M58)","v":2490.0600000000004},{"$f":"SUM(AD8,N23,N25,N40,N38,N52,N58)","v":2502.7800000000002},"-","-","-","-","-","-","-","-"]
[null,"Ciclo combinado",{"$f":"SUM(S9,C24,C39)","v":16358.270000000004},{"$f":"SUM(T9,D24,D39)","v":21950.860000000004},22652.770000000004,24183.96000000001,26572.930000000004,26633.880000000005,26669.86,26669.86,26669.86,26669.86,{"$f":"SUM(AC9,M24,M39)","v":26669.86},26669.86,"-","-","-","-","-","-","-","-"]
[null,"Hidroeólica",{"$f":"C41","v":"-"},{"$f":"D41","v":"-"},"-","-","-","-","-","-",11.39,11.39,{"$f":"M41","v":11.39},{"$f":"N41","v":11.39},{"$f":"O41","v":"-"},"-","-","-","-","-","-","-"]
[null,"Resto hidráulica",{"$f":"SUM(S10,C42)","v":1796.8280500000001},{"$f":"SUM(T10,D42)","v":1870.0736499999996},1977.7386499999998,2020.7696500000002,2031.4219800000001,2036.8837800000001,2040.3917800000002,2095.3847799999999,2095.3847799999999,"-","-","-","-","-","-","-","-","-","-","-"]
[null,"Eólica",{"$f":"SUM(S11,C26,C43)","v":11416.030999999999},{"$f":"SUM(T11,D26,D43)","v":13664.421},16133.488000000003,18860.703000000001,19707.314750000001,21166.898749999997,22757.853349999998,23009.240349999993,23027.710849999996,23029.510849999995,{"$f":"SUM(AC11,M26,M43)","v":23056.510849999995},22980.520849999997,"-","-","-","-","-","-","-","-"]
[null,"Solar fotovoltaica",{"$f":"SUM(S12,C27,C44,C59)","v":125.37531000000018},{"$f":"SUM(T12,D27,D44,D59)","v":617.97915000000035},3350.5493500001007,3391.5566800001016,3829.3831500000965,4233.2897000000976,4532.3108400000965,4638.4240800001462,4645.6996200001468,4661.7028900001451,{"$f":"SUM(AC12,M27,M44,M59)","v":4673.8900400001476},4674.3856400001478,"-","-","-","-","-","-","-","-"]
[null,"Solar térmica",{"$f":"S13","v":11.02},{"$f":"T13","v":11.02},60.92,232.22,531.91999999999996,998.52,1949.92,2299.4275000000002,2299.4275000000002,2299.4275000000002,{"$f":"AC13","v":2299.4275000000002},2299.4275000000002,"-","-","-","-","-","-","-","-"]
[null,"Térmica renovable/Otras renovables",{"$f":"SUM(S14,C28,C45)","v":592.62850000000003},{"$f":"SUM(T14,D28,D45)","v":612.96491000000015},654.06290999999999,781.67291,820.35191000000009,886.28791000000001,973.93041000000005,949.94041000000016,987.46341000000007,747.66041000000018,{"$f":"SUM(AC14,M28,M45)","v":748.61541000000022},747.95841000000019,"-","-","-","-","-","-","-","-"]
[null,"Térmica no renovable/Cogeneración y resto/Cogeneración",{"$f":"SUM(S15,C29,C46,C60)","v":6442.0826999999999},{"$f":"SUM(T15,D29,D46,D60)","v":6557.5920999999998},6810.2631000000001,7043.96,7214.6911999999993,7296.6786999999986,7238.2111999999979,7178.9416999999994,7168.8631999999989,6652.0011999999979,{"$f":"SUM(AC15,M29,M46,M60)","v":6644.546199999998},6547.8391999999976,"-","-","-","-","-","-","-","-"]
[null,"Residuos","-","-","-","-","-","-","-","-","-",{"$f":"SUM(AB16,L30,L61)","v":754.37400000000002},{"$f":"SUM(AC16,M30,M61)","v":754.37400000000002},746.96399999999994,"-","-","-","-","-","-","-","-"]
[null,"Total",{"$f":"SUM(C67:C79)","v":81508.645560000004},{"$f":"SUM(D67:D79)","v":88056.500809999998},94166.232010000094,97751.182240000126,101370.81299000009,102898.3088400001,105242.86758000008,105829.87882000011,105758.05936000012,106172.77863000013,{"$f":"SUM(M67:M79)","v":105278.97078000013},{"$f":"SUM(N67:N79)","v":105087.62538000016},"-","-","-","-","-","-","-","-"]

{"sheet":"Año","index":8,"n_rows":7,"n_cols":25,"rows_kept":7,"cut":false,"hidden":true,"merged":[]}
[null,null,null,null,null,null,null,null,null,null,null,null,null,null,null,null,null,null,null,null,null,null,null,null,1]
[null,"1990-1999","2006-2015",null,null,null,null,null,null,null,null,null,null,null,"Nacional"]
[null,"2000-2009","2016-2025",null,null,null,null,null,null,null,null,null,null,null,"Peninsular"]
[null,"2010-2019",null,null,null,null,null,null,null,null,null,null,null,null,"Canarias"]
[null,null,null,null,null,null,null,null,null,null,null,null,null,null,"Baleares"]
[null,null,null,null,null,null,null,null,null,null,null,null,null,null,"Ceuta"]
[null,null,null,null,null,null,null,null,null,null,null,null,null,null,"Melilla"]