{"text_format":"1","workbook":"xlsx","n_sheets":15,"sheets":["AVISO LEGAL","Balance nacional mensual","Balance nacional anual","Balance Peninsular mensual","Balance Peninsular anual","Balance Baleares mensual","Balance Baleares anual","Balance Canarias mensual","Balance Canarias anual","Balance Ceuta mensual","Balance Ceuta anual","Balance Melilla mensual","Balance Melilla anual","Balance","Año"],"not_rendered":{"charts":0,"images":1,"macros":1,"external_links":0,"defined_names":13,"comments":0,"pivot_tables":0},"unopened":[],"bounds":{"document_bytes":16777216,"sheet_cells":100000,"rows_first":2000,"rows_last":500,"rows_between":2000,"halvings":0,"cell_chars":16384,"cell_head_chars":4096},"cells_cut":0,"cells_raw":0,"read":"whole","date_system":"1900"}

{"sheet":"AVISO LEGAL","index":0,"n_rows":23,"n_cols":10,"rows_kept":23,"cut":false,"hidden":false,"merged":[]}
[]
[null,null,null,null,null,null,null,"Fecha de actualización:",null,"2017-03-08"]
[]
[]
[]
[]
[]
[]
[]
[]
[]
[]
[]
[]
[]
[]
[]
[]
[]
[]
[]
[]
[null,null,null,null,null,null,null,null,null,"www.ree.es"]

{"sheet":"Balance nacional mensual","index":1,"n_rows":102,"n_cols":15,"rows_kept":102,"cut":false,"hidden":false,"merged":[[35,1,35,14],[34,1,34,11],[33,1,33,14],[5,2,5,9],[30,1,30,14],[31,1,31,14],[32,1,32,14],[29,1,29,9],[29,11,29,13]]}
[" mensual"]
[]
[]
[null,null,null,null,null,null,null,null,null,null,null,null,"Sistema eléctrico"]
[null,null,null,null,null,null,null,null,null,null,null,null,"Horizonte temporal"]
[null,null,null,null,null,null,null,null,null,null,null,null,"Periodo"]
[]
[null,null,"Ene.","Feb.","Mar.","Abr.","May.","Jun.","Jul.","Ago.","Sep.","Oct.","Nov.","Dic.",{"$f":"OFFSET(Año!C19,($A$102-1),0)","v":2017}]
[]
[null,"Hidráulica",{"$f":"OFFSET(Balance!C81,0,($A$102-1)*12)","v":2334.3965710000002},{"$f":"OFFSET(Balance!D81,0,($A$102-1)*12)","v":2167.2811000000002},{"$f":"OFFSET(Balance!E81,0,($A$102-1)*12)","v":"-"},{"$f":"OFFSET(Balance!F81,0,($A$102-1)*12)","v":"-"},{"$f":"OFFSET(Balance!G81,0,($A$102-1)*12)","v":"-"},{"$f":"OFFSET(Balance!H81,0,($A$102-1)*12)","v":"-"},{"$f":"OFFSET(Balance!I81,0,($A$102-1)*12)","v":"-"},{"$f":"OFFSET(Balance!J81,0,($A$102-1)*12)","v":"-"},{"$f":"OFFSET(Balance!K81,0,($A$102-1)*12)","v":"-"},{"$f":"OFFSET(Balance!L81,0,($A$102-1)*12)","v":"-"},{"$f":"OFFSET(Balance!M81,0,($A$102-1)*12)","v":"-"},{"$f":"OFFSET(Balance!N81,0,($A$102-1)*12)","v":"-"},{"$f":"IF(SUM(C10:N10)=0,\"-\",SUM(C10:N10))","v":4501.6776710000004}]
[null,"Nuclear",{"$f":"OFFSET(Balance!C82,0,($A$102-1)*12)","v":5285.3739999999998},{"$f":"OFFSET(Balance!D82,0,($A$102-1)*12)","v":4755.5749999999998},{"$f":"OFFSET(Balance!E82,0,($A$102-1)*12)","v":"-"},{"$f":"OFFSET(Balance!F82,0,($A$102-1)*12)","v":"-"},{"$f":"OFFSET(Balance!G82,0,($A$102-1)*12)","v":"-"},{"$f":"OFFSET(Balance!H82,0,($A$102-1)*12)","v":"-"},{"$f":"OFFSET(Balance!I82,0,($A$102-1)*12)","v":"-"},{"$f":"OFFSET(Balance!J82,0,($A$102-1)*12)","v":"-"},{"$f":"OFFSET(Balance!K82,0,($A$102-1)*12)","v":"-"},{"$f":"OFFSET(Balance!L82,0,($A$102-1)*12)","v":"-"},{"$f":"OFFSET(Balance!M82,0,($A$102-1)*12)","v":"-"},{"$f":"OFFSET(Balance!N82,0,($A$102-1)*12)","v":"-"},10040.949000000001]
[null,"Carbón",{"$f":"OFFSET(Balance!C83,0,($A$102-1)*12)","v":5387.1972139999998},{"$f":"OFFSET(Balance!D83,0,($A$102-1)*12)","v":3535.5151049999999},{"$f":"OFFSET(Balance!E83,0,($A$102-1)*12)","v":"-"},{"$f":"OFFSET(Balance!F83,0,($A$102-1)*12)","v":"-"},{"$f":"OFFSET(Balance!G83,0,($A$102-1)*12)","v":"-"},{"$f":"OFFSET(Balance!H83,0,($A$102-1)*12)","v":"-"},{"$f":"OFFSET(Balance!I83,0,($A$102-1)*12)","v":"-"},{"$f":"OFFSET(Balance!J83,0,($A$102-1)*12)","v":"-"},{"$f":"OFFSET(Balance!K83,0,($A$102-1)*12)","v":"-"},{"$f":"OFFSET(Balance!L83,0,($A$102-1)*12)","v":"-"},{"$f":"OFFSET(Balance!M83,0,($A$102-1)*12)","v":"-"},{"$f":"OFFSET(Balance!N83,0,($A$102-1)*12)","v":"-"},8922.7123190000002]
[null,"Fuel + Gas",{"$f":"OFFSET(Balance!C84,0,($A$102-1)*12)","v":564.00679699999989},{"$f":"OFFSET(Balance!D84,0,($A$102-1)*12)","v":501.77534099999997},{"$f":"OFFSET(Balance!E84,0,($A$102-1)*12)","v":"-"},{"$f":"OFFSET(Balance!F84,0,($A$102-1)*12)","v":"-"},{"$f":"OFFSET(Balance!G84,0,($A$102-1)*12)","v":"-"},{"$f":"OFFSET(Balance!H84,0,($A$102-1)*12)","v":"-"},{"$f":"OFFSET(Balance!I84,0,($A$102-1)*12)","v":"-"},{"$f":"OFFSET(Balance!J84,0,($A$102-1)*12)","v":"-"},{"$f":"OFFSET(Balance!K84,0,($A$102-1)*12)","v":"-"},{"$f":"OFFSET(Balance!L84,0,($A$102-1)*12)","v":"-"},{"$f":"OFFSET(Balance!M84,0,($A$102-1)*12)","v":"-"},{"$f":"OFFSET(Balance!N84,0,($A$102-1)*12)","v":"-"},1065.7821379999998]
[null,"Ciclo combinado (2)",{"$f":"OFFSET(Balance!C85,0,($A$102-1)*12)","v":3154.652748},{"$f":"OFFSET(Balance!D85,0,($A$102-1)*12)","v":1783.4263859999999},{"$f":"OFFSET(Balance!E85,0,($A$102-1)*12)","v":"-"},{"$f":"OFFSET(Balance!F85,0,($A$102-1)*12)","v":"-"},{"$f":"OFFSET(Balance!G85,0,($A$102-1)*12)","v":"-"},{"$f":"OFFSET(Balance!H85,0,($A$102-1)*12)","v":"-"},{"$f":"OFFSET(Balance!I85,0,($A$102-1)*12)","v":"-"},{"$f":"OFFSET(Balance!J85,0,($A$102-1)*12)","v":"-"},{"$f":"OFFSET(Balance!K85,0,($A$102-1)*12)","v":"-"},{"$f":"OFFSET(Balance!L85,0,($A$102-1)*12)","v":"-"},{"$f":"OFFSET(Balance!M85,0,($A$102-1)*12)","v":"-"},{"$f":"OFFSET(Balance!N85,0,($A$102-1)*12)","v":"-"},4938.0791339999996]
[null,"Régimen ordinario",{"$f":"OFFSET(Balance!C86,0,($A$102-1)*12)","v":"-"},{"$f":"OFFSET(Balance!D86,0,($A$102-1)*12)","v":"-"},{"$f":"OFFSET(Balance!E86,0,($A$102-1)*12)","v":"-"},{"$f":"OFFSET(Balance!F86,0,($A$102-1)*12)","v":"-"},{"$f":"OFFSET(Balance!G86,0,($A$102-1)*12)","v":"-"},{"$f":"OFFSET(Balance!H86,0,($A$102-1)*12)","v":"-"},{"$f":"OFFSET(Balance!I86,0,($A$102-1)*12)","v":"-"},{"$f":"OFFSET(Balance!J86,0,($A$102-1)*12)","v":"-"},{"$f":"OFFSET(Balance!K86,0,($A$102-1)*12)","v":"-"},{"$f":"OFFSET(Balance!L86,0,($A$102-1)*12)","v":"-"},{"$f":"OFFSET(Balance!M86,0,($A$102-1)*12)","v":"-"},{"$f":"OFFSET(Balance!N86,0,($A$102-1)*12)","v":"-"},"-"]
[]
[null,"Hidroeólica",{"$f":"OFFSET(Balance!C87,0,($A$102-1)*12)","v":1.084578},{"$f":"OFFSET(Balance!D87,0,($A$102-1)*12)","v":1.4047149999999999},{"$f":"OFFSET(Balance!E87,0,($A$102-1)*12)","v":"-"},{"$f":"OFFSET(Balance!F87,0,($A$102-1)*12)","v":"-"},{"$f":"OFFSET(Balance!G87,0,($A$102-1)*12)","v":"-"},{"$f":"OFFSET(Balance!H87,0,($A$102-1)*12)","v":"-"},{"$f":"OFFSET(Balance!I87,0,($A$102-1)*12)","v":"-"},{"$f":"OFFSET(Balance!J87,0,($A$102-1)*12)","v":"-"},{"$f":"OFFSET(Balance!K87,0,($A$102-1)*12)","v":"-"},{"$f":"OFFSET(Balance!L87,0,($A$102-1)*12)","v":"-"},{"$f":"OFFSET(Balance!M87,0,($A$102-1)*12)","v":"-"},{"$f":"OFFSET(Balance!N87,0,($A$102-1)*12)","v":"-"},{"$f":"IF(SUM(C17:N17)=0,\"-\",SUM(C17:N17))","v":2.489293}]
[null,"Resto hidráulica (3)",{"$f":"OFFSET(Balance!C88,0,($A$102-1)*12)","v":"-"},{"$f":"OFFSET(Balance!D88,0,($A$102-1)*12)","v":"-"},{"$f":"OFFSET(Balance!E88,0,($A$102-1)*12)","v":"-"},{"$f":"OFFSET(Balance!F88,0,($A$102-1)*12)","v":"-"},{"$f":"OFFSET(Balance!G88,0,($A$102-1)*12)","v":"-"},{"$f":"OFFSET(Balance!H88,0,($A$102-1)*12)","v":"-"},{"$f":"OFFSET(Balance!I88,0,($A$102-1)*12)","v":"-"},{"$f":"OFFSET(Balance!J88,0,($A$102-1)*12)","v":"-"},{"$f":"OFFSET(Balance!K88,0,($A$102-1)*12)","v":"-"},{"$f":"OFFSET(Balance!L88,0,($A$102-1)*12)","v":"-"},{"$f":"OFFSET(Balance!M88,0,($A$102-1)*12)","v":"-"},{"$f":"OFFSET(Balance!N88,0,($A$102-1)*12)","v":"-"},"-"]
[null,"Eólica",{"$f":"OFFSET(Balance!C89,0,($A$102-1)*12)","v":4828.3510000000006},{"$f":"OFFSET(Balance!D89,0,($A$102-1)*12)","v":4883.6773089999997},{"$f":"OFFSET(Balance!E89,0,($A$102-1)*12)","v":"-"},{"$f":"OFFSET(Balance!F89,0,($A$102-1)*12)","v":"-"},{"$f":"OFFSET(Balance!G89,0,($A$102-1)*12)","v":"-"},{"$f":"OFFSET(Balance!H89,0,($A$102-1)*12)","v":"-"},{"$f":"OFFSET(Balance!I89,0,($A$102-1)*12)","v":"-"},{"$f":"OFFSET(Balance!J89,0,($A$102-1)*12)","v":"-"},{"$f":"OFFSET(Balance!K89,0,($A$102-1)*12)","v":"-"},{"$f":"OFFSET(Balance!L89,0,($A$102-1)*12)","v":"-"},{"$f":"OFFSET(Balance!M89,0,($A$102-1)*12)","v":"-"},{"$f":"OFFSET(Balance!N89,0,($A$102-1)*12)","v":"-"},9712.0283090000012]
[null,"Solar fotovoltaica",{"$f":"OFFSET(Balance!C90,0,($A$102-1)*12)","v":470.87200000000001},{"$f":"OFFSET(Balance!D90,0,($A$102-1)*12)","v":476.32650699999999},{"$f":"OFFSET(Balance!E90,0,($A$102-1)*12)","v":"-"},{"$f":"OFFSET(Balance!F90,0,($A$102-1)*12)","v":"-"},{"$f":"OFFSET(Balance!G90,0,($A$102-1)*12)","v":"-"},{"$f":"OFFSET(Balance!H90,0,($A$102-1)*12)","v":"-"},{"$f":"OFFSET(Balance!I90,0,($A$102-1)*12)","v":"-"},{"$f":"OFFSET(Balance!J90,0,($A$102-1)*12)","v":"-"},{"$f":"OFFSET(Balance!K90,0,($A$102-1)*12)","v":"-"},{"$f":"OFFSET(Balance!L90,0,($A$102-1)*12)","v":"-"},{"$f":"OFFSET(Balance!M90,0,($A$102-1)*12)","v":"-"},{"$f":"OFFSET(Balance!N90,0,($A$102-1)*12)","v":"-"},947.19850700000006]
[null,"Solar térmica",{"$f":"OFFSET(Balance!C91,0,($A$102-1)*12)","v":149.214},{"$f":"OFFSET(Balance!D91,0,($A$102-1)*12)","v":122.50689999999999},{"$f":"OFFSET(Balance!E91,0,($A$102-1)*12)","v":"-"},{"$f":"OFFSET(Balance!F91,0,($A$102-1)*12)","v":"-"},{"$f":"OFFSET(Balance!G91,0,($A$102-1)*12)","v":"-"},{"$f":"OFFSET(Balance!H91,0,($A$102-1)*12)","v":"-"},{"$f":"OFFSET(Balance!I91,0,($A$102-1)*12)","v":"-"},{"$f":"OFFSET(Balance!J91,0,($A$102-1)*12)","v":"-"},{"$f":"OFFSET(Balance!K91,0,($A$102-1)*12)","v":"-"},{"$f":"OFFSET(Balance!L91,0,($A$102-1)*12)","v":"-"},{"$f":"OFFSET(Balance!M91,0,($A$102-1)*12)","v":"-"},{"$f":"OFFSET(Balance!N91,0,($A$102-1)*12)","v":"-"},271.72089999999997]
[null,"Otras renovables",{"$f":"OFFSET(Balance!C92,0,($A$102-1)*12)","v":327.173},{"$f":"OFFSET(Balance!D92,0,($A$102-1)*12)","v":299.38958000000002},{"$f":"OFFSET(Balance!E92,0,($A$102-1)*12)","v":"-"},{"$f":"OFFSET(Balance!F92,0,($A$102-1)*12)","v":"-"},{"$f":"OFFSET(Balance!G92,0,($A$102-1)*12)","v":"-"},{"$f":"OFFSET(Balance!H92,0,($A$102-1)*12)","v":"-"},{"$f":"OFFSET(Balance!I92,0,($A$102-1)*12)","v":"-"},{"$f":"OFFSET(Balance!J92,0,($A$102-1)*12)","v":"-"},{"$f":"OFFSET(Balance!K92,0,($A$102-1)*12)","v":"-"},{"$f":"OFFSET(Balance!L92,0,($A$102-1)*12)","v":"-"},{"$f":"OFFSET(Balance!M92,0,($A$102-1)*12)","v":"-"},{"$f":"OFFSET(Balance!N92,0,($A$102-1)*12)","v":"-"},626.56258000000003]
[null,"Cogeneración",{"$f":"OFFSET(Balance!C93,0,($A$102-1)*12)","v":2449.107},{"$f":"OFFSET(Balance!D93,0,($A$102-1)*12)","v":2127.4550900000004},{"$f":"OFFSET(Balance!E93,0,($A$102-1)*12)","v":"-"},{"$f":"OFFSET(Balance!F93,0,($A$102-1)*12)","v":"-"},{"$f":"OFFSET(Balance!G93,0,($A$102-1)*12)","v":"-"},{"$f":"OFFSET(Balance!H93,0,($A$102-1)*12)","v":"-"},{"$f":"OFFSET(Balance!I93,0,($A$102-1)*12)","v":"-"},{"$f":"OFFSET(Balance!J93,0,($A$102-1)*12)","v":"-"},{"$f":"OFFSET(Balance!K93,0,($A$102-1)*12)","v":"-"},{"$f":"OFFSET(Balance!L93,0,($A$102-1)*12)","v":"-"},{"$f":"OFFSET(Balance!M93,0,($A$102-1)*12)","v":"-"},{"$f":"OFFSET(Balance!N93,0,($A$102-1)*12)","v":"-"},4576.5620900000004]
[null,"Residuos",{"$f":"OFFSET(Balance!C94,0,($A$102-1)*12)","v":297.58500000000004},{"$f":"OFFSET(Balance!D94,0,($A$102-1)*12)","v":264.45020699999998},{"$f":"OFFSET(Balance!E94,0,($A$102-1)*12)","v":"-"},{"$f":"OFFSET(Balance!F94,0,($A$102-1)*12)","v":"-"},{"$f":"OFFSET(Balance!G94,0,($A$102-1)*12)","v":"-"},{"$f":"OFFSET(Balance!H94,0,($A$102-1)*12)","v":"-"},{"$f":"OFFSET(Balance!I94,0,($A$102-1)*12)","v":"-"},{"$f":"OFFSET(Balance!J94,0,($A$102-1)*12)","v":"-"},{"$f":"OFFSET(Balance!K94,0,($A$102-1)*12)","v":"-"},{"$f":"OFFSET(Balance!L94,0,($A$102-1)*12)","v":"-"},{"$f":"OFFSET(Balance!M94,0,($A$102-1)*12)","v":"-"},{"$f":"OFFSET(Balance!N94,0,($A$102-1)*12)","v":"-"},562.03520700000001]
[null,"Régimen especial",{"$f":"OFFSET(Balance!C95,0,($A$102-1)*12)","v":"-"},{"$f":"OFFSET(Balance!D95,0,($A$102-1)*12)","v":"-"},{"$f":"OFFSET(Balance!E95,0,($A$102-1)*12)","v":"-"},{"$f":"OFFSET(Balance!F95,0,($A$102-1)*12)","v":"-"},{"$f":"OFFSET(Balance!G95,0,($A$102-1)*12)","v":"-"},{"$f":"OFFSET(Balance!H95,0,($A$102-1)*12)","v":"-"},{"$f":"OFFSET(Balance!I95,0,($A$102-1)*12)","v":"-"},{"$f":"OFFSET(Balance!J95,0,($A$102-1)*12)","v":"-"},{"$f":"OFFSET(Balance!K95,0,($A$102-1)*12)","v":"-"},{"$f":"OFFSET(Balance!L95,0,($A$102-1)*12)","v":"-"},{"$f":"OFFSET(Balance!M95,0,($A$102-1)*12)","v":"-"},{"$f":"OFFSET(Balance!N95,0,($A$102-1)*12)","v":"-"},"-"]
[null,"Generación",{"$f":"OFFSET(Balance!C96,0,($A$102-1)*12)","v":25249.013907999997},{"$f":"OFFSET(Balance!D96,0,($A$102-1)*12)","v":20918.783240000001},{"$f":"OFFSET(Balance!E96,0,($A$102-1)*12)","v":"-"},{"$f":"OFFSET(Balance!F96,0,($A$102-1)*12)","v":"-"},{"$f":"OFFSET(Balance!G96,0,($A$102-1)*12)","v":"-"},{"$f":"OFFSET(Balance!H96,0,($A$102-1)*12)","v":"-"},{"$f":"OFFSET(Balance!I96,0,($A$102-1)*12)","v":"-"},{"$f":"OFFSET(Balance!J96,0,($A$102-1)*12)","v":"-"},{"$f":"OFFSET(Balance!K96,0,($A$102-1)*12)","v":"-"},{"$f":"OFFSET(Balance!L96,0,($A$102-1)*12)","v":"-"},{"$f":"OFFSET(Balance!M96,0,($A$102-1)*12)","v":"-"},{"$f":"OFFSET(Balance!N96,0,($A$102-1)*12)","v":"-"},46167.797147999998]
[null,"Consumos en bombeo",{"$f":"OFFSET(Balance!C97,0,($A$102-1)*12)","v":-433.831684},{"$f":"OFFSET(Balance!D97,0,($A$102-1)*12)","v":-458.08479999999997},{"$f":"OFFSET(Balance!E97,0,($A$102-1)*12)","v":"-"},{"$f":"OFFSET(Balance!F97,0,($A$102-1)*12)","v":"-"},{"$f":"OFFSET(Balance!G97,0,($A$102-1)*12)","v":"-"},{"$f":"OFFSET(Balance!H97,0,($A$102-1)*12)","v":"-"},{"$f":"OFFSET(Balance!I97,0,($A$102-1)*12)","v":"-"},{"$f":"OFFSET(Balance!J97,0,($A$102-1)*12)","v":"-"},{"$f":"OFFSET(Balance!K97,0,($A$102-1)*12)","v":"-"},{"$f":"OFFSET(Balance!L97,0,($A$102-1)*12)","v":"-"},{"$f":"OFFSET(Balance!M97,0,($A$102-1)*12)","v":"-"},{"$f":"OFFSET(Balance!N97,0,($A$102-1)*12)","v":"-"},-891.91648399999997]
[null,"Saldo intercambios internacionales (4)",{"$f":"OFFSET(Balance!C98,0,($A$102-1)*12)","v":-531.54929799999991},{"$f":"OFFSET(Balance!D98,0,($A$102-1)*12)","v":528.49059999999997},{"$f":"OFFSET(Balance!E98,0,($A$102-1)*12)","v":"-"},{"$f":"OFFSET(Balance!F98,0,($A$102-1)*12)","v":"-"},{"$f":"OFFSET(Balance!G98,0,($A$102-1)*12)","v":"-"},{"$f":"OFFSET(Balance!H98,0,($A$102-1)*12)","v":"-"},{"$f":"OFFSET(Balance!I98,0,($A$102-1)*12)","v":"-"},{"$f":"OFFSET(Balance!J98,0,($A$102-1)*12)","v":"-"},{"$f":"OFFSET(Balance!K98,0,($A$102-1)*12)","v":"-"},{"$f":"OFFSET(Balance!L98,0,($A$102-1)*12)","v":"-"},{"$f":"OFFSET(Balance!M98,0,($A$102-1)*12)","v":"-"},{"$f":"OFFSET(Balance!N98,0,($A$102-1)*12)","v":"-"},-3.0586979999999357]
[null,"Demanda transporte (b.c.)",{"$f":"OFFSET(Balance!C99,0,($A$102-1)*12)","v":24283.632925999998},{"$f":"OFFSET(Balance!D99,0,($A$102-1)*12)","v":20989.189040000001},{"$f":"OFFSET(Balance!E99,0,($A$102-1)*12)","v":"-"},{"$f":"OFFSET(Balance!F99,0,($A$102-1)*12)","v":"-"},{"$f":"OFFSET(Balance!G99,0,($A$102-1)*12)","v":"-"},{"$f":"OFFSET(Balance!H99,0,($A$102-1)*12)","v":"-"},{"$f":"OFFSET(Balance!I99,0,($A$102-1)*12)","v":"-"},{"$f":"OFFSET(Balance!J99,0,($A$102-1)*12)","v":"-"},{"$f":"OFFSET(Balance!K99,0,($A$102-1)*12)","v":"-"},{"$f":"OFFSET(Balance!L99,0,($A$102-1)*12)","v":"-"},{"$f":"OFFSET(Balance!M99,0,($A$102-1)*12)","v":"-"},{"$f":"OFFSET(Balance!N99,0,($A$102-1)*12)","v":"-"},45272.821966000003]
[null,"(1) Asignación de unidades de producción según combustible principal."]
[null,"(2) Incluye funcionamiento en ciclo abierto."]
[]
[null,"(3) Incluye todas aquellas unidades menores de 50 MW que no pertenecen a ninguna unidad de gestión hidráulica (UGH)."]
[null,"(4) Valor positivo: saldo importador; valor negativo: saldo exportador."]
[null,"(5) Incluye residuos."]
[null,"Datos definitivos hasta el 31/12/2015. Datos provisionales del 01/01/2016 al 31/01/2017. Datos programados del 01/02/2017 al 28/02/2017."]
[]
[]
[]
[]
[]
[]
[]
[]
[]
[]
[]
[]
[]
[]
[]
[]
[]
[]
[]
[]
[]
[]
[]
[]
[]
[]
[]
[]
[]
[]
[]
[]
[]
[]
[]
[]
[]
[]
[]
[]
[]
[]
[]
[]
[]
[]
[]
[]
[]
[]
[]
[]
[]
[]
[]
[]
[]
[]
[]
[]
[]
[]
[]
[2]
[2]
[11]

{"sheet":"Balance nacional anual","index":2,"n_rows":38,"n_cols":9,"rows_kept":38,"cut":false,"hidden":false,"merged":[[35,1,35,11],[33,1,33,11],[34,1,34,14],[29,1,29,11],[30,1,30,11],[31,1,31,11],[32,1,32,11]]}
[null,null,null,null,null,null,null,null,2]
[]
[]
[null,null,null,null,null,null,null,"Sistema eléctrico"]
[null,null,null,null,null,null,null,"Horizonte temporal"]
[null,null,null,null,null,null,null,"Periodo"]
[]
[null,null,{"$f":"OFFSET(Balance!C179,0,($I$1-1)*7)","v":2014},{"$f":"OFFSET(Balance!D179,0,($I$1-1)*7)","v":2015},{"$f":"OFFSET(Balance!E179,0,($I$1-1)*7)","v":2016},{"$f":"OFFSET(Balance!F179,0,($I$1-1)*7)","v":2017},{"$f":"OFFSET(Balance!G179,0,($I$1-1)*7)","v":2018},{"$f":"OFFSET(Balance!H179,0,($I$1-1)*7)","v":2019},{"$f":"OFFSET(Balance!I179,0,($I$1-1)*7)","v":2020}]
[]
[null,"Hidráulica",{"$f":"OFFSET(Balance!C180,0,($I$1-1)*7)","v":35458.874534000002},{"$f":"OFFSET(Balance!D180,0,($I$1-1)*7)","v":31221.375273000001},{"$f":"OFFSET(Balance!E180,0,($I$1-1)*7)","v":39168.757628000007},{"$f":"OFFSET(Balance!F180,0,($I$1-1)*7)","v":4501.6776710000004},{"$f":"OFFSET(Balance!G180,0,($I$1-1)*7)","v":"-"},{"$f":"OFFSET(Balance!H180,0,($I$1-1)*7)","v":"-"},{"$f":"OFFSET(Balance!I180,0,($I$1-1)*7)","v":"-"}]
[null,"Nuclear",{"$f":"OFFSET(Balance!C181,0,($I$1-1)*7)","v":54870.239000000009},{"$f":"OFFSET(Balance!D181,0,($I$1-1)*7)","v":54754.839048000002},{"$f":"OFFSET(Balance!E181,0,($I$1-1)*7)","v":56098.972000000002},{"$f":"OFFSET(Balance!F181,0,($I$1-1)*7)","v":10040.949000000001},{"$f":"OFFSET(Balance!G181,0,($I$1-1)*7)","v":"-"},{"$f":"OFFSET(Balance!H181,0,($I$1-1)*7)","v":"-"},{"$f":"OFFSET(Balance!I181,0,($I$1-1)*7)","v":"-"}]
[null,"Carbón",{"$f":"OFFSET(Balance!C182,0,($I$1-1)*7)","v":43320.302804000006},{"$f":"OFFSET(Balance!D182,0,($I$1-1)*7)","v":52789.040663999993},{"$f":"OFFSET(Balance!E182,0,($I$1-1)*7)","v":37474.055302000001},{"$f":"OFFSET(Balance!F182,0,($I$1-1)*7)","v":8922.7123190000002},{"$f":"OFFSET(Balance!G182,0,($I$1-1)*7)","v":"-"},{"$f":"OFFSET(Balance!H182,0,($I$1-1)*7)","v":"-"},{"$f":"OFFSET(Balance!I182,0,($I$1-1)*7)","v":"-"}]
[null,"Fuel + Gas",{"$f":"OFFSET(Balance!C183,0,($I$1-1)*7)","v":6256.7275920000002},{"$f":"OFFSET(Balance!D183,0,($I$1-1)*7)","v":6496.6519769999995},{"$f":"OFFSET(Balance!E183,0,($I$1-1)*7)","v":6764.5494599999993},{"$f":"OFFSET(Balance!F183,0,($I$1-1)*7)","v":1065.782138},{"$f":"OFFSET(Balance!G183,0,($I$1-1)*7)","v":"-"},{"$f":"OFFSET(Balance!H183,0,($I$1-1)*7)","v":"-"},{"$f":"OFFSET(Balance!I183,0,($I$1-1)*7)","v":"-"}]
[null,"Ciclo combinado (2)",{"$f":"OFFSET(Balance!C184,0,($I$1-1)*7)","v":25075.127551000001},{"$f":"OFFSET(Balance!D184,0,($I$1-1)*7)","v":29290.74944},{"$f":"OFFSET(Balance!E184,0,($I$1-1)*7)","v":29258.612664999997},{"$f":"OFFSET(Balance!F184,0,($I$1-1)*7)","v":4938.0791339999996},{"$f":"OFFSET(Balance!G184,0,($I$1-1)*7)","v":"-"},{"$f":"OFFSET(Balance!H184,0,($I$1-1)*7)","v":"-"},{"$f":"OFFSET(Balance!I184,0,($I$1-1)*7)","v":"-"}]
[null,"Régimen ordinario",{"$f":"OFFSET(Balance!C185,0,($I$1-1)*7)","v":"-"},{"$f":"OFFSET(Balance!D185,0,($I$1-1)*7)","v":"-"},{"$f":"OFFSET(Balance!E185,0,($I$1-1)*7)","v":"-"},{"$f":"OFFSET(Balance!F185,0,($I$1-1)*7)","v":"-"},{"$f":"OFFSET(Balance!G185,0,($I$1-1)*7)","v":"-"},{"$f":"OFFSET(Balance!H185,0,($I$1-1)*7)","v":"-"},{"$f":"OFFSET(Balance!I185,0,($I$1-1)*7)","v":"-"}]
[]
[null,"Hidroeólica",{"$f":"OFFSET(Balance!C186,0,($I$1-1)*7)","v":1.071861},{"$f":"OFFSET(Balance!D186,0,($I$1-1)*7)","v":8.5571660000000005},{"$f":"OFFSET(Balance!E186,0,($I$1-1)*7)","v":18.102738999999996},{"$f":"OFFSET(Balance!F186,0,($I$1-1)*7)","v":2.4893929999999997},{"$f":"OFFSET(Balance!G186,0,($I$1-1)*7)","v":"-"},{"$f":"OFFSET(Balance!H186,0,($I$1-1)*7)","v":"-"},{"$f":"OFFSET(Balance!I186,0,($I$1-1)*7)","v":"-"}]
[null,"Resto hidráulica (3)",{"$f":"OFFSET(Balance!C187,0,($I$1-1)*7)","v":7072.9990210000005},{"$f":"OFFSET(Balance!D187,0,($I$1-1)*7)","v":"-"},{"$f":"OFFSET(Balance!E187,0,($I$1-1)*7)","v":"-"},{"$f":"OFFSET(Balance!F187,0,($I$1-1)*7)","v":"-"},{"$f":"OFFSET(Balance!G187,0,($I$1-1)*7)","v":"-"},{"$f":"OFFSET(Balance!H187,0,($I$1-1)*7)","v":"-"},{"$f":"OFFSET(Balance!I187,0,($I$1-1)*7)","v":"-"}]
[null,"Eólica",{"$f":"OFFSET(Balance!C188,0,($I$1-1)*7)","v":51030.692999999999},{"$f":"OFFSET(Balance!D188,0,($I$1-1)*7)","v":48115.128071999992},{"$f":"OFFSET(Balance!E188,0,($I$1-1)*7)","v":47690.318000000007},{"$f":"OFFSET(Balance!F188,0,($I$1-1)*7)","v":9712.0283089999994},{"$f":"OFFSET(Balance!G188,0,($I$1-1)*7)","v":"-"},{"$f":"OFFSET(Balance!H188,0,($I$1-1)*7)","v":"-"},{"$f":"OFFSET(Balance!I188,0,($I$1-1)*7)","v":"-"}]
[null,"Solar fotovoltaica",{"$f":"OFFSET(Balance!C189,0,($I$1-1)*7)","v":8207.5729999999985},{"$f":"OFFSET(Balance!D189,0,($I$1-1)*7)","v":8243.0756409999995},{"$f":"OFFSET(Balance!E189,0,($I$1-1)*7)","v":7951.8160000000007},{"$f":"OFFSET(Balance!F189,0,($I$1-1)*7)","v":947.19850699999995},{"$f":"OFFSET(Balance!G189,0,($I$1-1)*7)","v":"-"},{"$f":"OFFSET(Balance!H189,0,($I$1-1)*7)","v":"-"},{"$f":"OFFSET(Balance!I189,0,($I$1-1)*7)","v":"-"}]
[null,"Solar térmica",{"$f":"OFFSET(Balance!C190,0,($I$1-1)*7)","v":4958.9149999999991},{"$f":"OFFSET(Balance!D190,0,($I$1-1)*7)","v":5085.2350000000006},{"$f":"OFFSET(Balance!E190,0,($I$1-1)*7)","v":5071.6869999999999},{"$f":"OFFSET(Balance!F190,0,($I$1-1)*7)","v":271.72089999999997},{"$f":"OFFSET(Balance!G190,0,($I$1-1)*7)","v":"-"},{"$f":"OFFSET(Balance!H190,0,($I$1-1)*7)","v":"-"},{"$f":"OFFSET(Balance!I190,0,($I$1-1)*7)","v":"-"}]
[null,"Térmica renovable(6)/Otras renovables",{"$f":"OFFSET(Balance!C191,0,($I$1-1)*7)","v":4728.7287219999998},{"$f":"OFFSET(Balance!D191,0,($I$1-1)*7)","v":3183.9767660000002},{"$f":"OFFSET(Balance!E191,0,($I$1-1)*7)","v":3427.1639199999995},{"$f":"OFFSET(Balance!F191,0,($I$1-1)*7)","v":626.56258000000003},{"$f":"OFFSET(Balance!G191,0,($I$1-1)*7)","v":"-"},{"$f":"OFFSET(Balance!H191,0,($I$1-1)*7)","v":"-"},{"$f":"OFFSET(Balance!I191,0,($I$1-1)*7)","v":"-"}]
[null,"Cogeneración y resto(6)/Cogeneración",{"$f":"OFFSET(Balance!C192,0,($I$1-1)*7)","v":25885.824000000001},{"$f":"OFFSET(Balance!D192,0,($I$1-1)*7)","v":25449.494319999998},{"$f":"OFFSET(Balance!E192,0,($I$1-1)*7)","v":25789.994640000001},{"$f":"OFFSET(Balance!F192,0,($I$1-1)*7)","v":4576.5620900000004},{"$f":"OFFSET(Balance!G192,0,($I$1-1)*7)","v":"-"},{"$f":"OFFSET(Balance!H192,0,($I$1-1)*7)","v":"-"},{"$f":"OFFSET(Balance!I192,0,($I$1-1)*7)","v":"-"}]
[null,"Residuos",{"$f":"OFFSET(Balance!C193,0,($I$1-1)*7)","v":"-"},{"$f":"OFFSET(Balance!D193,0,($I$1-1)*7)","v":3298.1579999999994},{"$f":"OFFSET(Balance!E193,0,($I$1-1)*7)","v":3390.2709999999997},{"$f":"OFFSET(Balance!F193,0,($I$1-1)*7)","v":562.03520700000001},{"$f":"OFFSET(Balance!G193,0,($I$1-1)*7)","v":"-"},{"$f":"OFFSET(Balance!H193,0,($I$1-1)*7)","v":"-"},{"$f":"OFFSET(Balance!I193,0,($I$1-1)*7)","v":"-"}]
[null,"Régimen especial",{"$f":"OFFSET(Balance!C194,0,($I$1-1)*7)","v":"-"},{"$f":"OFFSET(Balance!D194,0,($I$1-1)*7)","v":"-"},{"$f":"OFFSET(Balance!E194,0,($I$1-1)*7)","v":"-"},{"$f":"OFFSET(Balance!F194,0,($I$1-1)*7)","v":"-"},{"$f":"OFFSET(Balance!G194,0,($I$1-1)*7)","v":"-"},{"$f":"OFFSET(Balance!H194,0,($I$1-1)*7)","v":"-"},{"$f":"OFFSET(Balance!I194,0,($I$1-1)*7)","v":"-"}]
[null,"Generación",{"$f":"OFFSET(Balance!C195,0,($I$1-1)*7)","v":266867.07608500007},{"$f":"OFFSET(Balance!D195,0,($I$1-1)*7)","v":267936.28136700002},{"$f":"OFFSET(Balance!E195,0,($I$1-1)*7)","v":262104.30035399998},{"$f":"OFFSET(Balance!F195,0,($I$1-1)*7)","v":46167.797248000003},{"$f":"OFFSET(Balance!G195,0,($I$1-1)*7)","v":"-"},{"$f":"OFFSET(Balance!H195,0,($I$1-1)*7)","v":"-"},{"$f":"OFFSET(Balance!I195,0,($I$1-1)*7)","v":"-"}]
[null,"Consumos en bombeo",{"$f":"OFFSET(Balance!C196,0,($I$1-1)*7)","v":-5329.5900510000001},{"$f":"OFFSET(Balance!D196,0,($I$1-1)*7)","v":-4520.0941789999997},{"$f":"OFFSET(Balance!E196,0,($I$1-1)*7)","v":-4819.4130750000004},{"$f":"OFFSET(Balance!F196,0,($I$1-1)*7)","v":-891.91648399999997},{"$f":"OFFSET(Balance!G196,0,($I$1-1)*7)","v":"-"},{"$f":"OFFSET(Balance!H196,0,($I$1-1)*7)","v":"-"},{"$f":"OFFSET(Balance!I196,0,($I$1-1)*7)","v":"-"}]
[null,"Saldo intercambios internacionales (4)",{"$f":"OFFSET(Balance!C197,0,($I$1-1)*7)","v":-3406.1249290000001},{"$f":"OFFSET(Balance!D197,0,($I$1-1)*7)","v":-133.16322499999978},{"$f":"OFFSET(Balance!E197,0,($I$1-1)*7)","v":7667.2376129999993},{"$f":"OFFSET(Balance!F197,0,($I$1-1)*7)","v":-3.0586979999999357},{"$f":"OFFSET(Balance!G197,0,($I$1-1)*7)","v":"-"},{"$f":"OFFSET(Balance!H197,0,($I$1-1)*7)","v":"-"},{"$f":"OFFSET(Balance!I197,0,($I$1-1)*7)","v":"-"}]
[null,"Demanda transporte (b.c.)",{"$f":"OFFSET(Balance!C198,0,($I$1-1)*7)","v":258131.36110500005},{"$f":"OFFSET(Balance!D198,0,($I$1-1)*7)","v":263283.02396299999},{"$f":"OFFSET(Balance!E198,0,($I$1-1)*7)","v":264952.12489199999},{"$f":"OFFSET(Balance!F198,0,($I$1-1)*7)","v":45272.822066000001},{"$f":"OFFSET(Balance!G198,0,($I$1-1)*7)","v":"-"},{"$f":"OFFSET(Balance!H198,0,($I$1-1)*7)","v":"-"},{"$f":"OFFSET(Balance!I198,0,($I$1-1)*7)","v":"-"}]
[null,"(1) Asignación de unidades de producción según combustible principal."]
[null,"(2) Incluye funcionamiento en ciclo abierto."]
[]
[null,"(3) Incluye todas aquellas unidades menores de 50 MW que no pertenecen a ninguna unidad de gestión hidráulica (UGH)."]
[null,"(4) Valor positivo: saldo importador; valor negativo: saldo exportador."]
[null,"(5) Incluye residuos."]
[null,"(6) Hasta 2014 e incluye residuos."]
[null,{"$f":"IF(MONTH(FACT)=1,\"\",CONCATENATE(\"Para el año \",YEAR(FACT), \" valores acumulados hasta \",TEXT(FACT-30,\"mmmm\"),\" de \",YEAR(FACT),\".\"))","v":"Para el año 2017 valores acumulados hasta febrero de 2017."}]
[null,{"$f":"'Balance nacional mensual'!B36","v":"Datos definitivos hasta el 31/12/2015. Datos provisionales del 01/01/2016 al 31/01/2017. Datos programados del 01/02/2017 al 28/02/2017."}]

{"sheet":"Balance Peninsular mensual","index":3,"n_rows":37,"n_cols":15,"rows_kept":37,"cut":false,"hidden":false,"merged":[[36,1,36,11],[35,1,35,11],[34,1,34,14],[31,1,31,14],[5,2,5,9],[29,1,29,14],[30,1,30,14],[33,1,33,12],[32,1,32,11]]}
[null,null,null,null,null,null,null,null,null,null,null,null,null,null,28]
[]
[]
[null,null,null,null,null,null,null,null,null,null,null,null,"Sistema eléctrico"]
[null,null,null,null,null,null,null,null,null,null,null,null,"Horizonte temporal"]
[null,null,null,null,null,null,null,null,null,null,null,null,"Periodo"]
[]
[null,null,"Ene.","Feb.","Mar.","Abr.","May.","Jun.","Jul.","Ago.","Sep.","Oct.","Nov.","Dic.",{"$f":"OFFSET(Año!C2,($O$1-1),0)","v":2017}]
[]
[null,"Hidráulica",{"$f":"OFFSET(Balance!C3,0,($O$1-1)*12)","v":2334.1325710000001},{"$f":"OFFSET(Balance!D3,0,($O$1-1)*12)","v":2167.2811000000002},{"$f":"OFFSET(Balance!E3,0,($O$1-1)*12)","v":"-"},{"$f":"OFFSET(Balance!F3,0,($O$1-1)*12)","v":"-"},{"$f":"OFFSET(Balance!G3,0,($O$1-1)*12)","v":"-"},{"$f":"OFFSET(Balance!H3,0,($O$1-1)*12)","v":"-"},{"$f":"OFFSET(Balance!I3,0,($O$1-1)*12)","v":"-"},{"$f":"OFFSET(Balance!J3,0,($O$1-1)*12)","v":"-"},{"$f":"OFFSET(Balance!K3,0,($O$1-1)*12)","v":"-"},{"$f":"OFFSET(Balance!L3,0,($O$1-1)*12)","v":"-"},{"$f":"OFFSET(Balance!M3,0,($O$1-1)*12)","v":"-"},{"$f":"OFFSET(Balance!N3,0,($O$1-1)*12)","v":"-"},{"$f":"IF(SUM(C10:N10)=0,\"-\",SUM(C10:N10))","v":4501.4136710000002}]
[null,"Nuclear",{"$f":"OFFSET(Balance!C4,0,($O$1-1)*12)","v":5285.3739999999998},{"$f":"OFFSET(Balance!D4,0,($O$1-1)*12)","v":4755.5749999999998},{"$f":"OFFSET(Balance!E4,0,($O$1-1)*12)","v":"-"},{"$f":"OFFSET(Balance!F4,0,($O$1-1)*12)","v":"-"},{"$f":"OFFSET(Balance!G4,0,($O$1-1)*12)","v":"-"},{"$f":"OFFSET(Balance!H4,0,($O$1-1)*12)","v":"-"},{"$f":"OFFSET(Balance!I4,0,($O$1-1)*12)","v":"-"},{"$f":"OFFSET(Balance!J4,0,($O$1-1)*12)","v":"-"},{"$f":"OFFSET(Balance!K4,0,($O$1-1)*12)","v":"-"},{"$f":"OFFSET(Balance!L4,0,($O$1-1)*12)","v":"-"},{"$f":"OFFSET(Balance!M4,0,($O$1-1)*12)","v":"-"},{"$f":"OFFSET(Balance!N4,0,($O$1-1)*12)","v":"-"},{"$f":"IF(SUM(C11:N11)=0,\"-\",SUM(C11:N11))","v":10040.949000000001}]
[null,"Carbón",{"$f":"OFFSET(Balance!C5,0,($O$1-1)*12)","v":5166.1390000000001},{"$f":"OFFSET(Balance!D5,0,($O$1-1)*12)","v":3342.29},{"$f":"OFFSET(Balance!E5,0,($O$1-1)*12)","v":"-"},{"$f":"OFFSET(Balance!F5,0,($O$1-1)*12)","v":"-"},{"$f":"OFFSET(Balance!G5,0,($O$1-1)*12)","v":"-"},{"$f":"OFFSET(Balance!H5,0,($O$1-1)*12)","v":"-"},{"$f":"OFFSET(Balance!I5,0,($O$1-1)*12)","v":"-"},{"$f":"OFFSET(Balance!J5,0,($O$1-1)*12)","v":"-"},{"$f":"OFFSET(Balance!K5,0,($O$1-1)*12)","v":"-"},{"$f":"OFFSET(Balance!L5,0,($O$1-1)*12)","v":"-"},{"$f":"OFFSET(Balance!M5,0,($O$1-1)*12)","v":"-"},{"$f":"OFFSET(Balance!N5,0,($O$1-1)*12)","v":"-"},8508.4290000000001]
[null,"Fuel + Gas",{"$f":"OFFSET(Balance!C6,0,($O$1-1)*12)","v":0},{"$f":"OFFSET(Balance!D6,0,($O$1-1)*12)","v":0},{"$f":"OFFSET(Balance!E6,0,($O$1-1)*12)","v":"-"},{"$f":"OFFSET(Balance!F6,0,($O$1-1)*12)","v":"-"},{"$f":"OFFSET(Balance!G6,0,($O$1-1)*12)","v":"-"},{"$f":"OFFSET(Balance!H6,0,($O$1-1)*12)","v":"-"},{"$f":"OFFSET(Balance!I6,0,($O$1-1)*12)","v":"-"},{"$f":"OFFSET(Balance!J6,0,($O$1-1)*12)","v":"-"},{"$f":"OFFSET(Balance!K6,0,($O$1-1)*12)","v":"-"},{"$f":"OFFSET(Balance!L6,0,($O$1-1)*12)","v":"-"},{"$f":"OFFSET(Balance!M6,0,($O$1-1)*12)","v":"-"},{"$f":"OFFSET(Balance!N6,0,($O$1-1)*12)","v":"-"},"-"]
[null,"Ciclo combinado (2)",{"$f":"OFFSET(Balance!C7,0,($O$1-1)*12)","v":2834.400369},{"$f":"OFFSET(Balance!D7,0,($O$1-1)*12)","v":1511.4273999999998},{"$f":"OFFSET(Balance!E7,0,($O$1-1)*12)","v":"-"},{"$f":"OFFSET(Balance!F7,0,($O$1-1)*12)","v":"-"},{"$f":"OFFSET(Balance!G7,0,($O$1-1)*12)","v":"-"},{"$f":"OFFSET(Balance!H7,0,($O$1-1)*12)","v":"-"},{"$f":"OFFSET(Balance!I7,0,($O$1-1)*12)","v":"-"},{"$f":"OFFSET(Balance!J7,0,($O$1-1)*12)","v":"-"},{"$f":"OFFSET(Balance!K7,0,($O$1-1)*12)","v":"-"},{"$f":"OFFSET(Balance!L7,0,($O$1-1)*12)","v":"-"},{"$f":"OFFSET(Balance!M7,0,($O$1-1)*12)","v":"-"},{"$f":"OFFSET(Balance!N7,0,($O$1-1)*12)","v":"-"},4345.8277689999995]
[null,"Régimen ordinario",{"$f":"OFFSET(Balance!C8,0,($O$1-1)*12)","v":"-"},{"$f":"OFFSET(Balance!D8,0,($O$1-1)*12)","v":"-"},{"$f":"OFFSET(Balance!E8,0,($O$1-1)*12)","v":"-"},{"$f":"OFFSET(Balance!F8,0,($O$1-1)*12)","v":"-"},{"$f":"OFFSET(Balance!G8,0,($O$1-1)*12)","v":"-"},{"$f":"OFFSET(Balance!H8,0,($O$1-1)*12)","v":"-"},{"$f":"OFFSET(Balance!I8,0,($O$1-1)*12)","v":"-"},{"$f":"OFFSET(Balance!J8,0,($O$1-1)*12)","v":"-"},{"$f":"OFFSET(Balance!K8,0,($O$1-1)*12)","v":"-"},{"$f":"OFFSET(Balance!L8,0,($O$1-1)*12)","v":"-"},{"$f":"OFFSET(Balance!M8,0,($O$1-1)*12)","v":"-"},{"$f":"OFFSET(Balance!N8,0,($O$1-1)*12)","v":"-"},{"$f":"SUM(O10:O14)","v":27396.619439999999}]
[]
[null,"Resto hidráulica (3)",{"$f":"OFFSET(Balance!C9,0,($O$1-1)*12)","v":"-"},{"$f":"OFFSET(Balance!D9,0,($O$1-1)*12)","v":"-"},{"$f":"OFFSET(Balance!E9,0,($O$1-1)*12)","v":"-"},{"$f":"OFFSET(Balance!F9,0,($O$1-1)*12)","v":"-"},{"$f":"OFFSET(Balance!G9,0,($O$1-1)*12)","v":"-"},{"$f":"OFFSET(Balance!H9,0,($O$1-1)*12)","v":"-"},{"$f":"OFFSET(Balance!I9,0,($O$1-1)*12)","v":"-"},{"$f":"OFFSET(Balance!J9,0,($O$1-1)*12)","v":"-"},{"$f":"OFFSET(Balance!K9,0,($O$1-1)*12)","v":"-"},{"$f":"OFFSET(Balance!L9,0,($O$1-1)*12)","v":"-"},{"$f":"OFFSET(Balance!M9,0,($O$1-1)*12)","v":"-"},{"$f":"OFFSET(Balance!N9,0,($O$1-1)*12)","v":"-"},"-"]
[null,"Eólica",{"$f":"OFFSET(Balance!C10,0,($O$1-1)*12)","v":4812.8180000000002},{"$f":"OFFSET(Balance!D10,0,($O$1-1)*12)","v":4858.9031299999997},{"$f":"OFFSET(Balance!E10,0,($O$1-1)*12)","v":"-"},{"$f":"OFFSET(Balance!F10,0,($O$1-1)*12)","v":"-"},{"$f":"OFFSET(Balance!G10,0,($O$1-1)*12)","v":"-"},{"$f":"OFFSET(Balance!H10,0,($O$1-1)*12)","v":"-"},{"$f":"OFFSET(Balance!I10,0,($O$1-1)*12)","v":"-"},{"$f":"OFFSET(Balance!J10,0,($O$1-1)*12)","v":"-"},{"$f":"OFFSET(Balance!K10,0,($O$1-1)*12)","v":"-"},{"$f":"OFFSET(Balance!L10,0,($O$1-1)*12)","v":"-"},{"$f":"OFFSET(Balance!M10,0,($O$1-1)*12)","v":"-"},{"$f":"OFFSET(Balance!N10,0,($O$1-1)*12)","v":"-"},9671.7211299999999]
[null,"Solar fotovoltaica",{"$f":"OFFSET(Balance!C11,0,($O$1-1)*12)","v":447.18799999999999},{"$f":"OFFSET(Balance!D11,0,($O$1-1)*12)","v":450.58679999999998},{"$f":"OFFSET(Balance!E11,0,($O$1-1)*12)","v":"-"},{"$f":"OFFSET(Balance!F11,0,($O$1-1)*12)","v":"-"},{"$f":"OFFSET(Balance!G11,0,($O$1-1)*12)","v":"-"},{"$f":"OFFSET(Balance!H11,0,($O$1-1)*12)","v":"-"},{"$f":"OFFSET(Balance!I11,0,($O$1-1)*12)","v":"-"},{"$f":"OFFSET(Balance!J11,0,($O$1-1)*12)","v":"-"},{"$f":"OFFSET(Balance!K11,0,($O$1-1)*12)","v":"-"},{"$f":"OFFSET(Balance!L11,0,($O$1-1)*12)","v":"-"},{"$f":"OFFSET(Balance!M11,0,($O$1-1)*12)","v":"-"},{"$f":"OFFSET(Balance!N11,0,($O$1-1)*12)","v":"-"},897.77479999999991]
[null,"Solar térmica",{"$f":"OFFSET(Balance!C12,0,($O$1-1)*12)","v":149.214},{"$f":"OFFSET(Balance!D12,0,($O$1-1)*12)","v":122.50689999999999},{"$f":"OFFSET(Balance!E12,0,($O$1-1)*12)","v":"-"},{"$f":"OFFSET(Balance!F12,0,($O$1-1)*12)","v":"-"},{"$f":"OFFSET(Balance!G12,0,($O$1-1)*12)","v":"-"},{"$f":"OFFSET(Balance!H12,0,($O$1-1)*12)","v":"-"},{"$f":"OFFSET(Balance!I12,0,($O$1-1)*12)","v":"-"},{"$f":"OFFSET(Balance!J12,0,($O$1-1)*12)","v":"-"},{"$f":"OFFSET(Balance!K12,0,($O$1-1)*12)","v":"-"},{"$f":"OFFSET(Balance!L12,0,($O$1-1)*12)","v":"-"},{"$f":"OFFSET(Balance!M12,0,($O$1-1)*12)","v":"-"},{"$f":"OFFSET(Balance!N12,0,($O$1-1)*12)","v":"-"},271.72089999999997]
[null,"Otras renovables (4)",{"$f":"OFFSET(Balance!C13,0,($O$1-1)*12)","v":326.20299999999997},{"$f":"OFFSET(Balance!D13,0,($O$1-1)*12)","v":299.2371},{"$f":"OFFSET(Balance!E13,0,($O$1-1)*12)","v":"-"},{"$f":"OFFSET(Balance!F13,0,($O$1-1)*12)","v":"-"},{"$f":"OFFSET(Balance!G13,0,($O$1-1)*12)","v":"-"},{"$f":"OFFSET(Balance!H13,0,($O$1-1)*12)","v":"-"},{"$f":"OFFSET(Balance!I13,0,($O$1-1)*12)","v":"-"},{"$f":"OFFSET(Balance!J13,0,($O$1-1)*12)","v":"-"},{"$f":"OFFSET(Balance!K13,0,($O$1-1)*12)","v":"-"},{"$f":"OFFSET(Balance!L13,0,($O$1-1)*12)","v":"-"},{"$f":"OFFSET(Balance!M13,0,($O$1-1)*12)","v":"-"},{"$f":"OFFSET(Balance!N13,0,($O$1-1)*12)","v":"-"},625.44010000000003]
[null,"Cogeneración",{"$f":"OFFSET(Balance!C14,0,($O$1-1)*12)","v":2446.0889999999999},{"$f":"OFFSET(Balance!D14,0,($O$1-1)*12)","v":2124.4309700000003},{"$f":"OFFSET(Balance!E14,0,($O$1-1)*12)","v":"-"},{"$f":"OFFSET(Balance!F14,0,($O$1-1)*12)","v":"-"},{"$f":"OFFSET(Balance!G14,0,($O$1-1)*12)","v":"-"},{"$f":"OFFSET(Balance!H14,0,($O$1-1)*12)","v":"-"},{"$f":"OFFSET(Balance!I14,0,($O$1-1)*12)","v":"-"},{"$f":"OFFSET(Balance!J14,0,($O$1-1)*12)","v":"-"},{"$f":"OFFSET(Balance!K14,0,($O$1-1)*12)","v":"-"},{"$f":"OFFSET(Balance!L14,0,($O$1-1)*12)","v":"-"},{"$f":"OFFSET(Balance!M14,0,($O$1-1)*12)","v":"-"},{"$f":"OFFSET(Balance!N14,0,($O$1-1)*12)","v":"-"},4570.5199700000003]
[null,"Residuos",{"$f":"OFFSET(Balance!C15,0,($O$1-1)*12)","v":281.59300000000002},{"$f":"OFFSET(Balance!D15,0,($O$1-1)*12)","v":248.97020000000001},{"$f":"OFFSET(Balance!E15,0,($O$1-1)*12)","v":"-"},{"$f":"OFFSET(Balance!F15,0,($O$1-1)*12)","v":"-"},{"$f":"OFFSET(Balance!G15,0,($O$1-1)*12)","v":"-"},{"$f":"OFFSET(Balance!H15,0,($O$1-1)*12)","v":"-"},{"$f":"OFFSET(Balance!I15,0,($O$1-1)*12)","v":"-"},{"$f":"OFFSET(Balance!J15,0,($O$1-1)*12)","v":"-"},{"$f":"OFFSET(Balance!K15,0,($O$1-1)*12)","v":"-"},{"$f":"OFFSET(Balance!L15,0,($O$1-1)*12)","v":"-"},{"$f":"OFFSET(Balance!M15,0,($O$1-1)*12)","v":"-"},{"$f":"OFFSET(Balance!N15,0,($O$1-1)*12)","v":"-"},530.56320000000005]
[null,"Régimen especial",{"$f":"OFFSET(Balance!C16,0,($O$1-1)*12)","v":"-"},{"$f":"OFFSET(Balance!D16,0,($O$1-1)*12)","v":"-"},{"$f":"OFFSET(Balance!E16,0,($O$1-1)*12)","v":"-"},{"$f":"OFFSET(Balance!F16,0,($O$1-1)*12)","v":"-"},{"$f":"OFFSET(Balance!G16,0,($O$1-1)*12)","v":"-"},{"$f":"OFFSET(Balance!H16,0,($O$1-1)*12)","v":"-"},{"$f":"OFFSET(Balance!I16,0,($O$1-1)*12)","v":"-"},{"$f":"OFFSET(Balance!J16,0,($O$1-1)*12)","v":"-"},{"$f":"OFFSET(Balance!K16,0,($O$1-1)*12)","v":"-"},{"$f":"OFFSET(Balance!L16,0,($O$1-1)*12)","v":"-"},{"$f":"OFFSET(Balance!M16,0,($O$1-1)*12)","v":"-"},{"$f":"OFFSET(Balance!N16,0,($O$1-1)*12)","v":"-"},{"$f":"SUM(O17:O22)","v":16037.176899999999}]
[null,"Generación",{"$f":"OFFSET(Balance!C17,0,($O$1-1)*12)","v":24083.15094},{"$f":"OFFSET(Balance!D17,0,($O$1-1)*12)","v":19881.208600000002},{"$f":"OFFSET(Balance!E17,0,($O$1-1)*12)","v":"-"},{"$f":"OFFSET(Balance!F17,0,($O$1-1)*12)","v":"-"},{"$f":"OFFSET(Balance!G17,0,($O$1-1)*12)","v":"-"},{"$f":"OFFSET(Balance!H17,0,($O$1-1)*12)","v":"-"},{"$f":"OFFSET(Balance!I17,0,($O$1-1)*12)","v":"-"},{"$f":"OFFSET(Balance!J17,0,($O$1-1)*12)","v":"-"},{"$f":"OFFSET(Balance!K17,0,($O$1-1)*12)","v":"-"},{"$f":"OFFSET(Balance!L17,0,($O$1-1)*12)","v":"-"},{"$f":"OFFSET(Balance!M17,0,($O$1-1)*12)","v":"-"},{"$f":"OFFSET(Balance!N17,0,($O$1-1)*12)","v":"-"},{"$f":"IF(SUM(C25:N25)=0,\"-\",SUM(C25:N25))","v":43964.359540000005}]
[null,"Consumos en bombeo",{"$f":"OFFSET(Balance!C18,0,($O$1-1)*12)","v":-433.831684},{"$f":"OFFSET(Balance!D18,0,($O$1-1)*12)","v":-458.08479999999997},{"$f":"OFFSET(Balance!E18,0,($O$1-1)*12)","v":"-"},{"$f":"OFFSET(Balance!F18,0,($O$1-1)*12)","v":"-"},{"$f":"OFFSET(Balance!G18,0,($O$1-1)*12)","v":"-"},{"$f":"OFFSET(Balance!H18,0,($O$1-1)*12)","v":"-"},{"$f":"OFFSET(Balance!I18,0,($O$1-1)*12)","v":"-"},{"$f":"OFFSET(Balance!J18,0,($O$1-1)*12)","v":"-"},{"$f":"OFFSET(Balance!K18,0,($O$1-1)*12)","v":"-"},{"$f":"OFFSET(Balance!L18,0,($O$1-1)*12)","v":"-"},{"$f":"OFFSET(Balance!M18,0,($O$1-1)*12)","v":"-"},{"$f":"OFFSET(Balance!N18,0,($O$1-1)*12)","v":"-"},-891.91648399999997]
[null,"Enlace Península-Baleares (6)",{"$f":"OFFSET(Balance!C19,0,($O$1-1)*12)","v":-96.651403000000002},{"$f":"OFFSET(Balance!D19,0,($O$1-1)*12)","v":-64.557599999999994},{"$f":"OFFSET(Balance!E19,0,($O$1-1)*12)","v":"-"},{"$f":"OFFSET(Balance!F19,0,($O$1-1)*12)","v":"-"},{"$f":"OFFSET(Balance!G19,0,($O$1-1)*12)","v":"-"},{"$f":"OFFSET(Balance!H19,0,($O$1-1)*12)","v":"-"},{"$f":"OFFSET(Balance!I19,0,($O$1-1)*12)","v":"-"},{"$f":"OFFSET(Balance!J19,0,($O$1-1)*12)","v":"-"},{"$f":"OFFSET(Balance!K19,0,($O$1-1)*12)","v":"-"},{"$f":"OFFSET(Balance!L19,0,($O$1-1)*12)","v":"-"},{"$f":"OFFSET(Balance!M19,0,($O$1-1)*12)","v":"-"},{"$f":"OFFSET(Balance!N19,0,($O$1-1)*12)","v":"-"},{"$f":"IF(SUM(C27:N27)=0,\"-\",SUM(C27:N27))","v":-161.209003}]
[null,"Saldo intercambios internacionales (7)",{"$f":"OFFSET(Balance!C20,0,($O$1-1)*12)","v":-531.54929799999991},{"$f":"OFFSET(Balance!D20,0,($O$1-1)*12)","v":528.49059999999997},{"$f":"OFFSET(Balance!E20,0,($O$1-1)*12)","v":"-"},{"$f":"OFFSET(Balance!F20,0,($O$1-1)*12)","v":"-"},{"$f":"OFFSET(Balance!G20,0,($O$1-1)*12)","v":"-"},{"$f":"OFFSET(Balance!H20,0,($O$1-1)*12)","v":"-"},{"$f":"OFFSET(Balance!I20,0,($O$1-1)*12)","v":"-"},{"$f":"OFFSET(Balance!J20,0,($O$1-1)*12)","v":"-"},{"$f":"OFFSET(Balance!K20,0,($O$1-1)*12)","v":"-"},{"$f":"OFFSET(Balance!L20,0,($O$1-1)*12)","v":"-"},{"$f":"OFFSET(Balance!M20,0,($O$1-1)*12)","v":"-"},{"$f":"OFFSET(Balance!N20,0,($O$1-1)*12)","v":"-"},-3.0586979999999357]
[null,"Demanda transporte (b.c.)",{"$f":"OFFSET(Balance!C21,0,($O$1-1)*12)","v":23021.118555000001},{"$f":"OFFSET(Balance!D21,0,($O$1-1)*12)","v":19887.056800000002},{"$f":"OFFSET(Balance!E21,0,($O$1-1)*12)","v":"-"},{"$f":"OFFSET(Balance!F21,0,($O$1-1)*12)","v":"-"},{"$f":"OFFSET(Balance!G21,0,($O$1-1)*12)","v":"-"},{"$f":"OFFSET(Balance!H21,0,($O$1-1)*12)","v":"-"},{"$f":"OFFSET(Balance!I21,0,($O$1-1)*12)","v":"-"},{"$f":"OFFSET(Balance!J21,0,($O$1-1)*12)","v":"-"},{"$f":"OFFSET(Balance!K21,0,($O$1-1)*12)","v":"-"},{"$f":"OFFSET(Balance!L21,0,($O$1-1)*12)","v":"-"},{"$f":"OFFSET(Balance!M21,0,($O$1-1)*12)","v":"-"},{"$f":"OFFSET(Balance!N21,0,($O$1-1)*12)","v":"-"},42908.175354999999]
[null,"(1) Asignación de unidades de producción según combustible principal."]
[null,"(2) Incluye funcionamiento en ciclo abierto."]
[null,"(3) Incluye todas aquellas unidades menores de 50 MW que no pertenecen a ninguna unidad de gestión hidráulica (UGH)."]
[null,"(4) Otras renovables incluyen biogás, biomasa, hidráulica marina y geotérmica. Los valores incluyen residuos hasta el 31/12/2014."]
[null,"(5) Incluye residuos."]
[null,"(6) Valor positivo: entrada de energía en el sistema; valor negativo: salida de energía del sistema. Enlace funcionando al mínimo técnico de seguridad hasta el 13/08/2012. "]
[null,"(7) Valor positivo: saldo importador; valor negativo: saldo exportador."]
[null,{"$f":"'Balance nacional mensual'!B36","v":"Datos definitivos hasta el 31/12/2015. Datos provisionales del 01/01/2016 al 31/01/2017. Datos programados del 01/02/2017 al 28/02/2017."}]

{"sheet":"Balance Peninsular anual","index":4,"n_rows":38,"n_cols":12,"rows_kept":38,"cut":false,"hidden":false,"merged":[[35,1,35,9],[33,1,33,9],[29,1,29,9],[30,1,30,9],[31,1,31,9],[32,1,32,9],[34,1,34,9]]}
[null,null,null,null,null,null,null,null,null,4,null,1]
[]
[]
[null,null,null,null,null,null,null,"  Sistema eléctrico"]
[null,null,null,null,null,null,null,"  Horizonte temporal"]
[null,null,null,null,null,null,null,"  Periodo"]
[]
[null,null,{"$f":"OFFSET(Balance!C101,0,($J$1-1)*8)","v":2014},{"$f":"OFFSET(Balance!D101,0,($J$1-1)*8)","v":2015},{"$f":"OFFSET(Balance!E101,0,($J$1-1)*8)","v":2016},{"$f":"OFFSET(Balance!F101,0,($J$1-1)*8)","v":2017},{"$f":"OFFSET(Balance!G101,0,($J$1-1)*8)","v":2018},{"$f":"OFFSET(Balance!H101,0,($J$1-1)*8)","v":2019},{"$f":"OFFSET(Balance!I101,0,($J$1-1)*8)","v":2020},{"$f":"OFFSET(Balance!J101,0,($J$1-1)*8)","v":2021}]
[]
[null,"Hidráulica",{"$f":"OFFSET(Balance!C102,0,($J$1-1)*8)","v":35458.874534000002},{"$f":"OFFSET(Balance!D102,0,($J$1-1)*8)","v":31217.790073},{"$f":"OFFSET(Balance!E102,0,($J$1-1)*8)","v":39165.285628000005},{"$f":"OFFSET(Balance!F102,0,($J$1-1)*8)","v":4501.4136710000002},{"$f":"OFFSET(Balance!G102,0,($J$1-1)*8)","v":"-"},{"$f":"OFFSET(Balance!H102,0,($J$1-1)*8)","v":"-"},{"$f":"OFFSET(Balance!I102,0,($J$1-1)*8)","v":"-"},{"$f":"OFFSET(Balance!J102,0,($J$1-1)*8)","v":"-"}]
[null,"Nuclear",{"$f":"OFFSET(Balance!C103,0,($J$1-1)*8)","v":54870.239000000009},{"$f":"OFFSET(Balance!D103,0,($J$1-1)*8)","v":54754.839048000002},{"$f":"OFFSET(Balance!E103,0,($J$1-1)*8)","v":56098.972000000002},{"$f":"OFFSET(Balance!F103,0,($J$1-1)*8)","v":10040.949000000001},{"$f":"OFFSET(Balance!G103,0,($J$1-1)*8)","v":"-"},{"$f":"OFFSET(Balance!H103,0,($J$1-1)*8)","v":"-"},{"$f":"OFFSET(Balance!I103,0,($J$1-1)*8)","v":"-"},{"$f":"OFFSET(Balance!J103,0,($J$1-1)*8)","v":"-"}]
[null,"Carbón",{"$f":"OFFSET(Balance!C104,0,($J$1-1)*8)","v":41132.677000000003},{"$f":"OFFSET(Balance!D104,0,($J$1-1)*8)","v":50923.77236699999},{"$f":"OFFSET(Balance!E104,0,($J$1-1)*8)","v":35170.287000000004},{"$f":"OFFSET(Balance!F104,0,($J$1-1)*8)","v":8508.4290000000001},{"$f":"OFFSET(Balance!G104,0,($J$1-1)*8)","v":"-"},{"$f":"OFFSET(Balance!H104,0,($J$1-1)*8)","v":"-"},{"$f":"OFFSET(Balance!I104,0,($J$1-1)*8)","v":"-"},{"$f":"OFFSET(Balance!J104,0,($J$1-1)*8)","v":"-"}]
[null,"Fuel + Gas",{"$f":"OFFSET(Balance!C105,0,($J$1-1)*8)","v":0},{"$f":"OFFSET(Balance!D105,0,($J$1-1)*8)","v":0},{"$f":"OFFSET(Balance!E105,0,($J$1-1)*8)","v":0},{"$f":"OFFSET(Balance!F105,0,($J$1-1)*8)","v":0},{"$f":"OFFSET(Balance!G105,0,($J$1-1)*8)","v":"-"},{"$f":"OFFSET(Balance!H105,0,($J$1-1)*8)","v":"-"},{"$f":"OFFSET(Balance!I105,0,($J$1-1)*8)","v":"-"},{"$f":"OFFSET(Balance!J105,0,($J$1-1)*8)","v":"-"}]
[null,"Ciclo combinado (2)",{"$f":"OFFSET(Balance!C106,0,($J$1-1)*8)","v":21336.753903000001},{"$f":"OFFSET(Balance!D106,0,($J$1-1)*8)","v":25268.468001999998},{"$f":"OFFSET(Balance!E106,0,($J$1-1)*8)","v":25684.360787999998},{"$f":"OFFSET(Balance!F106,0,($J$1-1)*8)","v":4345.8277689999995},{"$f":"OFFSET(Balance!G106,0,($J$1-1)*8)","v":"-"},{"$f":"OFFSET(Balance!H106,0,($J$1-1)*8)","v":"-"},{"$f":"OFFSET(Balance!I106,0,($J$1-1)*8)","v":"-"},{"$f":"OFFSET(Balance!J106,0,($J$1-1)*8)","v":"-"}]
[null,"Régimen ordinario",{"$f":"OFFSET(Balance!C107,0,($L$1-1)*8)","v":134378.67300000001},{"$f":"OFFSET(Balance!D107,0,($L$1-1)*8)","v":138739.239},{"$f":"OFFSET(Balance!E107,0,($L$1-1)*8)","v":139159.899},{"$f":"OFFSET(Balance!F107,0,($L$1-1)*8)","v":136129.52899999998},{"$f":"OFFSET(Balance!G107,0,($L$1-1)*8)","v":137533.13499999998},{"$f":"OFFSET(Balance!H107,0,($L$1-1)*8)","v":139730.269},{"$f":"OFFSET(Balance!I107,0,($L$1-1)*8)","v":143015.33499999996},{"$f":"OFFSET(Balance!J107,0,($L$1-1)*8)","v":151034.57399999999}]
[]
[null,"Resto hidráulica (3)",{"$f":"OFFSET(Balance!C108,0,($J$1-1)*8)","v":7069.52},{"$f":"OFFSET(Balance!D108,0,($J$1-1)*8)","v":"-"},{"$f":"OFFSET(Balance!E108,0,($J$1-1)*8)","v":"-"},{"$f":"OFFSET(Balance!F108,0,($J$1-1)*8)","v":"-"},{"$f":"OFFSET(Balance!G108,0,($J$1-1)*8)","v":"-"},{"$f":"OFFSET(Balance!H108,0,($J$1-1)*8)","v":"-"},{"$f":"OFFSET(Balance!I108,0,($J$1-1)*8)","v":"-"},{"$f":"OFFSET(Balance!J108,0,($J$1-1)*8)","v":"-"}]
[null,"Eólica",{"$f":"OFFSET(Balance!C109,0,($J$1-1)*8)","v":50634.89},{"$f":"OFFSET(Balance!D109,0,($J$1-1)*8)","v":47713.149999999994},{"$f":"OFFSET(Balance!E109,0,($J$1-1)*8)","v":47290.344000000005},{"$f":"OFFSET(Balance!F109,0,($J$1-1)*8)","v":9671.7211299999999},{"$f":"OFFSET(Balance!G109,0,($J$1-1)*8)","v":"-"},{"$f":"OFFSET(Balance!H109,0,($J$1-1)*8)","v":"-"},{"$f":"OFFSET(Balance!I109,0,($J$1-1)*8)","v":"-"},{"$f":"OFFSET(Balance!J109,0,($J$1-1)*8)","v":"-"}]
[null,"Solar fotovoltaica",{"$f":"OFFSET(Balance!C110,0,($J$1-1)*8)","v":7802.4239999999991},{"$f":"OFFSET(Balance!D110,0,($J$1-1)*8)","v":7844.7979999999998},{"$f":"OFFSET(Balance!E110,0,($J$1-1)*8)","v":7554.0400000000009},{"$f":"OFFSET(Balance!F110,0,($J$1-1)*8)","v":897.77479999999991},{"$f":"OFFSET(Balance!G110,0,($J$1-1)*8)","v":"-"},{"$f":"OFFSET(Balance!H110,0,($J$1-1)*8)","v":"-"},{"$f":"OFFSET(Balance!I110,0,($J$1-1)*8)","v":"-"},{"$f":"OFFSET(Balance!J110,0,($J$1-1)*8)","v":"-"}]
[null,"Solar térmica",{"$f":"OFFSET(Balance!C111,0,($J$1-1)*8)","v":4958.9149999999991},{"$f":"OFFSET(Balance!D111,0,($J$1-1)*8)","v":5085.2350000000006},{"$f":"OFFSET(Balance!E111,0,($J$1-1)*8)","v":5071.6869999999999},{"$f":"OFFSET(Balance!F111,0,($J$1-1)*8)","v":271.72089999999997},{"$f":"OFFSET(Balance!G111,0,($J$1-1)*8)","v":"-"},{"$f":"OFFSET(Balance!H111,0,($J$1-1)*8)","v":"-"},{"$f":"OFFSET(Balance!I111,0,($J$1-1)*8)","v":"-"},{"$f":"OFFSET(Balance!J111,0,($J$1-1)*8)","v":"-"}]
[null,"Térmica renovable (4)/Otras renovables (5)",{"$f":"OFFSET(Balance!C112,0,($J$1-1)*8)","v":4717.9780000000001},{"$f":"OFFSET(Balance!D112,0,($J$1-1)*8)","v":3173.951},{"$f":"OFFSET(Balance!E112,0,($J$1-1)*8)","v":3416.5189999999993},{"$f":"OFFSET(Balance!F112,0,($J$1-1)*8)","v":625.44010000000003},{"$f":"OFFSET(Balance!G112,0,($J$1-1)*8)","v":"-"},{"$f":"OFFSET(Balance!H112,0,($J$1-1)*8)","v":"-"},{"$f":"OFFSET(Balance!I112,0,($J$1-1)*8)","v":"-"},{"$f":"OFFSET(Balance!J112,0,($J$1-1)*8)","v":"-"}]
[null,"Cogeneración y resto (4)/Cogeneración",{"$f":"OFFSET(Balance!C113,0,($J$1-1)*8)","v":25595.536},{"$f":"OFFSET(Balance!D113,0,($J$1-1)*8)","v":25417.974999999999},{"$f":"OFFSET(Balance!E113,0,($J$1-1)*8)","v":25755.341},{"$f":"OFFSET(Balance!F113,0,($J$1-1)*8)","v":4570.5199700000003},{"$f":"OFFSET(Balance!G113,0,($J$1-1)*8)","v":"-"},{"$f":"OFFSET(Balance!H113,0,($J$1-1)*8)","v":"-"},{"$f":"OFFSET(Balance!I113,0,($J$1-1)*8)","v":"-"},{"$f":"OFFSET(Balance!J113,0,($J$1-1)*8)","v":"-"}]
[null,"Residuos",{"$f":"OFFSET(Balance!C114,0,($J$1-1)*8)","v":"-"},{"$f":"OFFSET(Balance!D114,0,($J$1-1)*8)","v":2987.3709999999996},{"$f":"OFFSET(Balance!E114,0,($J$1-1)*8)","v":3118.9609999999998},{"$f":"OFFSET(Balance!F114,0,($J$1-1)*8)","v":530.56320000000005},{"$f":"OFFSET(Balance!G114,0,($J$1-1)*8)","v":"-"},{"$f":"OFFSET(Balance!H114,0,($J$1-1)*8)","v":"-"},{"$f":"OFFSET(Balance!I114,0,($J$1-1)*8)","v":"-"},{"$f":"OFFSET(Balance!J114,0,($J$1-1)*8)","v":"-"}]
[null,"Régimen especial",{"$f":"OFFSET(Balance!C115,0,($L$1-1)*8)","v":1639.6760000000002},{"$f":"OFFSET(Balance!D115,0,($L$1-1)*8)","v":3144.4839999999999},{"$f":"OFFSET(Balance!E115,0,($L$1-1)*8)","v":4030.6210000000001},{"$f":"OFFSET(Balance!F115,0,($L$1-1)*8)","v":5697.3220000000001},{"$f":"OFFSET(Balance!G115,0,($L$1-1)*8)","v":8197.8649999999998},{"$f":"OFFSET(Balance!H115,0,($L$1-1)*8)","v":9595.8149999999987},{"$f":"OFFSET(Balance!I115,0,($L$1-1)*8)","v":13655.767},{"$f":"OFFSET(Balance!J115,0,($L$1-1)*8)","v":16160.998}]
[null,"Generación",{"$f":"OFFSET(Balance!C116,0,($J$1-1)*8)","v":253577.80743699998},{"$f":"OFFSET(Balance!D116,0,($J$1-1)*8)","v":254387.34949000005},{"$f":"OFFSET(Balance!E116,0,($J$1-1)*8)","v":248325.79741600004},{"$f":"OFFSET(Balance!F116,0,($J$1-1)*8)","v":43964.359539999998},{"$f":"OFFSET(Balance!G116,0,($J$1-1)*8)","v":"-"},{"$f":"OFFSET(Balance!H116,0,($J$1-1)*8)","v":"-"},{"$f":"OFFSET(Balance!I116,0,($J$1-1)*8)","v":"-"},{"$f":"OFFSET(Balance!J116,0,($J$1-1)*8)","v":"-"}]
[null,"Consumos en bombeo",{"$f":"OFFSET(Balance!C117,0,($J$1-1)*8)","v":-5329.5900510000001},{"$f":"OFFSET(Balance!D117,0,($J$1-1)*8)","v":-4520.0941789999997},{"$f":"OFFSET(Balance!E117,0,($J$1-1)*8)","v":-4819.4130750000004},{"$f":"OFFSET(Balance!F117,0,($J$1-1)*8)","v":-891.91648399999997},{"$f":"OFFSET(Balance!G117,0,($J$1-1)*8)","v":"-"},{"$f":"OFFSET(Balance!H117,0,($J$1-1)*8)","v":"-"},{"$f":"OFFSET(Balance!I117,0,($J$1-1)*8)","v":"-"},{"$f":"OFFSET(Balance!J117,0,($J$1-1)*8)","v":"-"}]
[null,"Enlace Península-Baleares (6)",{"$f":"OFFSET(Balance!C118,0,($J$1-1)*8)","v":-1298.2644039999998},{"$f":"OFFSET(Balance!D118,0,($J$1-1)*8)","v":-1335.7828019999999},{"$f":"OFFSET(Balance!E118,0,($J$1-1)*8)","v":-1250.5825009999999},{"$f":"OFFSET(Balance!F118,0,($J$1-1)*8)","v":-161.209003},{"$f":"OFFSET(Balance!G118,0,($J$1-1)*8)","v":"-"},{"$f":"OFFSET(Balance!H118,0,($J$1-1)*8)","v":"-"},{"$f":"OFFSET(Balance!I118,0,($J$1-1)*8)","v":"-"},{"$f":"OFFSET(Balance!J118,0,($J$1-1)*8)","v":"-"}]
[null,"Saldo intercambios internacionales (7)",{"$f":"OFFSET(Balance!C119,0,($J$1-1)*8)","v":-3406.1249290000001},{"$f":"OFFSET(Balance!D119,0,($J$1-1)*8)","v":-133.16322499999978},{"$f":"OFFSET(Balance!E119,0,($J$1-1)*8)","v":7667.2376129999993},{"$f":"OFFSET(Balance!F119,0,($J$1-1)*8)","v":-3.0586979999999357},{"$f":"OFFSET(Balance!G119,0,($J$1-1)*8)","v":"-"},{"$f":"OFFSET(Balance!H119,0,($J$1-1)*8)","v":"-"},{"$f":"OFFSET(Balance!I119,0,($J$1-1)*8)","v":"-"},{"$f":"OFFSET(Balance!J119,0,($J$1-1)*8)","v":"-"}]
[null,"Demanda transporte (b.c.)",{"$f":"OFFSET(Balance!C120,0,($J$1-1)*8)","v":243543.82805299998},{"$f":"OFFSET(Balance!D120,0,($J$1-1)*8)","v":248398.30928400005},{"$f":"OFFSET(Balance!E120,0,($J$1-1)*8)","v":249923.03945300006},{"$f":"OFFSET(Balance!F120,0,($J$1-1)*8)","v":42908.175354999992},{"$f":"OFFSET(Balance!G120,0,($J$1-1)*8)","v":"-"},{"$f":"OFFSET(Balance!H120,0,($J$1-1)*8)","v":"-"},{"$f":"OFFSET(Balance!I120,0,($J$1-1)*8)","v":"-"},{"$f":"OFFSET(Balance!J120,0,($J$1-1)*8)","v":"-"}]
[null,"(1) Asignación de unidades de producción según combustible principal."]
[null,"(2) Incluye funcionamiento en ciclo abierto."]
[null,"(3) Incluye todas aquellas unidades menores de 50 MW que no pertenecen a ninguna unidad de gestión hidráulica (UGH)."]
[null,"(4) Incluye residuos hasta el 31/12/2014."]
[null,"(5) Incluye biogás, biomasa, hidráulica marina y geotérmica."]
[null,"(6) Valor positivo: entrada de energía en el sistema; valor negativo: salida de energía del sistema. Enlace funcionando al mínimo técnico de seguridad hasta el 13/08/2012. "]
[null,"(7) Valor positivo: saldo importador; valor negativo: saldo exportador."]
[null,{"$f":"IF(MONTH(FACT)=1,\"\",CONCATENATE(\"Para el año \",YEAR(FACT), \" valores acumulados hasta \",TEXT(FACT-30,\"mmmm\"),\" de \",YEAR(FACT),\".\"))","v":"Para el año 2017 valores acumulados hasta febrero de 2017."}]
[null,{"$f":"'Balance nacional mensual'!B36","v":"Datos definitivos hasta el 31/12/2015. Datos provisionales del 01/01/2016 al 31/01/2017. Datos programados del 01/02/2017 al 28/02/2017."}]

{"sheet":"Balance Baleares mensual","index":5,"n_rows":32,"n_cols":15,"rows_kept":32,"cut":false,"hidden":false,"merged":[[31,1,31,8],[30,1,30,14],[26,1,26,14],[27,1,27,14],[28,1,28,14],[29,1,29,12]]}
[null,null,null,null,null,null,null,null,null,null,null,null,null,null,12]
[]
[]
[null,null,null,null,null,null,null,null,null,null,null,null,"Sistema eléctrico"]
[null,null,null,null,null,null,null,null,null,null,null,null,"Horizonte temporal"]
[null,null,null,null,null,null,null,null,null,null,null,null,"Periodo"]
[]
[null,null,"Ene.","Feb.","Mar.","Abr.","May.","Jun.","Jul.","Ago.","Sep.","Oct.","Nov.","Dic.",{"$f":"OFFSET(Año!C18,($O$1-1),0)","v":2017}]
[]
[null,"Carbón",{"$f":"OFFSET(Balance!C24,0,($O$1-1)*12)","v":221058.21400000001},{"$f":"OFFSET(Balance!D24,0,($O$1-1)*12)","v":193225.10500000001},{"$f":"OFFSET(Balance!E24,0,($O$1-1)*12)","v":"-"},{"$f":"OFFSET(Balance!F24,0,($O$1-1)*12)","v":"-"},{"$f":"OFFSET(Balance!G24,0,($O$1-1)*12)","v":"-"},{"$f":"OFFSET(Balance!H24,0,($O$1-1)*12)","v":"-"},{"$f":"OFFSET(Balance!I24,0,($O$1-1)*12)","v":"-"},{"$f":"OFFSET(Balance!J24,0,($O$1-1)*12)","v":"-"},{"$f":"OFFSET(Balance!K24,0,($O$1-1)*12)","v":"-"},{"$f":"OFFSET(Balance!L24,0,($O$1-1)*12)","v":"-"},{"$f":"OFFSET(Balance!M24,0,($O$1-1)*12)","v":"-"},{"$f":"OFFSET(Balance!N24,0,($O$1-1)*12)","v":"-"},{"$f":"IF(SUM(C10:N10)=0,\"-\",SUM(C10:N10))","v":414283.31900000002}]
[null,"Motores diesel",{"$f":"OFFSET(Balance!C25,0,($O$1-1)*12)","v":84317.429000000004},{"$f":"OFFSET(Balance!D25,0,($O$1-1)*12)","v":72086.016000000003},{"$f":"OFFSET(Balance!E25,0,($O$1-1)*12)","v":"-"},{"$f":"OFFSET(Balance!F25,0,($O$1-1)*12)","v":"-"},{"$f":"OFFSET(Balance!G25,0,($O$1-1)*12)","v":"-"},{"$f":"OFFSET(Balance!H25,0,($O$1-1)*12)","v":"-"},{"$f":"OFFSET(Balance!I25,0,($O$1-1)*12)","v":"-"},{"$f":"OFFSET(Balance!J25,0,($O$1-1)*12)","v":"-"},{"$f":"OFFSET(Balance!K25,0,($O$1-1)*12)","v":"-"},{"$f":"OFFSET(Balance!L25,0,($O$1-1)*12)","v":"-"},{"$f":"OFFSET(Balance!M25,0,($O$1-1)*12)","v":"-"},{"$f":"OFFSET(Balance!N25,0,($O$1-1)*12)","v":"-"},156403.44500000001]
[null,"Turbina de gas",{"$f":"OFFSET(Balance!C26,0,($O$1-1)*12)","v":13253.123},{"$f":"OFFSET(Balance!D26,0,($O$1-1)*12)","v":8584.5789999999997},{"$f":"OFFSET(Balance!E26,0,($O$1-1)*12)","v":"-"},{"$f":"OFFSET(Balance!F26,0,($O$1-1)*12)","v":"-"},{"$f":"OFFSET(Balance!G26,0,($O$1-1)*12)","v":"-"},{"$f":"OFFSET(Balance!H26,0,($O$1-1)*12)","v":"-"},{"$f":"OFFSET(Balance!I26,0,($O$1-1)*12)","v":"-"},{"$f":"OFFSET(Balance!J26,0,($O$1-1)*12)","v":"-"},{"$f":"OFFSET(Balance!K26,0,($O$1-1)*12)","v":"-"},{"$f":"OFFSET(Balance!L26,0,($O$1-1)*12)","v":"-"},{"$f":"OFFSET(Balance!M26,0,($O$1-1)*12)","v":"-"},{"$f":"OFFSET(Balance!N26,0,($O$1-1)*12)","v":"-"},21837.701999999997]
[null,"Fuel + Gas",{"$f":"OFFSET(Balance!C27,0,($O$1-1)*12)","v":97570.551999999996},{"$f":"OFFSET(Balance!D27,0,($O$1-1)*12)","v":80670.595000000001},{"$f":"OFFSET(Balance!E27,0,($O$1-1)*12)","v":"-"},{"$f":"OFFSET(Balance!F27,0,($O$1-1)*12)","v":"-"},{"$f":"OFFSET(Balance!G27,0,($O$1-1)*12)","v":"-"},{"$f":"OFFSET(Balance!H27,0,($O$1-1)*12)","v":"-"},{"$f":"OFFSET(Balance!I27,0,($O$1-1)*12)","v":"-"},{"$f":"OFFSET(Balance!J27,0,($O$1-1)*12)","v":"-"},{"$f":"OFFSET(Balance!K27,0,($O$1-1)*12)","v":"-"},{"$f":"OFFSET(Balance!L27,0,($O$1-1)*12)","v":"-"},{"$f":"OFFSET(Balance!M27,0,($O$1-1)*12)","v":"-"},{"$f":"OFFSET(Balance!N27,0,($O$1-1)*12)","v":"-"},{"$f":"SUM(O11:O12)","v":178241.147}]
[null,"Ciclo combinado (2)",{"$f":"OFFSET(Balance!C28,0,($O$1-1)*12)","v":37932.815999999999},{"$f":"OFFSET(Balance!D28,0,($O$1-1)*12)","v":34291.703999999998},{"$f":"OFFSET(Balance!E28,0,($O$1-1)*12)","v":"-"},{"$f":"OFFSET(Balance!F28,0,($O$1-1)*12)","v":"-"},{"$f":"OFFSET(Balance!G28,0,($O$1-1)*12)","v":"-"},{"$f":"OFFSET(Balance!H28,0,($O$1-1)*12)","v":"-"},{"$f":"OFFSET(Balance!I28,0,($O$1-1)*12)","v":"-"},{"$f":"OFFSET(Balance!J28,0,($O$1-1)*12)","v":"-"},{"$f":"OFFSET(Balance!K28,0,($O$1-1)*12)","v":"-"},{"$f":"OFFSET(Balance!L28,0,($O$1-1)*12)","v":"-"},{"$f":"OFFSET(Balance!M28,0,($O$1-1)*12)","v":"-"},{"$f":"OFFSET(Balance!N28,0,($O$1-1)*12)","v":"-"},{"$f":"IF(SUM(C14:N14)=0,\"-\",SUM(C14:N14))","v":72224.51999999999}]
[null,"Generación auxiliar (3)",{"$f":"OFFSET(Balance!C29,0,($O$1-1)*12)","v":0},{"$f":"OFFSET(Balance!D29,0,($O$1-1)*12)","v":0},{"$f":"OFFSET(Balance!E29,0,($O$1-1)*12)","v":"-"},{"$f":"OFFSET(Balance!F29,0,($O$1-1)*12)","v":"-"},{"$f":"OFFSET(Balance!G29,0,($O$1-1)*12)","v":"-"},{"$f":"OFFSET(Balance!H29,0,($O$1-1)*12)","v":"-"},{"$f":"OFFSET(Balance!I29,0,($O$1-1)*12)","v":"-"},{"$f":"OFFSET(Balance!J29,0,($O$1-1)*12)","v":"-"},{"$f":"OFFSET(Balance!K29,0,($O$1-1)*12)","v":"-"},{"$f":"OFFSET(Balance!L29,0,($O$1-1)*12)","v":"-"},{"$f":"OFFSET(Balance!M29,0,($O$1-1)*12)","v":"-"},{"$f":"OFFSET(Balance!N29,0,($O$1-1)*12)","v":"-"},{"$f":"IF(SUM(C15:N15)=0,\"-\",SUM(C15:N15))","v":"-"}]
[null,"Régimen ordinario",{"$f":"OFFSET(Balance!C30,0,($O$1-1)*12)","v":"-"},{"$f":"OFFSET(Balance!D30,0,($O$1-1)*12)","v":"-"},{"$f":"OFFSET(Balance!E30,0,($O$1-1)*12)","v":"-"},{"$f":"OFFSET(Balance!F30,0,($O$1-1)*12)","v":"-"},{"$f":"OFFSET(Balance!G30,0,($O$1-1)*12)","v":"-"},{"$f":"OFFSET(Balance!H30,0,($O$1-1)*12)","v":"-"},{"$f":"OFFSET(Balance!I30,0,($O$1-1)*12)","v":"-"},{"$f":"OFFSET(Balance!J30,0,($O$1-1)*12)","v":"-"},{"$f":"OFFSET(Balance!K30,0,($O$1-1)*12)","v":"-"},{"$f":"OFFSET(Balance!L30,0,($O$1-1)*12)","v":"-"},{"$f":"OFFSET(Balance!M30,0,($O$1-1)*12)","v":"-"},{"$f":"OFFSET(Balance!N30,0,($O$1-1)*12)","v":"-"},{"$f":"SUM(O10,O13:O15)","v":664748.98600000003}]
[]
[null,"Eólica",{"$f":"OFFSET(Balance!C31,0,($O$1-1)*12)","v":469},{"$f":"OFFSET(Balance!D31,0,($O$1-1)*12)","v":311.3},{"$f":"OFFSET(Balance!E31,0,($O$1-1)*12)","v":"-"},{"$f":"OFFSET(Balance!F31,0,($O$1-1)*12)","v":"-"},{"$f":"OFFSET(Balance!G31,0,($O$1-1)*12)","v":"-"},{"$f":"OFFSET(Balance!H31,0,($O$1-1)*12)","v":"-"},{"$f":"OFFSET(Balance!I31,0,($O$1-1)*12)","v":"-"},{"$f":"OFFSET(Balance!J31,0,($O$1-1)*12)","v":"-"},{"$f":"OFFSET(Balance!K31,0,($O$1-1)*12)","v":"-"},{"$f":"OFFSET(Balance!L31,0,($O$1-1)*12)","v":"-"},{"$f":"OFFSET(Balance!M31,0,($O$1-1)*12)","v":"-"},{"$f":"OFFSET(Balance!N31,0,($O$1-1)*12)","v":"-"},780.3]
[null,"Solar fotovoltaica",{"$f":"OFFSET(Balance!C32,0,($O$1-1)*12)","v":5832},{"$f":"OFFSET(Balance!D32,0,($O$1-1)*12)","v":7094.4},{"$f":"OFFSET(Balance!E32,0,($O$1-1)*12)","v":"-"},{"$f":"OFFSET(Balance!F32,0,($O$1-1)*12)","v":"-"},{"$f":"OFFSET(Balance!G32,0,($O$1-1)*12)","v":"-"},{"$f":"OFFSET(Balance!H32,0,($O$1-1)*12)","v":"-"},{"$f":"OFFSET(Balance!I32,0,($O$1-1)*12)","v":"-"},{"$f":"OFFSET(Balance!J32,0,($O$1-1)*12)","v":"-"},{"$f":"OFFSET(Balance!K32,0,($O$1-1)*12)","v":"-"},{"$f":"OFFSET(Balance!L32,0,($O$1-1)*12)","v":"-"},{"$f":"OFFSET(Balance!M32,0,($O$1-1)*12)","v":"-"},{"$f":"OFFSET(Balance!N32,0,($O$1-1)*12)","v":"-"},12926.4]
[null,"Otras renovables ",{"$f":"OFFSET(Balance!C33,0,($O$1-1)*12)","v":159},{"$f":"OFFSET(Balance!D33,0,($O$1-1)*12)","v":152.47999999999999},{"$f":"OFFSET(Balance!E33,0,($O$1-1)*12)","v":"-"},{"$f":"OFFSET(Balance!F33,0,($O$1-1)*12)","v":"-"},{"$f":"OFFSET(Balance!G33,0,($O$1-1)*12)","v":"-"},{"$f":"OFFSET(Balance!H33,0,($O$1-1)*12)","v":"-"},{"$f":"OFFSET(Balance!I33,0,($O$1-1)*12)","v":"-"},{"$f":"OFFSET(Balance!J33,0,($O$1-1)*12)","v":"-"},{"$f":"OFFSET(Balance!K33,0,($O$1-1)*12)","v":"-"},{"$f":"OFFSET(Balance!L33,0,($O$1-1)*12)","v":"-"},{"$f":"OFFSET(Balance!M33,0,($O$1-1)*12)","v":"-"},{"$f":"OFFSET(Balance!N33,0,($O$1-1)*12)","v":"-"},311.48]
[null,"Cogeneración",{"$f":"OFFSET(Balance!C34,0,($O$1-1)*12)","v":3018},{"$f":"OFFSET(Balance!D34,0,($O$1-1)*12)","v":3024.12},{"$f":"OFFSET(Balance!E34,0,($O$1-1)*12)","v":"-"},{"$f":"OFFSET(Balance!F34,0,($O$1-1)*12)","v":"-"},{"$f":"OFFSET(Balance!G34,0,($O$1-1)*12)","v":"-"},{"$f":"OFFSET(Balance!H34,0,($O$1-1)*12)","v":"-"},{"$f":"OFFSET(Balance!I34,0,($O$1-1)*12)","v":"-"},{"$f":"OFFSET(Balance!J34,0,($O$1-1)*12)","v":"-"},{"$f":"OFFSET(Balance!K34,0,($O$1-1)*12)","v":"-"},{"$f":"OFFSET(Balance!L34,0,($O$1-1)*12)","v":"-"},{"$f":"OFFSET(Balance!M34,0,($O$1-1)*12)","v":"-"},{"$f":"OFFSET(Balance!N34,0,($O$1-1)*12)","v":"-"},6042.12]
[null,"Residuos",{"$f":"OFFSET(Balance!C35,0,($O$1-1)*12)","v":15088},{"$f":"OFFSET(Balance!D35,0,($O$1-1)*12)","v":14752},{"$f":"OFFSET(Balance!E35,0,($O$1-1)*12)","v":"-"},{"$f":"OFFSET(Balance!F35,0,($O$1-1)*12)","v":"-"},{"$f":"OFFSET(Balance!G35,0,($O$1-1)*12)","v":"-"},{"$f":"OFFSET(Balance!H35,0,($O$1-1)*12)","v":"-"},{"$f":"OFFSET(Balance!I35,0,($O$1-1)*12)","v":"-"},{"$f":"OFFSET(Balance!J35,0,($O$1-1)*12)","v":"-"},{"$f":"OFFSET(Balance!K35,0,($O$1-1)*12)","v":"-"},{"$f":"OFFSET(Balance!L35,0,($O$1-1)*12)","v":"-"},{"$f":"OFFSET(Balance!M35,0,($O$1-1)*12)","v":"-"},{"$f":"OFFSET(Balance!N35,0,($O$1-1)*12)","v":"-"},{"$f":"IF(SUM(C22:N22)=0,\"-\",SUM(C22:N22))","v":29840}]
[null,"Régimen especial",{"$f":"OFFSET(Balance!C36,0,($O$1-1)*12)","v":"-"},{"$f":"OFFSET(Balance!D36,0,($O$1-1)*12)","v":"-"},{"$f":"OFFSET(Balance!E36,0,($O$1-1)*12)","v":"-"},{"$f":"OFFSET(Balance!F36,0,($O$1-1)*12)","v":"-"},{"$f":"OFFSET(Balance!G36,0,($O$1-1)*12)","v":"-"},{"$f":"OFFSET(Balance!H36,0,($O$1-1)*12)","v":"-"},{"$f":"OFFSET(Balance!I36,0,($O$1-1)*12)","v":"-"},{"$f":"OFFSET(Balance!J36,0,($O$1-1)*12)","v":"-"},{"$f":"OFFSET(Balance!K36,0,($O$1-1)*12)","v":"-"},{"$f":"OFFSET(Balance!L36,0,($O$1-1)*12)","v":"-"},{"$f":"OFFSET(Balance!M36,0,($O$1-1)*12)","v":"-"},{"$f":"OFFSET(Balance!N36,0,($O$1-1)*12)","v":"-"},{"$f":"SUM(O18:O22)","v":49900.3}]
[null,"Generación",{"$f":"OFFSET(Balance!C37,0,($O$1-1)*12)","v":381127.58199999999},{"$f":"OFFSET(Balance!D37,0,($O$1-1)*12)","v":333521.70400000003},{"$f":"OFFSET(Balance!E37,0,($O$1-1)*12)","v":"-"},{"$f":"OFFSET(Balance!F37,0,($O$1-1)*12)","v":"-"},{"$f":"OFFSET(Balance!G37,0,($O$1-1)*12)","v":"-"},{"$f":"OFFSET(Balance!H37,0,($O$1-1)*12)","v":"-"},{"$f":"OFFSET(Balance!I37,0,($O$1-1)*12)","v":"-"},{"$f":"OFFSET(Balance!J37,0,($O$1-1)*12)","v":"-"},{"$f":"OFFSET(Balance!K37,0,($O$1-1)*12)","v":"-"},{"$f":"OFFSET(Balance!L37,0,($O$1-1)*12)","v":"-"},{"$f":"OFFSET(Balance!M37,0,($O$1-1)*12)","v":"-"},{"$f":"OFFSET(Balance!N37,0,($O$1-1)*12)","v":"-"},{"$f":"SUM(O16:O17,O23)","v":714649.28600000008}]
[null,"Enlace Península-Baleares (5)",{"$f":"OFFSET(Balance!C38,0,($O$1-1)*12)","v":96651.403000000006},{"$f":"OFFSET(Balance!D38,0,($O$1-1)*12)","v":64557.599999999999},{"$f":"OFFSET(Balance!E38,0,($O$1-1)*12)","v":"-"},{"$f":"OFFSET(Balance!F38,0,($O$1-1)*12)","v":"-"},{"$f":"OFFSET(Balance!G38,0,($O$1-1)*12)","v":"-"},{"$f":"OFFSET(Balance!H38,0,($O$1-1)*12)","v":"-"},{"$f":"OFFSET(Balance!I38,0,($O$1-1)*12)","v":"-"},{"$f":"OFFSET(Balance!J38,0,($O$1-1)*12)","v":"-"},{"$f":"OFFSET(Balance!K38,0,($O$1-1)*12)","v":"-"},{"$f":"OFFSET(Balance!L38,0,($O$1-1)*12)","v":"-"},{"$f":"OFFSET(Balance!M38,0,($O$1-1)*12)","v":"-"},{"$f":"OFFSET(Balance!N38,0,($O$1-1)*12)","v":"-"},161209.003]
[null,"Demanda transporte (b.c.)",{"$f":"OFFSET(Balance!C39,0,($O$1-1)*12)","v":477778.98499999999},{"$f":"OFFSET(Balance!D39,0,($O$1-1)*12)","v":398079.304},{"$f":"OFFSET(Balance!E39,0,($O$1-1)*12)","v":"-"},{"$f":"OFFSET(Balance!F39,0,($O$1-1)*12)","v":"-"},{"$f":"OFFSET(Balance!G39,0,($O$1-1)*12)","v":"-"},{"$f":"OFFSET(Balance!H39,0,($O$1-1)*12)","v":"-"},{"$f":"OFFSET(Balance!I39,0,($O$1-1)*12)","v":"-"},{"$f":"OFFSET(Balance!J39,0,($O$1-1)*12)","v":"-"},{"$f":"OFFSET(Balance!K39,0,($O$1-1)*12)","v":"-"},{"$f":"OFFSET(Balance!L39,0,($O$1-1)*12)","v":"-"},{"$f":"OFFSET(Balance!M39,0,($O$1-1)*12)","v":"-"},{"$f":"OFFSET(Balance!N39,0,($O$1-1)*12)","v":"-"},{"$f":"SUM(O24:O25)","v":875858.28900000011}]
[null,"(1) Asignación de unidades de producción según combustible principal."]
[null,"(2) Incluye funcionamiento en ciclo abierto."]
[null,"(3) Grupos de emergencia que se instalan de forma transitoria en determinadas zonas para cubrir un déficit de generación."]
[null,"(4) Incluye residuos."]
[null,"(5) Valor positivo: entrada de energía en el sistema; valor negativo: salida de energía del sistema. Enlace funcionando al mínimo técnico de seguridad hasta el 13/08/2012. "]
[null,{"$f":"'Balance nacional mensual'!B36","v":"Datos definitivos hasta el 31/12/2015. Datos provisionales del 01/01/2016 al 31/01/2017. Datos programados del 01/02/2017 al 28/02/2017."}]

{"sheet":"Balance Baleares anual","index":6,"n_rows":34,"n_cols":10,"rows_kept":34,"cut":false,"hidden":false,"merged":[[26,1,26,11],[27,1,27,11],[28,1,28,11],[31,1,31,11],[29,1,29,14],[30,1,30,14]]}
[null,null,null,null,null,null,null,null,null,2]
[]
[]
[null,null,null,null,null,null,null,null,"Sistema eléctrico"]
[null,null,null,null,null,null,null,null,"Horizonte temporal"]
[null,null,null,null,null,null,null,null,"Periodo"]
[]
[null,null,{"$f":"OFFSET(Balance!C122,0,($J$1-1)*8)","v":2014},{"$f":"OFFSET(Balance!D122,0,($J$1-1)*8)","v":2015},{"$f":"OFFSET(Balance!E122,0,($J$1-1)*8)","v":2016},{"$f":"OFFSET(Balance!F122,0,($J$1-1)*8)","v":2017},{"$f":"OFFSET(Balance!G122,0,($J$1-1)*8)","v":2018},{"$f":"OFFSET(Balance!H122,0,($J$1-1)*8)","v":2019},{"$f":"OFFSET(Balance!I122,0,($J$1-1)*8)","v":2020},{"$f":"OFFSET(Balance!J122,0,($J$1-1)*8)","v":2021}]
[]
[null,"Carbón",{"$f":"OFFSET(Balance!C123,0,($J$1-1)*8)","v":2187625.804},{"$f":"OFFSET(Balance!D123,0,($J$1-1)*8)","v":1865268.2970000003},{"$f":"OFFSET(Balance!E123,0,($J$1-1)*8)","v":2303768.3020000001},{"$f":"OFFSET(Balance!F123,0,($J$1-1)*8)","v":414283.31900000002},{"$f":"OFFSET(Balance!G123,0,($J$1-1)*8)","v":"-"},{"$f":"OFFSET(Balance!H123,0,($J$1-1)*8)","v":"-"},{"$f":"OFFSET(Balance!I123,0,($J$1-1)*8)","v":"-"},{"$f":"OFFSET(Balance!J123,0,($J$1-1)*8)","v":"-"}]
[null,"Motores diesel",{"$f":"OFFSET(Balance!C124,0,($J$1-1)*8)","v":671248.32699999993},{"$f":"OFFSET(Balance!D124,0,($J$1-1)*8)","v":729765.87399999995},{"$f":"OFFSET(Balance!E124,0,($J$1-1)*8)","v":963404.99399999995},{"$f":"OFFSET(Balance!F124,0,($J$1-1)*8)","v":156403.44500000001},{"$f":"OFFSET(Balance!G124,0,($J$1-1)*8)","v":"-"},{"$f":"OFFSET(Balance!H124,0,($J$1-1)*8)","v":"-"},{"$f":"OFFSET(Balance!I124,0,($J$1-1)*8)","v":"-"},{"$f":"OFFSET(Balance!J124,0,($J$1-1)*8)","v":"-"}]
[null,"Turbina de gas",{"$f":"OFFSET(Balance!C125,0,($J$1-1)*8)","v":581727.70699999994},{"$f":"OFFSET(Balance!D125,0,($J$1-1)*8)","v":582137.98199999996},{"$f":"OFFSET(Balance!E125,0,($J$1-1)*8)","v":338288.00099999999},{"$f":"OFFSET(Balance!F125,0,($J$1-1)*8)","v":21837.701999999997},{"$f":"OFFSET(Balance!G125,0,($J$1-1)*8)","v":"-"},{"$f":"OFFSET(Balance!H125,0,($J$1-1)*8)","v":"-"},{"$f":"OFFSET(Balance!I125,0,($J$1-1)*8)","v":"-"},{"$f":"OFFSET(Balance!J125,0,($J$1-1)*8)","v":"-"}]
[null,"Fuel + Gas",{"$f":"OFFSET(Balance!C126,0,($J$1-1)*8)","v":1252976.034},{"$f":"OFFSET(Balance!D126,0,($J$1-1)*8)","v":1311903.8559999999},{"$f":"OFFSET(Balance!E126,0,($J$1-1)*8)","v":1301692.9950000001},{"$f":"OFFSET(Balance!F126,0,($J$1-1)*8)","v":178241.147},{"$f":"OFFSET(Balance!G126,0,($J$1-1)*8)","v":"-"},{"$f":"OFFSET(Balance!H126,0,($J$1-1)*8)","v":"-"},{"$f":"OFFSET(Balance!I126,0,($J$1-1)*8)","v":"-"},{"$f":"OFFSET(Balance!J126,0,($J$1-1)*8)","v":"-"}]
[null,"Ciclo combinado (2)",{"$f":"OFFSET(Balance!C127,0,($J$1-1)*8)","v":426924.70399999997},{"$f":"OFFSET(Balance!D127,0,($J$1-1)*8)","v":809239.36800000013},{"$f":"OFFSET(Balance!E127,0,($J$1-1)*8)","v":542552.36600000004},{"$f":"OFFSET(Balance!F127,0,($J$1-1)*8)","v":72224.51999999999},{"$f":"OFFSET(Balance!G127,0,($J$1-1)*8)","v":"-"},{"$f":"OFFSET(Balance!H127,0,($J$1-1)*8)","v":"-"},{"$f":"OFFSET(Balance!I127,0,($J$1-1)*8)","v":"-"},{"$f":"OFFSET(Balance!J127,0,($J$1-1)*8)","v":"-"}]
[null,"Generación auxiliar (3)",{"$f":"OFFSET(Balance!C128,0,($J$1-1)*8)","v":7695.201},{"$f":"OFFSET(Balance!D128,0,($J$1-1)*8)","v":10581.855},{"$f":"OFFSET(Balance!E128,0,($J$1-1)*8)","v":10091.754999999999},{"$f":"OFFSET(Balance!F128,0,($J$1-1)*8)","v":0},{"$f":"OFFSET(Balance!G128,0,($J$1-1)*8)","v":"-"},{"$f":"OFFSET(Balance!H128,0,($J$1-1)*8)","v":"-"},{"$f":"OFFSET(Balance!I128,0,($J$1-1)*8)","v":"-"},{"$f":"OFFSET(Balance!J128,0,($J$1-1)*8)","v":"-"}]
[null,"Régimen ordinario",{"$f":"OFFSET(Balance!C129,0,($J$1-1)*8)","v":"-"},{"$f":"OFFSET(Balance!D129,0,($J$1-1)*8)","v":"-"},{"$f":"OFFSET(Balance!E129,0,($J$1-1)*8)","v":"-"},{"$f":"OFFSET(Balance!F129,0,($J$1-1)*8)","v":"-"},{"$f":"OFFSET(Balance!G129,0,($J$1-1)*8)","v":"-"},{"$f":"OFFSET(Balance!H129,0,($J$1-1)*8)","v":"-"},{"$f":"OFFSET(Balance!I129,0,($J$1-1)*8)","v":"-"},{"$f":"OFFSET(Balance!J129,0,($J$1-1)*8)","v":"-"}]
[]
[null,"Eólica",{"$f":"OFFSET(Balance!C130,0,($J$1-1)*8)","v":5839},{"$f":"OFFSET(Balance!D130,0,($J$1-1)*8)","v":5317.02},{"$f":"OFFSET(Balance!E130,0,($J$1-1)*8)","v":5414},{"$f":"OFFSET(Balance!F130,0,($J$1-1)*8)","v":780.3},{"$f":"OFFSET(Balance!G130,0,($J$1-1)*8)","v":"-"},{"$f":"OFFSET(Balance!H130,0,($J$1-1)*8)","v":"-"},{"$f":"OFFSET(Balance!I130,0,($J$1-1)*8)","v":"-"},{"$f":"OFFSET(Balance!J130,0,($J$1-1)*8)","v":"-"}]
[null,"Solar fotovoltaica",{"$f":"OFFSET(Balance!C131,0,($J$1-1)*8)","v":122773},{"$f":"OFFSET(Balance!D131,0,($J$1-1)*8)","v":122645.48},{"$f":"OFFSET(Balance!E131,0,($J$1-1)*8)","v":120420},{"$f":"OFFSET(Balance!F131,0,($J$1-1)*8)","v":12926.4},{"$f":"OFFSET(Balance!G131,0,($J$1-1)*8)","v":"-"},{"$f":"OFFSET(Balance!H131,0,($J$1-1)*8)","v":"-"},{"$f":"OFFSET(Balance!I131,0,($J$1-1)*8)","v":"-"},{"$f":"OFFSET(Balance!J131,0,($J$1-1)*8)","v":"-"}]
[null,"Térmica renovable(4)/Otras renovables",{"$f":"OFFSET(Balance!C132,0,($J$1-1)*8)","v":1944},{"$f":"OFFSET(Balance!D132,0,($J$1-1)*8)","v":1972.55},{"$f":"OFFSET(Balance!E132,0,($J$1-1)*8)","v":1309.92},{"$f":"OFFSET(Balance!F132,0,($J$1-1)*8)","v":311.48},{"$f":"OFFSET(Balance!G132,0,($J$1-1)*8)","v":"-"},{"$f":"OFFSET(Balance!H132,0,($J$1-1)*8)","v":"-"},{"$f":"OFFSET(Balance!I132,0,($J$1-1)*8)","v":"-"},{"$f":"OFFSET(Balance!J132,0,($J$1-1)*8)","v":"-"}]
[null,"Cogeneración y resto(4)/Cogeneración",{"$f":"OFFSET(Balance!C133,0,($J$1-1)*8)","v":281390},{"$f":"OFFSET(Balance!D133,0,($J$1-1)*8)","v":31519.32},{"$f":"OFFSET(Balance!E133,0,($J$1-1)*8)","v":34653.64},{"$f":"OFFSET(Balance!F133,0,($J$1-1)*8)","v":6042.12},{"$f":"OFFSET(Balance!G133,0,($J$1-1)*8)","v":"-"},{"$f":"OFFSET(Balance!H133,0,($J$1-1)*8)","v":"-"},{"$f":"OFFSET(Balance!I133,0,($J$1-1)*8)","v":"-"},{"$f":"OFFSET(Balance!J133,0,($J$1-1)*8)","v":"-"}]
[null,"Residuos",{"$f":"OFFSET(Balance!C134,0,($J$1-1)*8)","v":"-"},{"$f":"OFFSET(Balance!D134,0,($J$1-1)*8)","v":302196},{"$f":"OFFSET(Balance!E134,0,($J$1-1)*8)","v":261611},{"$f":"OFFSET(Balance!F134,0,($J$1-1)*8)","v":29840},{"$f":"OFFSET(Balance!G134,0,($J$1-1)*8)","v":"-"},{"$f":"OFFSET(Balance!H134,0,($J$1-1)*8)","v":"-"},{"$f":"OFFSET(Balance!I134,0,($J$1-1)*8)","v":"-"},{"$f":"OFFSET(Balance!J134,0,($J$1-1)*8)","v":"-"}]
[null,"Régimen especial",{"$f":"OFFSET(Balance!C135,0,($J$1-1)*8)","v":"-"},{"$f":"OFFSET(Balance!D135,0,($J$1-1)*8)","v":"-"},{"$f":"OFFSET(Balance!E135,0,($J$1-1)*8)","v":"-"},{"$f":"OFFSET(Balance!F135,0,($J$1-1)*8)","v":"-"},{"$f":"OFFSET(Balance!G135,0,($J$1-1)*8)","v":"-"},{"$f":"OFFSET(Balance!H135,0,($J$1-1)*8)","v":"-"},{"$f":"OFFSET(Balance!I135,0,($J$1-1)*8)","v":"-"},{"$f":"OFFSET(Balance!J135,0,($J$1-1)*8)","v":"-"}]
[null,"Generación",{"$f":"OFFSET(Balance!C136,0,($J$1-1)*8)","v":4287167.7429999998},{"$f":"OFFSET(Balance!D136,0,($J$1-1)*8)","v":4460643.7459999993},{"$f":"OFFSET(Balance!E136,0,($J$1-1)*8)","v":4581513.9779999992},{"$f":"OFFSET(Balance!F136,0,($J$1-1)*8)","v":714649.28600000008},{"$f":"OFFSET(Balance!G136,0,($J$1-1)*8)","v":"-"},{"$f":"OFFSET(Balance!H136,0,($J$1-1)*8)","v":"-"},{"$f":"OFFSET(Balance!I136,0,($J$1-1)*8)","v":"-"},{"$f":"OFFSET(Balance!J136,0,($J$1-1)*8)","v":"-"}]
[null,"Enlace Península-Baleares (5)",{"$f":"OFFSET(Balance!C137,0,($J$1-1)*8)","v":1298257.4659999998},{"$f":"OFFSET(Balance!D137,0,($J$1-1)*8)","v":1335791.8019999999},{"$f":"OFFSET(Balance!E137,0,($J$1-1)*8)","v":1250582.5009999999},{"$f":"OFFSET(Balance!F137,0,($J$1-1)*8)","v":161209.003},{"$f":"OFFSET(Balance!G137,0,($J$1-1)*8)","v":"-"},{"$f":"OFFSET(Balance!H137,0,($J$1-1)*8)","v":"-"},{"$f":"OFFSET(Balance!I137,0,($J$1-1)*8)","v":"-"},{"$f":"OFFSET(Balance!J137,0,($J$1-1)*8)","v":"-"}]
[null,"Demanda transporte (b.c.)",{"$f":"OFFSET(Balance!C138,0,($J$1-1)*8)","v":5585425.2089999998},{"$f":"OFFSET(Balance!D138,0,($J$1-1)*8)","v":5796435.5479999995},{"$f":"OFFSET(Balance!E138,0,($J$1-1)*8)","v":5832096.4789999994},{"$f":"OFFSET(Balance!F138,0,($J$1-1)*8)","v":875858.28900000011},{"$f":"OFFSET(Balance!G138,0,($J$1-1)*8)","v":"-"},{"$f":"OFFSET(Balance!H138,0,($J$1-1)*8)","v":"-"},{"$f":"OFFSET(Balance!I138,0,($J$1-1)*8)","v":"-"},{"$f":"OFFSET(Balance!J138,0,($J$1-1)*8)","v":"-"}]
[null,"(1) Asignación de unidades de producción según combustible principal."]
[null,"(2) Incluye funcionamiento en ciclo abierto."]
[null,"(3) Grupos de emergencia que se instalan de forma transitoria en determinadas zonas para cubrir un déficit de generación."]
[null,"(4) Hasta 2014 e incluye residuos."]
[null,"(4) Incluye residuos."]
[null,"(5) Valor positivo: entrada de energía en el sistema; valor negativo: salida de energía del sistema. Enlace funcionando al mínimo técnico de seguridad hasta el 13/08/2012. "]
[null,{"$f":"IF(MONTH(FACT)=1,\"\",CONCATENATE(\"Para el año \",YEAR(FACT), \" valores acumulados hasta \",TEXT(FACT-30,\"mmmm\"),\" de \",YEAR(FACT),\".\"))","v":"Para el año 2017 valores acumulados hasta febrero de 2017."}]
[null,{"$f":"'Balance nacional mensual'!B36","v":"Datos definitivos hasta el 31/12/2015. Datos provisionales del 01/01/2016 al 31/01/2017. Datos programados del 01/02/2017 al 28/02/2017."}]

{"sheet":"Balance Canarias mensual","index":7,"n_rows":32,"n_cols":15,"rows_kept":32,"cut":false,"hidden":false,"merged":[[28,1,28,14],[29,1,29,14],[30,1,30,14],[27,1,27,14],[31,1,31,10]]}
[null,null,null,null,null,null,null,null,null,null,null,null,null,null,12]
[]
[]
[null,null,null,null,null,null,null,null,null,null,null,null,"Sistema eléctrico"]
[null,null,null,null,null,null,null,null,null,null,null,null,"Horizonte temporal"]
[null,null,null,null,null,null,null,null,null,null,null,null,"Periodo"]
[]
[null,null,"Ene.","Feb.","Mar.","Abr.","May.","Jun.","Jul.","Ago.","Sep.","Oct.","Nov.","Dic.",{"$f":"OFFSET(Año!C18,($O$1-1),0)","v":2017}]
[]
[null,"Hidráulica",{"$f":"OFFSET(Balance!C42,0,($O$1-1)*12)","v":264},{"$f":"OFFSET(Balance!D42,0,($O$1-1)*12)","v":0},{"$f":"OFFSET(Balance!E42,0,($O$1-1)*12)","v":"-"},{"$f":"OFFSET(Balance!F42,0,($O$1-1)*12)","v":"-"},{"$f":"OFFSET(Balance!G42,0,($O$1-1)*12)","v":"-"},{"$f":"OFFSET(Balance!H42,0,($O$1-1)*12)","v":"-"},{"$f":"OFFSET(Balance!I42,0,($O$1-1)*12)","v":"-"},{"$f":"OFFSET(Balance!J42,0,($O$1-1)*12)","v":"-"},{"$f":"OFFSET(Balance!K42,0,($O$1-1)*12)","v":"-"},{"$f":"OFFSET(Balance!L42,0,($O$1-1)*12)","v":"-"},{"$f":"OFFSET(Balance!M42,0,($O$1-1)*12)","v":"-"},{"$f":"OFFSET(Balance!N42,0,($O$1-1)*12)","v":"-"},{"$f":"IF(SUM(C10:N10)=0,\"-\",SUM(C10:N10))","v":264}]
[null,"Motores diesel",{"$f":"OFFSET(Balance!C43,0,($O$1-1)*12)","v":188283.13200000001},{"$f":"OFFSET(Balance!D43,0,($O$1-1)*12)","v":171043.63099999999},{"$f":"OFFSET(Balance!E43,0,($O$1-1)*12)","v":"-"},{"$f":"OFFSET(Balance!F43,0,($O$1-1)*12)","v":"-"},{"$f":"OFFSET(Balance!G43,0,($O$1-1)*12)","v":"-"},{"$f":"OFFSET(Balance!H43,0,($O$1-1)*12)","v":"-"},{"$f":"OFFSET(Balance!I43,0,($O$1-1)*12)","v":"-"},{"$f":"OFFSET(Balance!J43,0,($O$1-1)*12)","v":"-"},{"$f":"OFFSET(Balance!K43,0,($O$1-1)*12)","v":"-"},{"$f":"OFFSET(Balance!L43,0,($O$1-1)*12)","v":"-"},{"$f":"OFFSET(Balance!M43,0,($O$1-1)*12)","v":"-"},{"$f":"OFFSET(Balance!N43,0,($O$1-1)*12)","v":"-"},{"$f":"IF(SUM(C11:N11)=0,\"-\",SUM(C11:N11))","v":359326.76300000004}]
[null,"Turbina de gas",{"$f":"OFFSET(Balance!C44,0,($O$1-1)*12)","v":31339.258000000002},{"$f":"OFFSET(Balance!D44,0,($O$1-1)*12)","v":19520.755000000001},{"$f":"OFFSET(Balance!E44,0,($O$1-1)*12)","v":"-"},{"$f":"OFFSET(Balance!F44,0,($O$1-1)*12)","v":"-"},{"$f":"OFFSET(Balance!G44,0,($O$1-1)*12)","v":"-"},{"$f":"OFFSET(Balance!H44,0,($O$1-1)*12)","v":"-"},{"$f":"OFFSET(Balance!I44,0,($O$1-1)*12)","v":"-"},{"$f":"OFFSET(Balance!J44,0,($O$1-1)*12)","v":"-"},{"$f":"OFFSET(Balance!K44,0,($O$1-1)*12)","v":"-"},{"$f":"OFFSET(Balance!L44,0,($O$1-1)*12)","v":"-"},{"$f":"OFFSET(Balance!M44,0,($O$1-1)*12)","v":"-"},{"$f":"OFFSET(Balance!N44,0,($O$1-1)*12)","v":"-"},{"$f":"IF(SUM(C12:N12)=0,\"-\",SUM(C12:N12))","v":50860.013000000006}]
[null,"Turbina de vapor",{"$f":"OFFSET(Balance!C45,0,($O$1-1)*12)","v":210604.08499999999},{"$f":"OFFSET(Balance!D45,0,($O$1-1)*12)","v":197884.05799999999},{"$f":"OFFSET(Balance!E45,0,($O$1-1)*12)","v":"-"},{"$f":"OFFSET(Balance!F45,0,($O$1-1)*12)","v":"-"},{"$f":"OFFSET(Balance!G45,0,($O$1-1)*12)","v":"-"},{"$f":"OFFSET(Balance!H45,0,($O$1-1)*12)","v":"-"},{"$f":"OFFSET(Balance!I45,0,($O$1-1)*12)","v":"-"},{"$f":"OFFSET(Balance!J45,0,($O$1-1)*12)","v":"-"},{"$f":"OFFSET(Balance!K45,0,($O$1-1)*12)","v":"-"},{"$f":"OFFSET(Balance!L45,0,($O$1-1)*12)","v":"-"},{"$f":"OFFSET(Balance!M45,0,($O$1-1)*12)","v":"-"},{"$f":"OFFSET(Balance!N45,0,($O$1-1)*12)","v":"-"},{"$f":"IF(SUM(C13:N13)=0,\"-\",SUM(C13:N13))","v":408488.14299999998}]
[null,"Fuel + Gas",{"$f":"OFFSET(Balance!C46,0,($O$1-1)*12)","v":430226.47499999998},{"$f":"OFFSET(Balance!D46,0,($O$1-1)*12)","v":388448.44400000002},{"$f":"OFFSET(Balance!E46,0,($O$1-1)*12)","v":"-"},{"$f":"OFFSET(Balance!F46,0,($O$1-1)*12)","v":"-"},{"$f":"OFFSET(Balance!G46,0,($O$1-1)*12)","v":"-"},{"$f":"OFFSET(Balance!H46,0,($O$1-1)*12)","v":"-"},{"$f":"OFFSET(Balance!I46,0,($O$1-1)*12)","v":"-"},{"$f":"OFFSET(Balance!J46,0,($O$1-1)*12)","v":"-"},{"$f":"OFFSET(Balance!K46,0,($O$1-1)*12)","v":"-"},{"$f":"OFFSET(Balance!L46,0,($O$1-1)*12)","v":"-"},{"$f":"OFFSET(Balance!M46,0,($O$1-1)*12)","v":"-"},{"$f":"OFFSET(Balance!N46,0,($O$1-1)*12)","v":"-"},{"$f":"IF(SUM(C14:N14)=0,\"-\",SUM(C14:N14))","v":818674.91899999999}]
[null,"Ciclo combinado (2)",{"$f":"OFFSET(Balance!C47,0,($O$1-1)*12)","v":282319.56300000002},{"$f":"OFFSET(Balance!D47,0,($O$1-1)*12)","v":237707.28200000001},{"$f":"OFFSET(Balance!E47,0,($O$1-1)*12)","v":"-"},{"$f":"OFFSET(Balance!F47,0,($O$1-1)*12)","v":"-"},{"$f":"OFFSET(Balance!G47,0,($O$1-1)*12)","v":"-"},{"$f":"OFFSET(Balance!H47,0,($O$1-1)*12)","v":"-"},{"$f":"OFFSET(Balance!I47,0,($O$1-1)*12)","v":"-"},{"$f":"OFFSET(Balance!J47,0,($O$1-1)*12)","v":"-"},{"$f":"OFFSET(Balance!K47,0,($O$1-1)*12)","v":"-"},{"$f":"OFFSET(Balance!L47,0,($O$1-1)*12)","v":"-"},{"$f":"OFFSET(Balance!M47,0,($O$1-1)*12)","v":"-"},{"$f":"OFFSET(Balance!N47,0,($O$1-1)*12)","v":"-"},520026.84500000003]
[null,"Generación auxiliar (3)",{"$f":"OFFSET(Balance!C48,0,($O$1-1)*12)","v":0},{"$f":"OFFSET(Balance!D48,0,($O$1-1)*12)","v":0},{"$f":"OFFSET(Balance!E48,0,($O$1-1)*12)","v":0},{"$f":"OFFSET(Balance!F48,0,($O$1-1)*12)","v":0},{"$f":"OFFSET(Balance!G48,0,($O$1-1)*12)","v":0},{"$f":"OFFSET(Balance!H48,0,($O$1-1)*12)","v":0},{"$f":"OFFSET(Balance!I48,0,($O$1-1)*12)","v":0},{"$f":"OFFSET(Balance!J48,0,($O$1-1)*12)","v":0},{"$f":"OFFSET(Balance!K48,0,($O$1-1)*12)","v":0},{"$f":"OFFSET(Balance!L48,0,($O$1-1)*12)","v":0},{"$f":"OFFSET(Balance!M48,0,($O$1-1)*12)","v":0},{"$f":"OFFSET(Balance!N48,0,($O$1-1)*12)","v":0},"-"]
[null,"Régimen ordinario",{"$f":"OFFSET(Balance!C49,0,($O$1-1)*12)","v":"-"},{"$f":"OFFSET(Balance!D49,0,($O$1-1)*12)","v":"-"},{"$f":"OFFSET(Balance!E49,0,($O$1-1)*12)","v":"-"},{"$f":"OFFSET(Balance!F49,0,($O$1-1)*12)","v":"-"},{"$f":"OFFSET(Balance!G49,0,($O$1-1)*12)","v":"-"},{"$f":"OFFSET(Balance!H49,0,($O$1-1)*12)","v":"-"},{"$f":"OFFSET(Balance!I49,0,($O$1-1)*12)","v":"-"},{"$f":"OFFSET(Balance!J49,0,($O$1-1)*12)","v":"-"},{"$f":"OFFSET(Balance!K49,0,($O$1-1)*12)","v":"-"},{"$f":"OFFSET(Balance!L49,0,($O$1-1)*12)","v":"-"},{"$f":"OFFSET(Balance!M49,0,($O$1-1)*12)","v":"-"},{"$f":"OFFSET(Balance!N49,0,($O$1-1)*12)","v":"-"},{"$f":"IF(SUM(C17:N17)=0,\"-\",SUM(C17:N17))","v":"-"}]
[]
[null,"Hidroeólica",{"$f":"OFFSET(Balance!C50,0,($O$1-1)*12)","v":1084.578},{"$f":"OFFSET(Balance!D50,0,($O$1-1)*12)","v":1404.7149999999999},{"$f":"OFFSET(Balance!E50,0,($O$1-1)*12)","v":"-"},{"$f":"OFFSET(Balance!F50,0,($O$1-1)*12)","v":"-"},{"$f":"OFFSET(Balance!G50,0,($O$1-1)*12)","v":"-"},{"$f":"OFFSET(Balance!H50,0,($O$1-1)*12)","v":"-"},{"$f":"OFFSET(Balance!I50,0,($O$1-1)*12)","v":"-"},{"$f":"OFFSET(Balance!J50,0,($O$1-1)*12)","v":"-"},{"$f":"OFFSET(Balance!K50,0,($O$1-1)*12)","v":"-"},{"$f":"OFFSET(Balance!L50,0,($O$1-1)*12)","v":"-"},{"$f":"OFFSET(Balance!M50,0,($O$1-1)*12)","v":"-"},{"$f":"OFFSET(Balance!N50,0,($O$1-1)*12)","v":"-"},{"$f":"IF(SUM(C19:N19)=0,\"-\",SUM(C19:N19))","v":2489.2929999999997}]
[null,"Hidráulica",{"$f":"OFFSET(Balance!C51,0,($O$1-1)*12)","v":"-"},{"$f":"OFFSET(Balance!D51,0,($O$1-1)*12)","v":"-"},{"$f":"OFFSET(Balance!E51,0,($O$1-1)*12)","v":"-"},{"$f":"OFFSET(Balance!F51,0,($O$1-1)*12)","v":"-"},{"$f":"OFFSET(Balance!G51,0,($O$1-1)*12)","v":"-"},{"$f":"OFFSET(Balance!H51,0,($O$1-1)*12)","v":"-"},{"$f":"OFFSET(Balance!I51,0,($O$1-1)*12)","v":"-"},{"$f":"OFFSET(Balance!J51,0,($O$1-1)*12)","v":"-"},{"$f":"OFFSET(Balance!K51,0,($O$1-1)*12)","v":"-"},{"$f":"OFFSET(Balance!L51,0,($O$1-1)*12)","v":"-"},{"$f":"OFFSET(Balance!M51,0,($O$1-1)*12)","v":"-"},{"$f":"OFFSET(Balance!N51,0,($O$1-1)*12)","v":"-"},{"$f":"IF(SUM(C20:N20)=0,\"-\",SUM(C20:N20))","v":"-"}]
[null,"Eólica",{"$f":"OFFSET(Balance!C52,0,($O$1-1)*12)","v":15064},{"$f":"OFFSET(Balance!D52,0,($O$1-1)*12)","v":24462.879000000001},{"$f":"OFFSET(Balance!E52,0,($O$1-1)*12)","v":"-"},{"$f":"OFFSET(Balance!F52,0,($O$1-1)*12)","v":"-"},{"$f":"OFFSET(Balance!G52,0,($O$1-1)*12)","v":"-"},{"$f":"OFFSET(Balance!H52,0,($O$1-1)*12)","v":"-"},{"$f":"OFFSET(Balance!I52,0,($O$1-1)*12)","v":"-"},{"$f":"OFFSET(Balance!J52,0,($O$1-1)*12)","v":"-"},{"$f":"OFFSET(Balance!K52,0,($O$1-1)*12)","v":"-"},{"$f":"OFFSET(Balance!L52,0,($O$1-1)*12)","v":"-"},{"$f":"OFFSET(Balance!M52,0,($O$1-1)*12)","v":"-"},{"$f":"OFFSET(Balance!N52,0,($O$1-1)*12)","v":"-"},39526.879000000001]
[null,"Solar fotovoltaica",{"$f":"OFFSET(Balance!C53,0,($O$1-1)*12)","v":17847},{"$f":"OFFSET(Balance!D53,0,($O$1-1)*12)","v":18645.307000000001},{"$f":"OFFSET(Balance!E53,0,($O$1-1)*12)","v":"-"},{"$f":"OFFSET(Balance!F53,0,($O$1-1)*12)","v":"-"},{"$f":"OFFSET(Balance!G53,0,($O$1-1)*12)","v":"-"},{"$f":"OFFSET(Balance!H53,0,($O$1-1)*12)","v":"-"},{"$f":"OFFSET(Balance!I53,0,($O$1-1)*12)","v":"-"},{"$f":"OFFSET(Balance!J53,0,($O$1-1)*12)","v":"-"},{"$f":"OFFSET(Balance!K53,0,($O$1-1)*12)","v":"-"},{"$f":"OFFSET(Balance!L53,0,($O$1-1)*12)","v":"-"},{"$f":"OFFSET(Balance!M53,0,($O$1-1)*12)","v":"-"},{"$f":"OFFSET(Balance!N53,0,($O$1-1)*12)","v":"-"},36492.307000000001]
[null,"Otras renovables",{"$f":"OFFSET(Balance!C54,0,($O$1-1)*12)","v":811},{"$f":"OFFSET(Balance!D54,0,($O$1-1)*12)","v":0},{"$f":"OFFSET(Balance!E54,0,($O$1-1)*12)","v":"-"},{"$f":"OFFSET(Balance!F54,0,($O$1-1)*12)","v":"-"},{"$f":"OFFSET(Balance!G54,0,($O$1-1)*12)","v":"-"},{"$f":"OFFSET(Balance!H54,0,($O$1-1)*12)","v":"-"},{"$f":"OFFSET(Balance!I54,0,($O$1-1)*12)","v":"-"},{"$f":"OFFSET(Balance!J54,0,($O$1-1)*12)","v":"-"},{"$f":"OFFSET(Balance!K54,0,($O$1-1)*12)","v":"-"},{"$f":"OFFSET(Balance!L54,0,($O$1-1)*12)","v":"-"},{"$f":"OFFSET(Balance!M54,0,($O$1-1)*12)","v":"-"},{"$f":"OFFSET(Balance!N54,0,($O$1-1)*12)","v":"-"},811]
[null,"Cogeneración",{"$f":"OFFSET(Balance!C55,0,($O$1-1)*12)","v":0},{"$f":"OFFSET(Balance!D55,0,($O$1-1)*12)","v":0},{"$f":"OFFSET(Balance!E55,0,($O$1-1)*12)","v":"-"},{"$f":"OFFSET(Balance!F55,0,($O$1-1)*12)","v":"-"},{"$f":"OFFSET(Balance!G55,0,($O$1-1)*12)","v":"-"},{"$f":"OFFSET(Balance!H55,0,($O$1-1)*12)","v":"-"},{"$f":"OFFSET(Balance!I55,0,($O$1-1)*12)","v":"-"},{"$f":"OFFSET(Balance!J55,0,($O$1-1)*12)","v":"-"},{"$f":"OFFSET(Balance!K55,0,($O$1-1)*12)","v":"-"},{"$f":"OFFSET(Balance!L55,0,($O$1-1)*12)","v":"-"},{"$f":"OFFSET(Balance!M55,0,($O$1-1)*12)","v":"-"},{"$f":"OFFSET(Balance!N55,0,($O$1-1)*12)","v":"-"},"-"]
[null,"Régimen especial",{"$f":"OFFSET(Balance!C56,0,($O$1-1)*12)","v":"-"},{"$f":"OFFSET(Balance!D56,0,($O$1-1)*12)","v":"-"},{"$f":"OFFSET(Balance!E56,0,($O$1-1)*12)","v":"-"},{"$f":"OFFSET(Balance!F56,0,($O$1-1)*12)","v":"-"},{"$f":"OFFSET(Balance!G56,0,($O$1-1)*12)","v":"-"},{"$f":"OFFSET(Balance!H56,0,($O$1-1)*12)","v":"-"},{"$f":"OFFSET(Balance!I56,0,($O$1-1)*12)","v":"-"},{"$f":"OFFSET(Balance!J56,0,($O$1-1)*12)","v":"-"},{"$f":"OFFSET(Balance!K56,0,($O$1-1)*12)","v":"-"},{"$f":"OFFSET(Balance!L56,0,($O$1-1)*12)","v":"-"},{"$f":"OFFSET(Balance!M56,0,($O$1-1)*12)","v":"-"},{"$f":"OFFSET(Balance!N56,0,($O$1-1)*12)","v":"-"},{"$f":"SUM(O20:O24)","v":76830.186000000002}]
[null,"Generación",{"$f":"OFFSET(Balance!C57,0,($O$1-1)*12)","v":747616.61600000004},{"$f":"OFFSET(Balance!D57,0,($O$1-1)*12)","v":670668.62699999998},{"$f":"OFFSET(Balance!E57,0,($O$1-1)*12)","v":"-"},{"$f":"OFFSET(Balance!F57,0,($O$1-1)*12)","v":"-"},{"$f":"OFFSET(Balance!G57,0,($O$1-1)*12)","v":"-"},{"$f":"OFFSET(Balance!H57,0,($O$1-1)*12)","v":"-"},{"$f":"OFFSET(Balance!I57,0,($O$1-1)*12)","v":"-"},{"$f":"OFFSET(Balance!J57,0,($O$1-1)*12)","v":"-"},{"$f":"OFFSET(Balance!K57,0,($O$1-1)*12)","v":"-"},{"$f":"OFFSET(Balance!L57,0,($O$1-1)*12)","v":"-"},{"$f":"OFFSET(Balance!M57,0,($O$1-1)*12)","v":"-"},{"$f":"OFFSET(Balance!N57,0,($O$1-1)*12)","v":"-"},1418285.243]
[null,"Demanda transporte (b.c.)",{"$f":"OFFSET(Balance!C58,0,($O$1-1)*12)","v":747616.61600000004},{"$f":"OFFSET(Balance!D58,0,($O$1-1)*12)","v":670668.62699999998},{"$f":"OFFSET(Balance!E58,0,($O$1-1)*12)","v":"-"},{"$f":"OFFSET(Balance!F58,0,($O$1-1)*12)","v":"-"},{"$f":"OFFSET(Balance!G58,0,($O$1-1)*12)","v":"-"},{"$f":"OFFSET(Balance!H58,0,($O$1-1)*12)","v":"-"},{"$f":"OFFSET(Balance!I58,0,($O$1-1)*12)","v":"-"},{"$f":"OFFSET(Balance!J58,0,($O$1-1)*12)","v":"-"},{"$f":"OFFSET(Balance!K58,0,($O$1-1)*12)","v":"-"},{"$f":"OFFSET(Balance!L58,0,($O$1-1)*12)","v":"-"},{"$f":"OFFSET(Balance!M58,0,($O$1-1)*12)","v":"-"},{"$f":"OFFSET(Balance!N58,0,($O$1-1)*12)","v":"-"},1418285.243]
[null,"(1) Asignación de unidades de producción según combustible principal."]
[null,"(2) Utiliza fue y gasoil como combustible principal. Incluye funcionamiento en ciclo abierto."]
[null,"(3) Grupos de emergencia que se instalan de forma transitoria en determinadas zonas para cubrir un déficit de generación."]
[null,"(4) Incluye todas aquellas unidades menores de 50 MW que no pertenecen a ninguna unidad de gestión hidráulica (UGH)."]
[null,{"$f":"'Balance nacional mensual'!B36","v":"Datos definitivos hasta el 31/12/2015. Datos provisionales del 01/01/2016 al 31/01/2017. Datos programados del 01/02/2017 al 28/02/2017."}]

{"sheet":"Balance Canarias anual","index":8,"n_rows":33,"n_cols":10,"rows_kept":33,"cut":false,"hidden":false,"merged":[[27,1,27,11],[28,1,28,11],[29,1,29,11],[30,1,30,11]]}
[null,null,null,null,null,null,null,null,null,2]
[]
[]
[null,null,null,null,null,null,null,null,"Sistema eléctrico"]
[null,null,null,null,null,null,null,null,"Horizonte temporal"]
[null,null,null,null,null,null,null,null,"Periodo"]
[]
[null,null,{"$f":"OFFSET(Balance!C140,0,($J$1-1)*8)","v":2014},{"$f":"OFFSET(Balance!D140,0,($J$1-1)*8)","v":2015},{"$f":"OFFSET(Balance!E140,0,($J$1-1)*8)","v":2016},{"$f":"OFFSET(Balance!F140,0,($J$1-1)*8)","v":2017},{"$f":"OFFSET(Balance!G140,0,($J$1-1)*8)","v":2018},{"$f":"OFFSET(Balance!H140,0,($J$1-1)*8)","v":2019},{"$f":"OFFSET(Balance!I140,0,($J$1-1)*8)","v":2020},{"$f":"OFFSET(Balance!J140,0,($J$1-1)*8)","v":2021}]
[]
[null,"Hidráulica",{"$f":"OFFSET(Balance!C141,0,($J$1-1)*8)","v":0},{"$f":"OFFSET(Balance!D141,0,($J$1-1)*8)","v":3585.2},{"$f":"OFFSET(Balance!E141,0,($J$1-1)*8)","v":3472},{"$f":"OFFSET(Balance!F141,0,($J$1-1)*8)","v":264},{"$f":"OFFSET(Balance!G141,0,($J$1-1)*8)","v":"-"},{"$f":"OFFSET(Balance!H141,0,($J$1-1)*8)","v":"-"},{"$f":"OFFSET(Balance!I141,0,($J$1-1)*8)","v":"-"},{"$f":"OFFSET(Balance!J141,0,($J$1-1)*8)","v":"-"}]
[null,"Motores diesel",{"$f":"OFFSET(Balance!C142,0,($J$1-1)*8)","v":2145111.9040000001},{"$f":"OFFSET(Balance!D142,0,($J$1-1)*8)","v":2207692.36},{"$f":"OFFSET(Balance!E142,0,($J$1-1)*8)","v":2227665.5260000001},{"$f":"OFFSET(Balance!F142,0,($J$1-1)*8)","v":359326.76300000004},{"$f":"OFFSET(Balance!G142,0,($J$1-1)*8)","v":"-"},{"$f":"OFFSET(Balance!H142,0,($J$1-1)*8)","v":"-"},{"$f":"OFFSET(Balance!I142,0,($J$1-1)*8)","v":"-"},{"$f":"OFFSET(Balance!J142,0,($J$1-1)*8)","v":"-"}]
[null,"Turbina de gas",{"$f":"OFFSET(Balance!C143,0,($J$1-1)*8)","v":363766.8459999999},{"$f":"OFFSET(Balance!D143,0,($J$1-1)*8)","v":330903.78599999991},{"$f":"OFFSET(Balance!E143,0,($J$1-1)*8)","v":279139.54399999999},{"$f":"OFFSET(Balance!F143,0,($J$1-1)*8)","v":50860.013000000006},{"$f":"OFFSET(Balance!G143,0,($J$1-1)*8)","v":"-"},{"$f":"OFFSET(Balance!H143,0,($J$1-1)*8)","v":"-"},{"$f":"OFFSET(Balance!I143,0,($J$1-1)*8)","v":"-"},{"$f":"OFFSET(Balance!J143,0,($J$1-1)*8)","v":"-"}]
[null,"Turbina de vapor",{"$f":"OFFSET(Balance!C144,0,($J$1-1)*8)","v":2074036.0720000002},{"$f":"OFFSET(Balance!D144,0,($J$1-1)*8)","v":2225313.5290000001},{"$f":"OFFSET(Balance!E144,0,($J$1-1)*8)","v":2536663.6469999999},{"$f":"OFFSET(Balance!F144,0,($J$1-1)*8)","v":408488.14299999998},{"$f":"OFFSET(Balance!G144,0,($J$1-1)*8)","v":"-"},{"$f":"OFFSET(Balance!H144,0,($J$1-1)*8)","v":"-"},{"$f":"OFFSET(Balance!I144,0,($J$1-1)*8)","v":"-"},{"$f":"OFFSET(Balance!J144,0,($J$1-1)*8)","v":"-"}]
[null,"Fuel + Gas",{"$f":"OFFSET(Balance!C145,0,($J$1-1)*8)","v":4582914.8220000006},{"$f":"OFFSET(Balance!D145,0,($J$1-1)*8)","v":4763910.6749999998},{"$f":"OFFSET(Balance!E145,0,($J$1-1)*8)","v":5043468.7169999992},{"$f":"OFFSET(Balance!F145,0,($J$1-1)*8)","v":818674.91899999999},{"$f":"OFFSET(Balance!G145,0,($J$1-1)*8)","v":"-"},{"$f":"OFFSET(Balance!H145,0,($J$1-1)*8)","v":"-"},{"$f":"OFFSET(Balance!I145,0,($J$1-1)*8)","v":"-"},{"$f":"OFFSET(Balance!J145,0,($J$1-1)*8)","v":"-"}]
[null,"Ciclo combinado (2)",{"$f":"OFFSET(Balance!C146,0,($J$1-1)*8)","v":3311448.9440000001},{"$f":"OFFSET(Balance!D146,0,($J$1-1)*8)","v":3213042.0700000003},{"$f":"OFFSET(Balance!E146,0,($J$1-1)*8)","v":3031699.5109999995},{"$f":"OFFSET(Balance!F146,0,($J$1-1)*8)","v":520026.84500000003},{"$f":"OFFSET(Balance!G146,0,($J$1-1)*8)","v":"-"},{"$f":"OFFSET(Balance!H146,0,($J$1-1)*8)","v":"-"},{"$f":"OFFSET(Balance!I146,0,($J$1-1)*8)","v":"-"},{"$f":"OFFSET(Balance!J146,0,($J$1-1)*8)","v":"-"}]
[null,"Generación auxiliar (3)",{"$f":"OFFSET(Balance!C147,0,($J$1-1)*8)","v":0},{"$f":"OFFSET(Balance!D147,0,($J$1-1)*8)","v":0},{"$f":"OFFSET(Balance!E147,0,($J$1-1)*8)","v":0},{"$f":"OFFSET(Balance!F147,0,($J$1-1)*8)","v":0},{"$f":"OFFSET(Balance!G147,0,($J$1-1)*8)","v":"-"},{"$f":"OFFSET(Balance!H147,0,($J$1-1)*8)","v":"-"},{"$f":"OFFSET(Balance!I147,0,($J$1-1)*8)","v":"-"},{"$f":"OFFSET(Balance!J147,0,($J$1-1)*8)","v":"-"}]
[null,"Régimen ordinario",{"$f":"OFFSET(Balance!C148,0,($J$1-1)*8)","v":"-"},{"$f":"OFFSET(Balance!D148,0,($J$1-1)*8)","v":"-"},{"$f":"OFFSET(Balance!E148,0,($J$1-1)*8)","v":"-"},{"$f":"OFFSET(Balance!F148,0,($J$1-1)*8)","v":"-"},{"$f":"OFFSET(Balance!G148,0,($J$1-1)*8)","v":"-"},{"$f":"OFFSET(Balance!H148,0,($J$1-1)*8)","v":"-"},{"$f":"OFFSET(Balance!I148,0,($J$1-1)*8)","v":"-"},{"$f":"OFFSET(Balance!J148,0,($J$1-1)*8)","v":"-"}]
[]
[null,"Hidroeólica",{"$f":"OFFSET(Balance!C149,0,($J$1-1)*8)","v":1071.8609999999999},{"$f":"OFFSET(Balance!D149,0,($J$1-1)*8)","v":8557.1660000000011},{"$f":"OFFSET(Balance!E149,0,($J$1-1)*8)","v":18102.738999999998},{"$f":"OFFSET(Balance!F149,0,($J$1-1)*8)","v":2489.3929999999996},{"$f":"OFFSET(Balance!G149,0,($J$1-1)*8)","v":"-"},{"$f":"OFFSET(Balance!H149,0,($J$1-1)*8)","v":"-"},{"$f":"OFFSET(Balance!I149,0,($J$1-1)*8)","v":"-"},{"$f":"OFFSET(Balance!J149,0,($J$1-1)*8)","v":"-"}]
[null,"Resto hidráulica (4)",{"$f":"OFFSET(Balance!C150,0,($J$1-1)*8)","v":3479.0210000000002},{"$f":"OFFSET(Balance!D150,0,($J$1-1)*8)","v":"-"},{"$f":"OFFSET(Balance!E150,0,($J$1-1)*8)","v":"-"},{"$f":"OFFSET(Balance!F150,0,($J$1-1)*8)","v":"-"},{"$f":"OFFSET(Balance!G150,0,($J$1-1)*8)","v":"-"},{"$f":"OFFSET(Balance!H150,0,($J$1-1)*8)","v":"-"},{"$f":"OFFSET(Balance!I150,0,($J$1-1)*8)","v":"-"},{"$f":"OFFSET(Balance!J150,0,($J$1-1)*8)","v":"-"}]
[null,"Eólica",{"$f":"OFFSET(Balance!C151,0,($J$1-1)*8)","v":389964},{"$f":"OFFSET(Balance!D151,0,($J$1-1)*8)","v":396661.05200000003},{"$f":"OFFSET(Balance!E151,0,($J$1-1)*8)","v":394560},{"$f":"OFFSET(Balance!F151,0,($J$1-1)*8)","v":39526.879000000001},{"$f":"OFFSET(Balance!G151,0,($J$1-1)*8)","v":"-"},{"$f":"OFFSET(Balance!H151,0,($J$1-1)*8)","v":"-"},{"$f":"OFFSET(Balance!I151,0,($J$1-1)*8)","v":"-"},{"$f":"OFFSET(Balance!J151,0,($J$1-1)*8)","v":"-"}]
[null,"Solar fotovoltaica",{"$f":"OFFSET(Balance!C152,0,($J$1-1)*8)","v":282291},{"$f":"OFFSET(Balance!D152,0,($J$1-1)*8)","v":275554.16099999996},{"$f":"OFFSET(Balance!E152,0,($J$1-1)*8)","v":277275},{"$f":"OFFSET(Balance!F152,0,($J$1-1)*8)","v":36492.307000000001},{"$f":"OFFSET(Balance!G152,0,($J$1-1)*8)","v":"-"},{"$f":"OFFSET(Balance!H152,0,($J$1-1)*8)","v":"-"},{"$f":"OFFSET(Balance!I152,0,($J$1-1)*8)","v":"-"},{"$f":"OFFSET(Balance!J152,0,($J$1-1)*8)","v":"-"}]
[null,"Térmica renovable/Otras renovables",{"$f":"OFFSET(Balance!C153,0,($J$1-1)*8)","v":8806.7219999999998},{"$f":"OFFSET(Balance!D153,0,($J$1-1)*8)","v":8053.2160000000003},{"$f":"OFFSET(Balance!E153,0,($J$1-1)*8)","v":9335},{"$f":"OFFSET(Balance!F153,0,($J$1-1)*8)","v":811},{"$f":"OFFSET(Balance!G153,0,($J$1-1)*8)","v":"-"},{"$f":"OFFSET(Balance!H153,0,($J$1-1)*8)","v":"-"},{"$f":"OFFSET(Balance!I153,0,($J$1-1)*8)","v":"-"},{"$f":"OFFSET(Balance!J153,0,($J$1-1)*8)","v":"-"}]
[null,"Cogeneración",{"$f":"OFFSET(Balance!C154,0,($J$1-1)*8)","v":0},{"$f":"OFFSET(Balance!D154,0,($J$1-1)*8)","v":0},{"$f":"OFFSET(Balance!E154,0,($J$1-1)*8)","v":0},{"$f":"OFFSET(Balance!F154,0,($J$1-1)*8)","v":0},{"$f":"OFFSET(Balance!G154,0,($J$1-1)*8)","v":"-"},{"$f":"OFFSET(Balance!H154,0,($J$1-1)*8)","v":"-"},{"$f":"OFFSET(Balance!I154,0,($J$1-1)*8)","v":"-"},{"$f":"OFFSET(Balance!J154,0,($J$1-1)*8)","v":"-"}]
[null,"Régimen especial",{"$f":"OFFSET(Balance!C155,0,($J$1-1)*8)","v":"-"},{"$f":"OFFSET(Balance!D155,0,($J$1-1)*8)","v":"-"},{"$f":"OFFSET(Balance!E155,0,($J$1-1)*8)","v":"-"},{"$f":"OFFSET(Balance!F155,0,($J$1-1)*8)","v":"-"},{"$f":"OFFSET(Balance!G155,0,($J$1-1)*8)","v":"-"},{"$f":"OFFSET(Balance!H155,0,($J$1-1)*8)","v":"-"},{"$f":"OFFSET(Balance!I155,0,($J$1-1)*8)","v":"-"},{"$f":"OFFSET(Balance!J155,0,($J$1-1)*8)","v":"-"}]
[null,"Generación",{"$f":"OFFSET(Balance!C156,0,($J$1-1)*8)","v":8579976.370000001},{"$f":"OFFSET(Balance!D156,0,($J$1-1)*8)","v":8669362.4399999995},{"$f":"OFFSET(Balance!E156,0,($J$1-1)*8)","v":8777912.8670000006},{"$f":"OFFSET(Balance!F156,0,($J$1-1)*8)","v":1418285.243},{"$f":"OFFSET(Balance!G156,0,($J$1-1)*8)","v":"-"},{"$f":"OFFSET(Balance!H156,0,($J$1-1)*8)","v":"-"},{"$f":"OFFSET(Balance!I156,0,($J$1-1)*8)","v":"-"},{"$f":"OFFSET(Balance!J156,0,($J$1-1)*8)","v":"-"}]
[null,"Demanda transporte (b.c.)",{"$f":"OFFSET(Balance!C157,0,($J$1-1)*8)","v":8579976.370000001},{"$f":"OFFSET(Balance!D157,0,($J$1-1)*8)","v":8669362.4399999995},{"$f":"OFFSET(Balance!E157,0,($J$1-1)*8)","v":8777912.8670000006},{"$f":"OFFSET(Balance!F157,0,($J$1-1)*8)","v":1418285.243},{"$f":"OFFSET(Balance!G157,0,($J$1-1)*8)","v":"-"},{"$f":"OFFSET(Balance!H157,0,($J$1-1)*8)","v":"-"},{"$f":"OFFSET(Balance!I157,0,($J$1-1)*8)","v":"-"},{"$f":"OFFSET(Balance!J157,0,($J$1-1)*8)","v":"-"}]
[null,"(1) Asignación de unidades de producción según combustible principal."]
[null,"(2) Utiliza fue y gasoil como combustible principal. Incluye funcionamiento en ciclo abierto."]
[null,"(3) Grupos de emergencia que se instalan de forma transitoria en determinadas zonas para cubrir un déficit de generación."]
[null,"(4) Incluye todas aquellas unidades menores de 50 MW que no pertenecen a ninguna unidad de gestión hidráulica (UGH)."]
[null,{"$f":"IF(MONTH(FACT)=1,\"\",CONCATENATE(\"Para el año \",YEAR(FACT), \" valores acumulados hasta \",TEXT(FACT-30,\"mmmm\"),\" de \",YEAR(FACT),\".\"))","v":"Para el año 2017 valores acumulados hasta febrero de 2017."}]
[null,{"$f":"'Balance nacional mensual'!B36","v":"Datos definitivos hasta el 31/12/2015. Datos provisionales del 01/01/2016 al 31/01/2017. Datos programados del 01/02/2017 al 28/02/2017."}]

{"sheet":"Balance Ceuta mensual","index":9,"n_rows":18,"n_cols":15,"rows_kept":18,"cut":false,"hidden":false,"merged":[[16,1,16,14],[17,1,17,14]]}
[null,null,null,null,null,null,null,null,null,null,null,null,null,null,11]
[]
[]
[null,null,null,null,null,null,null,null,null,null,null,null,"Sistema eléctrico"]
[null,null,null,null,null,null,null,null,null,null,null,null,"Horizonte temporal"]
[null,null,null,null,null,null,null,null,null,null,null,null,"Periodo"]
[]
[null,null,"Ene.","Feb.","Mar.","Abr.","May.","Jun.","Jul.","Ago.","Sep.","Oct.","Nov.","Dic.",{"$f":"OFFSET(Año!C19,($O$1-1),0)","v":2017}]
[]
[null,"Motores diesel",{"$f":"OFFSET(Balance!C61,0,($O$1-1)*12)","v":18539.718000000001},{"$f":"OFFSET(Balance!D61,0,($O$1-1)*12)","v":16572.716},{"$f":"OFFSET(Balance!E61,0,($O$1-1)*12)","v":"-"},{"$f":"OFFSET(Balance!F61,0,($O$1-1)*12)","v":"-"},{"$f":"OFFSET(Balance!G61,0,($O$1-1)*12)","v":"-"},{"$f":"OFFSET(Balance!H61,0,($O$1-1)*12)","v":"-"},{"$f":"OFFSET(Balance!I61,0,($O$1-1)*12)","v":"-"},{"$f":"OFFSET(Balance!J61,0,($O$1-1)*12)","v":"-"},{"$f":"OFFSET(Balance!K61,0,($O$1-1)*12)","v":"-"},{"$f":"OFFSET(Balance!L61,0,($O$1-1)*12)","v":"-"},{"$f":"OFFSET(Balance!M61,0,($O$1-1)*12)","v":"-"},{"$f":"OFFSET(Balance!N61,0,($O$1-1)*12)","v":"-"},{"$f":"IF(SUM(C10:N10)=0,\"-\",SUM(C10:N10))","v":35112.434000000001}]
[null,"Turbina de gas",{"$f":"OFFSET(Balance!C62,0,($O$1-1)*12)","v":0.35199999999999998},{"$f":"OFFSET(Balance!D62,0,($O$1-1)*12)","v":2.8839999999999999},{"$f":"OFFSET(Balance!E62,0,($O$1-1)*12)","v":"-"},{"$f":"OFFSET(Balance!F62,0,($O$1-1)*12)","v":"-"},{"$f":"OFFSET(Balance!G62,0,($O$1-1)*12)","v":"-"},{"$f":"OFFSET(Balance!H62,0,($O$1-1)*12)","v":"-"},{"$f":"OFFSET(Balance!I62,0,($O$1-1)*12)","v":"-"},{"$f":"OFFSET(Balance!J62,0,($O$1-1)*12)","v":"-"},{"$f":"OFFSET(Balance!K62,0,($O$1-1)*12)","v":"-"},{"$f":"OFFSET(Balance!L62,0,($O$1-1)*12)","v":"-"},{"$f":"OFFSET(Balance!M62,0,($O$1-1)*12)","v":"-"},{"$f":"OFFSET(Balance!N62,0,($O$1-1)*12)","v":"-"},3.2359999999999998]
[null,"Fuel + Gas",{"$f":"OFFSET(Balance!C63,0,($O$1-1)*12)","v":18540.07},{"$f":"OFFSET(Balance!D63,0,($O$1-1)*12)","v":16575.599999999999},{"$f":"OFFSET(Balance!E63,0,($O$1-1)*12)","v":"-"},{"$f":"OFFSET(Balance!F63,0,($O$1-1)*12)","v":"-"},{"$f":"OFFSET(Balance!G63,0,($O$1-1)*12)","v":"-"},{"$f":"OFFSET(Balance!H63,0,($O$1-1)*12)","v":"-"},{"$f":"OFFSET(Balance!I63,0,($O$1-1)*12)","v":"-"},{"$f":"OFFSET(Balance!J63,0,($O$1-1)*12)","v":"-"},{"$f":"OFFSET(Balance!K63,0,($O$1-1)*12)","v":"-"},{"$f":"OFFSET(Balance!L63,0,($O$1-1)*12)","v":"-"},{"$f":"OFFSET(Balance!M63,0,($O$1-1)*12)","v":"-"},{"$f":"OFFSET(Balance!N63,0,($O$1-1)*12)","v":"-"},{"$f":"SUM(O10:O11)","v":35115.67}]
[null,"Régimen ordinario",{"$f":"OFFSET(Balance!C64,0,($O$1-1)*12)","v":"-"},{"$f":"OFFSET(Balance!D64,0,($O$1-1)*12)","v":"-"},{"$f":"OFFSET(Balance!E64,0,($O$1-1)*12)","v":"-"},{"$f":"OFFSET(Balance!F64,0,($O$1-1)*12)","v":"-"},{"$f":"OFFSET(Balance!G64,0,($O$1-1)*12)","v":"-"},{"$f":"OFFSET(Balance!H64,0,($O$1-1)*12)","v":"-"},{"$f":"OFFSET(Balance!I64,0,($O$1-1)*12)","v":"-"},{"$f":"OFFSET(Balance!J64,0,($O$1-1)*12)","v":"-"},{"$f":"OFFSET(Balance!K64,0,($O$1-1)*12)","v":"-"},{"$f":"OFFSET(Balance!L64,0,($O$1-1)*12)","v":"-"},{"$f":"OFFSET(Balance!M64,0,($O$1-1)*12)","v":"-"},{"$f":"OFFSET(Balance!N64,0,($O$1-1)*12)","v":"-"},{"$f":"SUM(O12)","v":35115.67}]
[]
[null,"Generación",{"$f":"OFFSET(Balance!C65,0,($O$1-1)*12)","v":18540.07},{"$f":"OFFSET(Balance!D65,0,($O$1-1)*12)","v":16575.599999999999},{"$f":"OFFSET(Balance!E65,0,($O$1-1)*12)","v":"-"},{"$f":"OFFSET(Balance!F65,0,($O$1-1)*12)","v":"-"},{"$f":"OFFSET(Balance!G65,0,($O$1-1)*12)","v":"-"},{"$f":"OFFSET(Balance!H65,0,($O$1-1)*12)","v":"-"},{"$f":"OFFSET(Balance!I65,0,($O$1-1)*12)","v":"-"},{"$f":"OFFSET(Balance!J65,0,($O$1-1)*12)","v":"-"},{"$f":"OFFSET(Balance!K65,0,($O$1-1)*12)","v":"-"},{"$f":"OFFSET(Balance!L65,0,($O$1-1)*12)","v":"-"},{"$f":"OFFSET(Balance!M65,0,($O$1-1)*12)","v":"-"},{"$f":"OFFSET(Balance!N65,0,($O$1-1)*12)","v":"-"},{"$f":"SUM(O13:O14)","v":35115.67}]
[null,"Demanda transporte (b.c.)",{"$f":"OFFSET(Balance!C66,0,($O$1-1)*12)","v":18540.07},{"$f":"OFFSET(Balance!D66,0,($O$1-1)*12)","v":16575.599999999999},{"$f":"OFFSET(Balance!E66,0,($O$1-1)*12)","v":"-"},{"$f":"OFFSET(Balance!F66,0,($O$1-1)*12)","v":"-"},{"$f":"OFFSET(Balance!G66,0,($O$1-1)*12)","v":"-"},{"$f":"OFFSET(Balance!H66,0,($O$1-1)*12)","v":"-"},{"$f":"OFFSET(Balance!I66,0,($O$1-1)*12)","v":"-"},{"$f":"OFFSET(Balance!J66,0,($O$1-1)*12)","v":"-"},{"$f":"OFFSET(Balance!K66,0,($O$1-1)*12)","v":"-"},{"$f":"OFFSET(Balance!L66,0,($O$1-1)*12)","v":"-"},{"$f":"OFFSET(Balance!M66,0,($O$1-1)*12)","v":"-"},{"$f":"OFFSET(Balance!N66,0,($O$1-1)*12)","v":"-"},{"$f":"O15","v":35115.67}]
[null,"(1) Asignación de unidades de producción según combustible principal."]
[null,{"$f":"'Balance nacional mensual'!B36","v":"Datos definitivos hasta el 31/12/2015. Datos provisionales del 01/01/2016 al 31/01/2017. Datos programados del 01/02/2017 al 28/02/2017."}]

{"sheet":"Balance Ceuta anual","index":10,"n_rows":19,"n_cols":9,"rows_kept":19,"cut":false,"hidden":false,"merged":[[16,1,16,11],[28,1,28,14]]}
[null,null,null,null,null,null,null,null,2]
[]
[]
[null,null,null,null,null,null,null,"Sistema eléctrico"]
[null,null,null,null,null,null,null,"Horizonte temporal"]
[null,null,null,null,null,null,null,"Periodo"]
[]
[null,null,{"$f":"OFFSET(Balance!C159,0,($I$1-1)*7)","v":2014},{"$f":"OFFSET(Balance!D159,0,($I$1-1)*7)","v":2015},{"$f":"OFFSET(Balance!E159,0,($I$1-1)*7)","v":2016},{"$f":"OFFSET(Balance!F159,0,($I$1-1)*7)","v":2017},{"$f":"OFFSET(Balance!G159,0,($I$1-1)*7)","v":2018},{"$f":"OFFSET(Balance!H159,0,($I$1-1)*7)","v":2019},{"$f":"OFFSET(Balance!I159,0,($I$1-1)*7)","v":2020}]
[]
[null,"Motores diesel",{"$f":"OFFSET(Balance!C160,0,($I$1-1)*7)","v":212164.56700000004},{"$f":"OFFSET(Balance!D160,0,($I$1-1)*7)","v":204715.61900000001},{"$f":"OFFSET(Balance!E160,0,($I$1-1)*7)","v":210611.989},{"$f":"OFFSET(Balance!F160,0,($I$1-1)*7)","v":35112.434000000001},{"$f":"OFFSET(Balance!G160,0,($I$1-1)*7)","v":"-"},{"$f":"OFFSET(Balance!H160,0,($I$1-1)*7)","v":"-"},{"$f":"OFFSET(Balance!I160,0,($I$1-1)*7)","v":"-"}]
[null,"Turbina de gas",{"$f":"OFFSET(Balance!C161,0,($I$1-1)*7)","v":89.154999999999973},{"$f":"OFFSET(Balance!D161,0,($I$1-1)*7)","v":723.98099999999999},{"$f":"OFFSET(Balance!E161,0,($I$1-1)*7)","v":116.15799999999999},{"$f":"OFFSET(Balance!F161,0,($I$1-1)*7)","v":3.2359999999999998},{"$f":"OFFSET(Balance!G161,0,($I$1-1)*7)","v":"-"},{"$f":"OFFSET(Balance!H161,0,($I$1-1)*7)","v":"-"},{"$f":"OFFSET(Balance!I161,0,($I$1-1)*7)","v":"-"}]
[null,"Fuel + Gas",{"$f":"OFFSET(Balance!C162,0,($I$1-1)*7)","v":212253.72200000004},{"$f":"OFFSET(Balance!D162,0,($I$1-1)*7)","v":205439.6},{"$f":"OFFSET(Balance!E162,0,($I$1-1)*7)","v":210728.147},{"$f":"OFFSET(Balance!F162,0,($I$1-1)*7)","v":35115.67},{"$f":"OFFSET(Balance!G162,0,($I$1-1)*7)","v":"-"},{"$f":"OFFSET(Balance!H162,0,($I$1-1)*7)","v":"-"},{"$f":"OFFSET(Balance!I162,0,($I$1-1)*7)","v":"-"}]
[null,"Régimen ordinario",{"$f":"OFFSET(Balance!C163,0,($I$1-1)*7)","v":212253.72200000004},{"$f":"OFFSET(Balance!D163,0,($I$1-1)*7)","v":"-"},{"$f":"OFFSET(Balance!E163,0,($I$1-1)*7)","v":"-"},{"$f":"OFFSET(Balance!F163,0,($I$1-1)*7)","v":"-"},{"$f":"OFFSET(Balance!G163,0,($I$1-1)*7)","v":"-"},{"$f":"OFFSET(Balance!H163,0,($I$1-1)*7)","v":"-"},{"$f":"OFFSET(Balance!I163,0,($I$1-1)*7)","v":"-"}]
[]
[null,"Generación",{"$f":"OFFSET(Balance!C164,0,($I$1-1)*7)","v":212253.72200000004},{"$f":"OFFSET(Balance!D164,0,($I$1-1)*7)","v":205439.6},{"$f":"OFFSET(Balance!E164,0,($I$1-1)*7)","v":210728.147},{"$f":"OFFSET(Balance!F164,0,($I$1-1)*7)","v":35115.67},{"$f":"OFFSET(Balance!G164,0,($I$1-1)*7)","v":"-"},{"$f":"OFFSET(Balance!H164,0,($I$1-1)*7)","v":"-"},{"$f":"OFFSET(Balance!I164,0,($I$1-1)*7)","v":"-"}]
[null,"Demanda transporte (b.c.)",{"$f":"OFFSET(Balance!C165,0,($I$1-1)*7)","v":212253.72200000004},{"$f":"OFFSET(Balance!D165,0,($I$1-1)*7)","v":205439.6},{"$f":"OFFSET(Balance!E165,0,($I$1-1)*7)","v":210728.147},{"$f":"OFFSET(Balance!F165,0,($I$1-1)*7)","v":35115.67},{"$f":"OFFSET(Balance!G165,0,($I$1-1)*7)","v":"-"},{"$f":"OFFSET(Balance!H165,0,($I$1-1)*7)","v":"-"},{"$f":"OFFSET(Balance!I165,0,($I$1-1)*7)","v":"-"}]
[null,"(1) Asignación de unidades de producción según combustible principal."]
[null,{"$f":"IF(MONTH(FACT)=1,\"\",CONCATENATE(\"Para el año \",YEAR(FACT), \" valores acumulados hasta \",TEXT(FACT-30,\"mmmm\"),\" de \",YEAR(FACT),\".\"))","v":"Para el año 2017 valores acumulados hasta febrero de 2017."}]
[null,{"$f":"'Balance nacional mensual'!B36","v":"Datos definitivos hasta el 31/12/2015. Datos provisionales del 01/01/2016 al 31/01/2017. Datos programados del 01/02/2017 al 28/02/2017."}]

{"sheet":"Balance Melilla mensual","index":11,"n_rows":22,"n_cols":15,"rows_kept":22,"cut":false,"hidden":false,"merged":[[20,1,20,14],[21,1,21,14]]}
[null,null,null,null,null,null,null,null,null,null,null,null,null,null,11]
[]
[]
[null,null,null,null,null,null,null,null,null,null,null,null,"Sistema eléctrico"]
[null,null,null,null,null,null,null,null,null,null,null,null,"Horizonte temporal"]
[null,null,null,null,null,null,null,null,null,null,null,null,"Periodo"]
[]
[null,null,"Ene.","Feb.","Mar.","Abr.","May.","Jun.","Jul.","Ago.","Sep.","Oct.","Nov.","Dic.",{"$f":"OFFSET(Año!C19,($O$1-1),0)","v":2017}]
[]
[null,"Motores diesel",{"$f":"OFFSET(Balance!C69,0,($O$1-1)*12)","v":17669.7},{"$f":"OFFSET(Balance!D69,0,($O$1-1)*12)","v":16077.652},{"$f":"OFFSET(Balance!E69,0,($O$1-1)*12)","v":"-"},{"$f":"OFFSET(Balance!F69,0,($O$1-1)*12)","v":"-"},{"$f":"OFFSET(Balance!G69,0,($O$1-1)*12)","v":"-"},{"$f":"OFFSET(Balance!H69,0,($O$1-1)*12)","v":"-"},{"$f":"OFFSET(Balance!I69,0,($O$1-1)*12)","v":"-"},{"$f":"OFFSET(Balance!J69,0,($O$1-1)*12)","v":"-"},{"$f":"OFFSET(Balance!K69,0,($O$1-1)*12)","v":"-"},{"$f":"OFFSET(Balance!L69,0,($O$1-1)*12)","v":"-"},{"$f":"OFFSET(Balance!M69,0,($O$1-1)*12)","v":"-"},{"$f":"OFFSET(Balance!N69,0,($O$1-1)*12)","v":"-"},{"$f":"IF(SUM(C10:N10)=0,\"-\",SUM(C10:N10))","v":33747.351999999999}]
[null,"Turbina de gas",{"$f":"OFFSET(Balance!C70,0,($O$1-1)*12)","v":0},{"$f":"OFFSET(Balance!D70,0,($O$1-1)*12)","v":3.05},{"$f":"OFFSET(Balance!E70,0,($O$1-1)*12)","v":"-"},{"$f":"OFFSET(Balance!F70,0,($O$1-1)*12)","v":"-"},{"$f":"OFFSET(Balance!G70,0,($O$1-1)*12)","v":"-"},{"$f":"OFFSET(Balance!H70,0,($O$1-1)*12)","v":"-"},{"$f":"OFFSET(Balance!I70,0,($O$1-1)*12)","v":"-"},{"$f":"OFFSET(Balance!J70,0,($O$1-1)*12)","v":"-"},{"$f":"OFFSET(Balance!K70,0,($O$1-1)*12)","v":"-"},{"$f":"OFFSET(Balance!L70,0,($O$1-1)*12)","v":"-"},{"$f":"OFFSET(Balance!M70,0,($O$1-1)*12)","v":"-"},{"$f":"OFFSET(Balance!N70,0,($O$1-1)*12)","v":"-"},{"$f":"IF(SUM(C11:N11)=0,\"-\",SUM(C11:N11))","v":3.05}]
[null,"Fuel + Gas",{"$f":"OFFSET(Balance!C71,0,($O$1-1)*12)","v":17669.7},{"$f":"OFFSET(Balance!D71,0,($O$1-1)*12)","v":16080.701999999999},{"$f":"OFFSET(Balance!E71,0,($O$1-1)*12)","v":"-"},{"$f":"OFFSET(Balance!F71,0,($O$1-1)*12)","v":"-"},{"$f":"OFFSET(Balance!G71,0,($O$1-1)*12)","v":"-"},{"$f":"OFFSET(Balance!H71,0,($O$1-1)*12)","v":"-"},{"$f":"OFFSET(Balance!I71,0,($O$1-1)*12)","v":"-"},{"$f":"OFFSET(Balance!J71,0,($O$1-1)*12)","v":"-"},{"$f":"OFFSET(Balance!K71,0,($O$1-1)*12)","v":"-"},{"$f":"OFFSET(Balance!L71,0,($O$1-1)*12)","v":"-"},{"$f":"OFFSET(Balance!M71,0,($O$1-1)*12)","v":"-"},{"$f":"OFFSET(Balance!N71,0,($O$1-1)*12)","v":"-"},{"$f":"SUM(O10:O11)","v":33750.402000000002}]
[null,"Régimen ordinario",{"$f":"OFFSET(Balance!C72,0,($O$1-1)*12)","v":"-"},{"$f":"OFFSET(Balance!D72,0,($O$1-1)*12)","v":"-"},{"$f":"OFFSET(Balance!E72,0,($O$1-1)*12)","v":"-"},{"$f":"OFFSET(Balance!F72,0,($O$1-1)*12)","v":"-"},{"$f":"OFFSET(Balance!G72,0,($O$1-1)*12)","v":"-"},{"$f":"OFFSET(Balance!H72,0,($O$1-1)*12)","v":"-"},{"$f":"OFFSET(Balance!I72,0,($O$1-1)*12)","v":"-"},{"$f":"OFFSET(Balance!J72,0,($O$1-1)*12)","v":"-"},{"$f":"OFFSET(Balance!K72,0,($O$1-1)*12)","v":"-"},{"$f":"OFFSET(Balance!L72,0,($O$1-1)*12)","v":"-"},{"$f":"OFFSET(Balance!M72,0,($O$1-1)*12)","v":"-"},{"$f":"OFFSET(Balance!N72,0,($O$1-1)*12)","v":"-"},{"$f":"SUM(O12)","v":33750.402000000002}]
[]
[null,"Solar fotovoltaica",{"$f":"OFFSET(Balance!C73,0,($O$1-1)*12)","v":5},{"$f":"OFFSET(Balance!D73,0,($O$1-1)*12)","v":0},{"$f":"OFFSET(Balance!E73,0,($O$1-1)*12)","v":"-"},{"$f":"OFFSET(Balance!F73,0,($O$1-1)*12)","v":"-"},{"$f":"OFFSET(Balance!G73,0,($O$1-1)*12)","v":"-"},{"$f":"OFFSET(Balance!H73,0,($O$1-1)*12)","v":"-"},{"$f":"OFFSET(Balance!I73,0,($O$1-1)*12)","v":"-"},{"$f":"OFFSET(Balance!J73,0,($O$1-1)*12)","v":"-"},{"$f":"OFFSET(Balance!K73,0,($O$1-1)*12)","v":"-"},{"$f":"OFFSET(Balance!L73,0,($O$1-1)*12)","v":"-"},{"$f":"OFFSET(Balance!M73,0,($O$1-1)*12)","v":"-"},{"$f":"OFFSET(Balance!N73,0,($O$1-1)*12)","v":"-"},{"$f":"IF(SUM(C15:N15)=0,\"-\",SUM(C15:N15))","v":5}]
[null,"Térmica no renovable",{"$f":"OFFSET(Balance!C74,0,($O$1-1)*12)","v":0},{"$f":"OFFSET(Balance!D74,0,($O$1-1)*12)","v":0},{"$f":"OFFSET(Balance!E74,0,($O$1-1)*12)","v":"-"},{"$f":"OFFSET(Balance!F74,0,($O$1-1)*12)","v":"-"},{"$f":"OFFSET(Balance!G74,0,($O$1-1)*12)","v":"-"},{"$f":"OFFSET(Balance!H74,0,($O$1-1)*12)","v":"-"},{"$f":"OFFSET(Balance!I74,0,($O$1-1)*12)","v":"-"},{"$f":"OFFSET(Balance!J74,0,($O$1-1)*12)","v":"-"},{"$f":"OFFSET(Balance!K74,0,($O$1-1)*12)","v":"-"},{"$f":"OFFSET(Balance!L74,0,($O$1-1)*12)","v":"-"},{"$f":"OFFSET(Balance!M74,0,($O$1-1)*12)","v":"-"},{"$f":"OFFSET(Balance!N74,0,($O$1-1)*12)","v":"-"},{"$f":"IF(SUM(C16:N16)=0,\"-\",SUM(C16:N16))","v":"-"}]
[null,"Residuos",{"$f":"OFFSET(Balance!C75,0,($O$1-1)*12)","v":904},{"$f":"OFFSET(Balance!D75,0,($O$1-1)*12)","v":728.00699999999995},{"$f":"OFFSET(Balance!E75,0,($O$1-1)*12)","v":"-"},{"$f":"OFFSET(Balance!F75,0,($O$1-1)*12)","v":"-"},{"$f":"OFFSET(Balance!G75,0,($O$1-1)*12)","v":"-"},{"$f":"OFFSET(Balance!H75,0,($O$1-1)*12)","v":"-"},{"$f":"OFFSET(Balance!I75,0,($O$1-1)*12)","v":"-"},{"$f":"OFFSET(Balance!J75,0,($O$1-1)*12)","v":"-"},{"$f":"OFFSET(Balance!K75,0,($O$1-1)*12)","v":"-"},{"$f":"OFFSET(Balance!L75,0,($O$1-1)*12)","v":"-"},{"$f":"OFFSET(Balance!M75,0,($O$1-1)*12)","v":"-"},{"$f":"OFFSET(Balance!N75,0,($O$1-1)*12)","v":"-"},{"$f":"IF(SUM(C17:N17)=0,\"-\",SUM(C17:N17))","v":1632.0070000000001}]
[null,"Régimen especial",{"$f":"OFFSET(Balance!C76,0,($O$1-1)*12)","v":"-"},{"$f":"OFFSET(Balance!D76,0,($O$1-1)*12)","v":"-"},{"$f":"OFFSET(Balance!E76,0,($O$1-1)*12)","v":"-"},{"$f":"OFFSET(Balance!F76,0,($O$1-1)*12)","v":"-"},{"$f":"OFFSET(Balance!G76,0,($O$1-1)*12)","v":"-"},{"$f":"OFFSET(Balance!H76,0,($O$1-1)*12)","v":"-"},{"$f":"OFFSET(Balance!I76,0,($O$1-1)*12)","v":"-"},{"$f":"OFFSET(Balance!J76,0,($O$1-1)*12)","v":"-"},{"$f":"OFFSET(Balance!K76,0,($O$1-1)*12)","v":"-"},{"$f":"OFFSET(Balance!L76,0,($O$1-1)*12)","v":"-"},{"$f":"OFFSET(Balance!M76,0,($O$1-1)*12)","v":"-"},{"$f":"OFFSET(Balance!N76,0,($O$1-1)*12)","v":"-"},{"$f":"SUM(O15:O17)","v":1637.0070000000001}]
[null,"Generación",{"$f":"OFFSET(Balance!C77,0,($O$1-1)*12)","v":18578.7},{"$f":"OFFSET(Balance!D77,0,($O$1-1)*12)","v":16808.708999999999},{"$f":"OFFSET(Balance!E77,0,($O$1-1)*12)","v":"-"},{"$f":"OFFSET(Balance!F77,0,($O$1-1)*12)","v":"-"},{"$f":"OFFSET(Balance!G77,0,($O$1-1)*12)","v":"-"},{"$f":"OFFSET(Balance!H77,0,($O$1-1)*12)","v":"-"},{"$f":"OFFSET(Balance!I77,0,($O$1-1)*12)","v":"-"},{"$f":"OFFSET(Balance!J77,0,($O$1-1)*12)","v":"-"},{"$f":"OFFSET(Balance!K77,0,($O$1-1)*12)","v":"-"},{"$f":"OFFSET(Balance!L77,0,($O$1-1)*12)","v":"-"},{"$f":"OFFSET(Balance!M77,0,($O$1-1)*12)","v":"-"},{"$f":"OFFSET(Balance!N77,0,($O$1-1)*12)","v":"-"},{"$f":"SUM(O13:O14,O18)","v":35387.409}]
[null,"Demanda transporte (b.c.)",{"$f":"OFFSET(Balance!C78,0,($O$1-1)*12)","v":18578.7},{"$f":"OFFSET(Balance!D78,0,($O$1-1)*12)","v":16808.708999999999},{"$f":"OFFSET(Balance!E78,0,($O$1-1)*12)","v":"-"},{"$f":"OFFSET(Balance!F78,0,($O$1-1)*12)","v":"-"},{"$f":"OFFSET(Balance!G78,0,($O$1-1)*12)","v":"-"},{"$f":"OFFSET(Balance!H78,0,($O$1-1)*12)","v":"-"},{"$f":"OFFSET(Balance!I78,0,($O$1-1)*12)","v":"-"},{"$f":"OFFSET(Balance!J78,0,($O$1-1)*12)","v":"-"},{"$f":"OFFSET(Balance!K78,0,($O$1-1)*12)","v":"-"},{"$f":"OFFSET(Balance!L78,0,($O$1-1)*12)","v":"-"},{"$f":"OFFSET(Balance!M78,0,($O$1-1)*12)","v":"-"},{"$f":"OFFSET(Balance!N78,0,($O$1-1)*12)","v":"-"},{"$f":"O19","v":35387.409}]
[null,"(1) Asignación de unidades de producción según combustible principal."]
[null,{"$f":"'Balance nacional mensual'!B36","v":"Datos definitivos hasta el 31/12/2015. Datos provisionales del 01/01/2016 al 31/01/2017. Datos programados del 01/02/2017 al 28/02/2017."}]

{"sheet":"Balance Melilla anual","index":12,"n_rows":24,"n_cols":9,"rows_kept":24,"cut":false,"hidden":false,"merged":[[20,1,20,11],[21,1,21,11]]}
[null,null,null,null,null,null,null,null,2]
[]
[]
[null,null,null,null,null,null,null,"Sistema eléctrico"]
[null,null,null,null,null,null,null,"Horizonte temporal"]
[null,null,null,null,null,null,null,"Periodo"]
[]
[null,null,{"$f":"OFFSET(Balance!C167,0,($I$1-1)*7)","v":2014},{"$f":"OFFSET(Balance!D167,0,($I$1-1)*7)","v":2015},{"$f":"OFFSET(Balance!E167,0,($I$1-1)*7)","v":2016},{"$f":"OFFSET(Balance!F167,0,($I$1-1)*7)","v":2017},{"$f":"OFFSET(Balance!G167,0,($I$1-1)*7)","v":2018},{"$f":"OFFSET(Balance!H167,0,($I$1-1)*7)","v":2019},{"$f":"OFFSET(Balance!I167,0,($I$1-1)*7)","v":2020}]
[]
[null,"Motores diesel",{"$f":"OFFSET(Balance!C168,0,($I$1-1)*7)","v":200163.61000000002},{"$f":"OFFSET(Balance!D168,0,($I$1-1)*7)","v":204228.133},{"$f":"OFFSET(Balance!E168,0,($I$1-1)*7)","v":198326.31299999997},{"$f":"OFFSET(Balance!F168,0,($I$1-1)*7)","v":33747.351999999999},{"$f":"OFFSET(Balance!G168,0,($I$1-1)*7)","v":"-"},{"$f":"OFFSET(Balance!H168,0,($I$1-1)*7)","v":"-"},{"$f":"OFFSET(Balance!I168,0,($I$1-1)*7)","v":"-"}]
[null,"Turbina de gas",{"$f":"OFFSET(Balance!C169,0,($I$1-1)*7)","v":724.20299999999997},{"$f":"OFFSET(Balance!D169,0,($I$1-1)*7)","v":587.85799999999995},{"$f":"OFFSET(Balance!E169,0,($I$1-1)*7)","v":241.53300000000002},{"$f":"OFFSET(Balance!F169,0,($I$1-1)*7)","v":3.05},{"$f":"OFFSET(Balance!G169,0,($I$1-1)*7)","v":"-"},{"$f":"OFFSET(Balance!H169,0,($I$1-1)*7)","v":"-"},{"$f":"OFFSET(Balance!I169,0,($I$1-1)*7)","v":"-"}]
[null,"Fuel + Gas",{"$f":"OFFSET(Balance!C170,0,($I$1-1)*7)","v":200887.81300000002},{"$f":"OFFSET(Balance!D170,0,($I$1-1)*7)","v":204815.99100000004},{"$f":"OFFSET(Balance!E170,0,($I$1-1)*7)","v":198567.84600000002},{"$f":"OFFSET(Balance!F170,0,($I$1-1)*7)","v":33750.402000000002},{"$f":"OFFSET(Balance!G170,0,($I$1-1)*7)","v":"-"},{"$f":"OFFSET(Balance!H170,0,($I$1-1)*7)","v":"-"},{"$f":"OFFSET(Balance!I170,0,($I$1-1)*7)","v":"-"}]
[null,"Régimen ordinario",{"$f":"OFFSET(Balance!C171,0,($I$1-1)*7)","v":"-"},{"$f":"OFFSET(Balance!D171,0,($I$1-1)*7)","v":"-"},{"$f":"OFFSET(Balance!E171,0,($I$1-1)*7)","v":"-"},{"$f":"OFFSET(Balance!F171,0,($I$1-1)*7)","v":"-"},{"$f":"OFFSET(Balance!G171,0,($I$1-1)*7)","v":"-"},{"$f":"OFFSET(Balance!H171,0,($I$1-1)*7)","v":"-"},{"$f":"OFFSET(Balance!I171,0,($I$1-1)*7)","v":"-"}]
[]
[null,"Solar fotovoltaica",{"$f":"OFFSET(Balance!C172,0,($I$1-1)*7)","v":85},{"$f":"OFFSET(Balance!D172,0,($I$1-1)*7)","v":78},{"$f":"OFFSET(Balance!E172,0,($I$1-1)*7)","v":81},{"$f":"OFFSET(Balance!F172,0,($I$1-1)*7)","v":5},{"$f":"OFFSET(Balance!G172,0,($I$1-1)*7)","v":"-"},{"$f":"OFFSET(Balance!H172,0,($I$1-1)*7)","v":"-"},{"$f":"OFFSET(Balance!I172,0,($I$1-1)*7)","v":"-"}]
[null,"Cogeneración y resto (2)",{"$f":"OFFSET(Balance!C173,0,($I$1-1)*7)","v":8898},{"$f":"OFFSET(Balance!D173,0,($I$1-1)*7)","v":"-"},{"$f":"OFFSET(Balance!E173,0,($I$1-1)*7)","v":"-"},{"$f":"OFFSET(Balance!F173,0,($I$1-1)*7)","v":"-"},{"$f":"OFFSET(Balance!G173,0,($I$1-1)*7)","v":"-"},{"$f":"OFFSET(Balance!H173,0,($I$1-1)*7)","v":"-"},{"$f":"OFFSET(Balance!I173,0,($I$1-1)*7)","v":"-"}]
[null,"Residuos",{"$f":"OFFSET(Balance!C174,0,($I$1-1)*7)","v":"-"},{"$f":"OFFSET(Balance!D174,0,($I$1-1)*7)","v":8591},{"$f":"OFFSET(Balance!E174,0,($I$1-1)*7)","v":9699},{"$f":"OFFSET(Balance!F174,0,($I$1-1)*7)","v":1632.0070000000001},{"$f":"OFFSET(Balance!G174,0,($I$1-1)*7)","v":"-"},{"$f":"OFFSET(Balance!H174,0,($I$1-1)*7)","v":"-"},{"$f":"OFFSET(Balance!I174,0,($I$1-1)*7)","v":"-"}]
[null,"Régimen especial",{"$f":"OFFSET(Balance!C175,0,($I$1-1)*7)","v":"-"},{"$f":"OFFSET(Balance!D175,0,($I$1-1)*7)","v":"-"},{"$f":"OFFSET(Balance!E175,0,($I$1-1)*7)","v":"-"},{"$f":"OFFSET(Balance!F175,0,($I$1-1)*7)","v":"-"},{"$f":"OFFSET(Balance!G175,0,($I$1-1)*7)","v":"-"},{"$f":"OFFSET(Balance!H175,0,($I$1-1)*7)","v":"-"},{"$f":"OFFSET(Balance!I175,0,($I$1-1)*7)","v":"-"}]
[null,"Generación",{"$f":"OFFSET(Balance!C176,0,($I$1-1)*7)","v":209870.81300000002},{"$f":"OFFSET(Balance!D176,0,($I$1-1)*7)","v":213484.99100000004},{"$f":"OFFSET(Balance!E176,0,($I$1-1)*7)","v":208347.84600000002},{"$f":"OFFSET(Balance!F176,0,($I$1-1)*7)","v":35387.409},{"$f":"OFFSET(Balance!G176,0,($I$1-1)*7)","v":"-"},{"$f":"OFFSET(Balance!H176,0,($I$1-1)*7)","v":"-"},{"$f":"OFFSET(Balance!I176,0,($I$1-1)*7)","v":"-"}]
[null,"Demanda transporte (b.c.)",{"$f":"OFFSET(Balance!C177,0,($I$1-1)*7)","v":209870.81300000002},{"$f":"OFFSET(Balance!D177,0,($I$1-1)*7)","v":213484.99100000004},{"$f":"OFFSET(Balance!E177,0,($I$1-1)*7)","v":208347.84600000002},{"$f":"OFFSET(Balance!F177,0,($I$1-1)*7)","v":35387.409},{"$f":"OFFSET(Balance!G177,0,($I$1-1)*7)","v":"-"},{"$f":"OFFSET(Balance!H177,0,($I$1-1)*7)","v":"-"},{"$f":"OFFSET(Balance!I177,0,($I$1-1)*7)","v":"-"}]
[null,"(1) Asignación de unidades de producción según combustible principal."]
[null,"(2) Incluye residuos."]
[null,{"$f":"IF(MONTH(FACT)=1,\"\",CONCATENATE(\"Para el año \",YEAR(FACT), \" valores acumulados hasta \",TEXT(FACT-30,\"mmmm\"),\" de \",YEAR(FACT),\".\"))","v":"Para el año 2017 valores acumulados hasta febrero de 2017."}]
[null,{"$f":"'Balance nacional mensual'!B36","v":"Datos definitivos hasta el 31/12/2015. Datos provisionales del 01/01/2016 al 31/01/2017. Datos programados del 01/02/2017 al 28/02/2017."}]

{"sheet":"Balance","index":13,"n_rows":198,"n_cols":338,"rows_kept":198,"cut":false,"hidden":true,"merged":[]}
[]
[null,"Balance eléctrico mensual peninsular (GWh)","1990-01-01","1990-02-01","1990-03-01","1990-04-01","1990-05-01","1990-06-01","1990-07-01","1990-08-01","1990-09-01","1990-10-01","1990-11-01","1990-12-01","1991-01-01","1991-02-01","1991-03-01","1991-04-01","1991-05-01","1991-06-01","1991-07-01","1991-08-01","1991-09-01","1991-10-01","1991-11-01","1991-12-01","1992-01-01","1992-02-01","1992-03-01","1992-04-01","1992-05-01","1992-06-01","1992-07-01","1992-08-01","1992-09-01","1992-10-01","1992-11-01","1992-12-01","1993-01-01","1993-02-01","1993-03-01","1993-04-01","1993-05-01","1993-06-01","1993-07-01","1993-08-01","1993-09-01","1993-10-01","1993-11-01","1993-12-01","1994-01-01","1994-02-01","1994-03-01","1994-04-01","1994-05-01","1994-06-01","1994-07-01","1994-08-01","1994-09-01","1994-10-01","1994-11-01","1994-12-01","1995-01-01","1995-02-01","1995-03-01","1995-04-01","1995-05-01","1995-06-01","1995-07-01","1995-08-01","1995-09-01","1995-10-01","1995-11-01","1995-12-01","1996-01-01","1996-02-01","1996-03-01","1996-04-01","1996-05-01","1996-06-01","1996-07-01","1996-08-01","1996-09-01","1996-10-01","1996-11-01","1996-12-01","1997-01-01","1997-02-01","1997-03-01","1997-04-01","1997-05-01","1997-06-01","1997-07-01","1997-08-01","1997-09-01","1997-10-01","1997-11-01","1997-12-01","1998-01-01","1998-02-01","1998-03-01","1998-04-01","1998-05-01","1998-06-01","1998-07-01","1998-08-01","1998-09-01","1998-10-01","1998-11-01","1998-12-01","1999-01-01","1999-02-01","1999-03-01","1999-04-01","1999-05-01","1999-06-01","1999-07-01","1999-08-01","1999-09-01","1999-10-01","1999-11-01","1999-12-01","2000-01-01","2000-02-01","2000-03-01","2000-04-01","2000-05-01","2000-06-01","2000-07-01","2000-08-01","2000-09-01","2000-10-01","2000-11-01","2000-12-01","2001-01-01","2001-02-01","2001-03-01","2001-04-01","2001-05-01","2001-06-01","2001-07-01","2001-08-01","2001-09-01","2001-10-01","2001-11-01","2001-12-01","2002-01-01","2002-02-01","2002-03-01","2002-04-01","2002-05-01","2002-06-01","2002-07-01","2002-08-01","2002-09-01","2002-10-01","2002-11-01","2002-12-01","2003-01-01","2003-02-01","2003-03-01","2003-04-01","2003-05-01","2003-06-01","2003-07-01","2003-08-01","2003-09-01","2003-10-01","2003-11-01","2003-12-01","2004-01-01","2004-02-01","2004-03-01","2004-04-01","2004-05-01","2004-06-01","2004-07-01","2004-08-01","2004-09-01","2004-10-01","2004-11-01","2004-12-01","2005-01-01","2005-02-01","2005-03-01","2005-04-01","2005-05-01","2005-06-01","2005-07-01","2005-08-01","2005-09-01","2005-10-01","2005-11-01","2005-12-01","2006-01-01","2006-02-01","2006-03-01","2006-04-01","2006-05-01","2006-06-01","2006-07-01","2006-08-01","2006-09-01","2006-10-01","2006-11-01","2006-12-01","2007-01-01","2007-02-01","2007-03-01","2007-04-01","2007-05-01","2007-06-01","2007-07-01","2007-08-01","2007-09-01","2007-10-01","2007-11-01","2007-12-01","2008-01-01","2008-02-01","2008-03-01","2008-04-01","2008-05-01","2008-06-01","2008-07-01","2008-08-01","2008-09-01","2008-10-01","2008-11-01","2008-12-01","2009-01-01","2009-02-01","2009-03-01","2009-04-01","2009-05-01","2009-06-01","2009-07-01","2009-08-01","2009-09-01","2009-10-01","2009-11-01","2009-12-01","2010-01-01","2010-02-01","2010-03-01","2010-04-01","2010-05-01","2010-06-01","2010-07-01","2010-08-01","2010-09-01","2010-10-01","2010-11-01","2010-12-01","2011-01-01","2011-02-01","2011-03-01","2011-04-01","2011-05-01","2011-06-01","2011-07-01","2011-08-01","2011-09-01","2011-10-01","2011-11-01","2011-12-01","2012-01-01","2012-02-01","2012-03-01","2012-04-01","2012-05-01","2012-06-01","2012-07-01","2012-08-01","2012-09-01","2012-10-01","2012-11-01","2012-12-01","2013-01-01","2013-02-01","2013-03-01","2013-04-01","2013-05-01","2013-06-01","2013-07-01","2013-08-01","2013-09-01","2013-10-01","2013-11-01","2013-12-01","2014-01-01","2014-02-01","2014-03-01","2014-04-01","2014-05-01","2014-06-01","2014-07-01","2014-08-01","2014-09-01","2014-10-01","2014-11-01","2014-12-01","2015-01-01","2015-02-01","2015-03-01","2015-04-01","2015-05-01","2015-06-01","2015-07-01","2015-08-01","2015-09-01","2015-10-01","2015-11-01","2015-12-01","2016-01-01","2016-02-01","2016-03-01","2016-04-01","2016-05-01","2016-06-01","2016-07-01","2016-08-01","2016-09-01","2016-10-01","2016-11-01","2016-12-01","2017-01-01","2017-02-01","2017-03-01","2017-04-01","2017-05-01","2017-06-01","2017-07-01","2017-08-01","2017-09-01","2017-10-01","2017-11-01","2017-12-01"]
[null,"Hidráulica",3974.1589999999987,3326.9329999999986,2397.8020000000006,1684.1939999999991,1783.342000000001,1749.0620000000001,1559.5409999999999,1204.8829999999989,1290.8220000000017,1445.9110000000016,1899.3520000000021,1952.2500000000009,2655.7059999999979,2072.4309999999991,3734.3850000000011,3325.2510000000007,2705.7699999999982,2002.8210000000017,1661.3660000000009,1105.9190000000006,1129.5980000000009,1513.2409999999982,1976.0459999999969,1848.3130000000015,1434.2610000000013,824.80000000000223,817.43799999999874,1599.1379999999995,1426.5150000000006,1557.5219999999993,1685.0389999999986,1213.5920000000031,1295.3079999999984,1857.6840000000013,2092.349999999999,2706.7139999999986,2061.8410000000017,1461.1310000000033,1416.1299999999969,1113.4039999999968,1788.2450000000003,2092.2230000000009,1829.9840000000011,1274.2399999999989,1240.1499999999985,2737.703,3287.509999999997,2533.2199999999984,3719.0349999999994,2958.9700000000003,2570.4169999999963,2204.3689999999997,2434.4159999999979,2289.0100000000029,1803.8829999999998,1260.1130000000003,1271.2020000000007,1508.1539999999979,2165.0380000000014,1765.8310000000033,2692.8730000000005,2498.9830000000024,3026.9959999999996,1834.0580000000039,1664.0039999999972,1701.644,1620.7639999999999,1097.0299999999988,932.24699999999814,1000.7960000000026,1221.331999999999,2405.5689999999995,5899.3670000000002,5345.5640000000003,3320.6999999999994,3451.0559999999973,3596.6740000000004,2768.454999999999,2179.5889999999977,1435.096,1670.1710000000003,1670.3960000000022,2076.945999999999,3976.5760000000018,5420.7130000000006,3238.1420000000016,2472.251999999999,2164.869999999999,2104.3910000000014,2215.9639999999981,1944.9600000000016,1697.0500000000011,1599.7359999999994,1463.2509999999988,3378.2800000000007,5214.2760000000007,5664.6379999999981,3832.9939999999983,2512.0070000000028,3292.7110000000002,3830.0530000000008,3255.2789999999991,2534.5939999999996,2111.219000000001,1834.7089999999996,1911.7470000000008,1491.9670000000006,1395.0450000000008,1440.0000000000011,1322.9730000000006,1835.7170000000015,2005.1809999999991,2660.2689999999998,2365.1179999999999,1913.6260000000011,1463.5789999999988,1580.462,1817.6249999999989,2701.5809999999992,2757.7170000000019,2516.7430000000027,1575.3350000000003,1542.8239999999998,2163.8189999999986,3296.3060000000019,2241.5160000000005,1719.1509999999989,1729.8320000000006,1860.9430000000013,1765.1860000000004,2453.2960000000007,4627.7039999999988,6220.2120000000004,5587.1200000000008,6369.9860000000008,4097.5119999999988,3117.5930000000017,2408.6530000000012,1997.3570000000011,1925.3750000000005,1577.5560000000014,1832.696999999999,2047.7470000000001,1814.654,1549.5830000000001,1273.0630000000001,1887.5840000000001,1843.163,1964.0340000000001,2035.0940000000001,1625.1479999999999,1244.876,1256.3530000000001,1340.712,2006.566,4169.3739999999998,5488.6,4227.9889999999996,4300.2389999999996,3543.0279999999998,3381.4029999999998,2300.3290000000002,1999.2470000000001,1588.4849999999999,1757.0540000000001,1975.174,3035.28,4686.2290000000003,3477.7319999999986,3164.1049999999977,2912.9520000000002,2719.4469999999997,3066.6800000000012,2645.58,2062.6949999999988,1769.5840000000014,1608.0640000000053,1787.5340000000026,2290.2569999999987,1839.1240000000009,1600.0759999999996,1550.3170000000023,1769.2090000000014,1949.4289999999992,2198.7059999999988,1970.2369999999976,1549.0210000000018,1250.8059999999975,1031.670999999998,976.93099999999822,1340.3149999999966,1693.7590000000005,1644.4779999999992,1240.4809999999979,2706.0779999999972,2435.2850000000017,1994.870000000001,1514.5970000000016,1639.8630000000028,1135.991,1292.6700000000005,1703.1939999999988,2967.6229999999978,4695.1159999999954,2180.2910000000002,2816.85,3681.2779999999998,2543.08,2606.62,2145.8719999999998,2385.9169999999999,1774.248,1432.069,1747.45,1421.001,1346.903,1354.557,1017.947,1055.817,2312.2390000000028,2901.1320000000001,2793.6149999999998,1979.105,1408.5820000000001,1259.7329999999999,1112.6410000000001,1480.5540000000001,2281.4679999999998,2097.9879999999998,3127.0059999999999,2431.4079999999999,1883.19,2181.9209999999998,1816.87,1561.7719999999999,1338.6790000000001,928.48599999999999,1227.0160000000001,1839.212,2954.6869999999999,4943.8859499999999,3839.0311169999995,5413.0431369999997,4242.06855,3370.5034819999996,3107.1967400000003,2576.5870980000004,1856.882582,1412.9943119999998,1524.8942180000001,2269.414636,3573.4001699999999,4736.5628710000001,2661.6892859999998,3413.7218309999998,3149.45552,2414.9504689999999,1754.2660740000001,1378.1070500000001,1346.7738899999999,1126.0635560000001,1274.6933589999999,1952.7332340000003,2016.8889999999999,1609.526934,1159.229,1252.6359339999999,1581.8849599999999,2116.5652480000003,1863.3216060000002,1529.5821759999999,1326.369134,1106.9148759999998,1403.075294,1852.2709339999999,2378.397978,2718.6579339999998,3206.1979780000001,4235.7799880000002,4914.1344440000003,3283.0264539999998,2759.058822,2359.4900980000002,1902.6690140000001,1663.8942159999999,1738.634822,2524.9989999999998,2270.638978,3919.5779440000001,5374.0318909999996,4837.8854680000004,4532.4247269999996,2487.6323629999997,2166.4078939999999,2042.0008519999999,1790.9552760000001,1600.810338,1538.6477809999999,2233.1350000000002,2935.3649999999998,2885.90931,3850.773737,4171.350821,2911.3911630000002,3188.9041050000001,2611.330989,2165.6107390000002,1837.4424960000001,1763.7736179999999,1896.156669,2164.2661699999999,1770.8802560000001,3895.5691609999999,4485.2321109999993,4713.8359069999997,5656.2206770000003,5401.2257499999996,3107.5607949999999,2361.2322389999999,2150.7522740000004,1754.888281,1793.7899140000002,1749.903509,2095.07501,2334.1325710000001,2167.2811000000002,"-","-","-","-","-","-","-","-","-","-"]
[null,"Nuclear",5193.2669999999998,4339.07,4257.0429999999997,4556.652,3888.4780000000001,3340.7759999999998,4237.2030000000004,4785.9570000000003,3922.86,3724.6979999999999,4508.0119999999997,5151.652,5104.1710000000003,4384.2939999999999,4067.27,3992.02,4552.1890000000003,4225.1899999999996,4437.6530000000002,4942.09,4277.0730000000003,4464.0169999999998,4223.2820000000002,4493.1509999999998,5192.8770000000004,4385.7290000000003,4026.587,3462.453,4064.5410000000002,4293.1989999999996,4749.7550000000001,4946.1469999999999,4034.17,4813.0360000000001,4192.3450000000003,5199.2209999999995,5201.174,4155.7929999999997,4669.1880000000001,4062.3710000000001,3893.6060000000002,4183.93,4729.2460000000001,4829.7979999999998,4382.91,4501.3059999999996,4049.26,5006.7079999999996,4888.2139999999999,3958.1379999999999,3900.1210000000001,4180.04,4543.5010000000002,3955.25,4579.1760000000004,5011.7669999999998,4867.835,4055.7330000000002,3978.7339999999999,5077.2939999999999,5146.4290000000001,4395.348,4446.4219999999996,4134.1989999999996,4752.0510000000004,4513.0550000000003,4113.75,4140.442,3814.6640000000002,4207.8209999999999,4297.0649999999996,5176.8519999999999,5195.7539999999999,4737.4430000000002,4830.9219999999996,4445.9740000000002,5116.9250000000002,3774.4290000000001,3664.36,3673.0569999999998,3886.011,4866.2370000000001,4595.5460000000003,5326.0879999999997,5031.4409999999998,4410.6220000000003,3691.5619999999999,4062.0650000000001,4998.1310000000003,4588.0749999999998,4734.5360000000001,4656.4660000000003,4176.0129999999999,4076.8440000000001,4225.6610000000001,4396.9260000000004,4850.357,4864.741,4461.1189999999997,4236.9560000000001,4651.5559999999996,4934.2110000000002,5286.8950000000004,5284.7460000000001,4524.4040000000005,4228.4549999999999,4439.5460000000003,4809.0609999999997,5175.085,3934.9490000000001,4011.0189999999998,3517.41,4880.7039999999997,4516.8969999999999,4677.9319999999998,5216.1670000000004,4711.5259999999998,5076.299,5278.6869999999999,5381.5219999999999,5459.17,5121.3310000000001,4958.84,4468.1360000000004,4874.4319999999998,5231.8050000000003,5359.4309999999996,5001.26,4030.7669999999998,4407.5630000000001,5064.9549999999999,5552.63,5502.3770000000004,4781.0929999999998,4681.95,4579.076,5513.3280000000004,5103.848,5432.7079999999996,5308.9870000000001,4701.9359999999997,4737.7489999999998,5173.6959999999999,5468.4650000000001,5520.4269999999997,4774.6279999999997,4206.7129999999997,4213.8419999999996,4779.2070000000003,5056.317,5461.0479999999998,5342.009,4584.9179999999997,5397.9639999999999,5372.2539999999999,5579.12,5509.2039999999997,4935.9390000000003,4672.1049999999996,4666.5870000000004,4788.8159999999998,4456.1189999999997,5407.9309999999996,5310.3649999999998,4125.6400000000003,4543.8519999999999,5301.45,5501.5820000000003,5460.7179999999998,5125.5640000000003,4948.6270000000004,5126.8320000000003,4825.2929999999997,5119.8680000000004,5506.2659999999996,5391.1970000000001,4699.0659999999998,4456.99,5064.8130000000001,5150.5079999999998,5568.3090000000002,4881.1490000000003,4397.3779999999997,3772.4949999999999,3619.3679999999999,3778.6930000000002,3888.0259999999998,4532.116,5109.7690000000002,4710.4870000000001,5173.1639999999998,5470.8789999999999,5421.2830000000004,4884.5969999999998,5073.241,3528.8339999999998,4300.0879999999997,4842.6530000000002,4775.66,5164.5550000000003,4298.7560000000003,4620.2969999999996,5068.6260000000002,5375.116,5319.1580000000004,4778.3050000000003,4947.4629999999997,4342.93,3485.058,3161.45,3855.7460000000001,3976.62,4877.2839999999997,4891.0659999999998,3934.346,5069.5010000000002,5322.9409999999998,5119.9319999999998,5354.7060000000001,4039.7550000000001,4689.7039999999997,4579.7330000000002,4541.0349999999999,5013.9489999999996,4482.3890000000001,4314.4620000000004,4045.8270000000002,4955.8580000000002,5438.39,4335.1400000000003,3949.223,4063.489,3687.607,3530.33,3998.25,5278.1620000000003,4387.8469999999998,3957.8240000000001,3973.4949999999999,3949.6880000000001,4480.6099999999997,4635.9830000000002,4877.9646469999998,4894.268,4417.8689999999997,4693.97,5399.9840000000004,5421.2550000000001,5066.8190000000004,5429.7690000000002,5094.6189999999997,4829.2110000000002,4718.777,4271.59,4332.2643109999999,4457.3370000000004,3640.74,4702.2290000000003,4823.0249999999996,5271.61,4983.1229999999996,4499.7290000000003,4546.8770000000004,4856.63,5171.7839999999997,5146.0450000000001,5472.3729999999996,5200.7150000000001,4487.326,3504.3710000000001,5098.692,5457.9219999999996,5300.0649999999996,5396.02,4070.386,4361.2879999999996,4582.8119999999999,4425.6019999999999,5210.3209999999999,4458.8410000000003,3995.2890000000002,4334.933,5136.4780000000001,5025.3630000000003,4740.6139999999996,4342.4009999999998,4067.681,3986.5520000000001,4535.384,4723.7730000000001,5288.5060000000003,5057.6959999999999,4341.3779999999997,3439.377,4262.5479999999998,4221.3969999999999,4806.0709999999999,5129.5820000000003,4369.2830000000004,4695.2439999999997,5242.7219999999998,4720.8609999999999,5205.7860000000001,4690.1409999999996,3554.4010480000002,3771.7689999999998,4798.9250000000002,4963.9790000000003,4873.9170000000004,4095.259,3973.4929999999999,4863.5860000000002,4615.6859999999997,3973.2069999999999,5191.7529999999997,5055.57,3891.866,4819.2470000000003,5178.0649999999996,5151.8209999999999,5009.8950000000004,5096.1009999999997,3774.5970000000002,4341.1639999999998,5285.3739999999998,4755.5749999999998,"-","-","-","-","-","-","-","-","-","-"]
[null,"Carbón",3554.7130000000002,2808.93,4652.6989999999996,4136.5429999999997,4587.1109999999999,5321.4319999999998,5250.7060000000001,3947.904,5387.902,5510.9690000000001,4915.0630000000001,5264.8360000000002,5224.28,5296.625,3495.0279999999998,3481.8490000000002,3671.8180000000002,4256.6930000000002,4980.1729999999998,4086.721,5208.0709999999999,5263.2470000000003,5335.63,5504.1719999999996,5944.99,5738.3360000000002,6103.6019999999999,5201.3090000000002,4697.4560000000001,4286.62,5015.9709999999995,4074.3449999999998,5319.2740000000003,4625.6970000000001,4904.8990000000003,3913.3960000000002,5346.884,5513.03,5612.2,5170.2950000000001,4777.482,4212.7860000000001,4707.7950000000001,4404.0150000000003,5167.9459999999999,4033.7550000000001,4331.0810000000001,4573.8289999999997,3978.51,4574.6260000000002,4772.0309999999999,4414.0839999999998,3947.5819999999999,4969.9160000000002,5461.8220000000001,4646.473,4986.63,5297.8029999999999,4989.8029999999999,5135.4290000000001,4961.5429999999997,4086.7020000000002,4543.3760000000002,4764.9229999999998,4849.9660000000003,4988.4269999999997,5813.1210000000001,5715.2879999999996,5955.4340000000002,5452.8069999999998,5627.4120000000003,4475.7129999999997,2360.5059999999999,2530.3960000000002,3906.415,2566.183,2468.0160000000001,4802.9570000000003,6075.884,5718.72,5483.2709999999997,5300.6729999999998,5235.7960000000003,3019.8519999999999,3369.9650000000001,3440.4050000000002,5261.442,5405.2070000000003,4764.1080000000002,4851.4949999999999,5510.2690000000002,5458.799,6182.2820000000002,6159.8909999999996,4489.942,3626.0010000000002,2784.9969999999998,3170.357,5292.9309999999996,4252.3119999999999,3309.6819999999998,4052.5839999999998,5346.3990000000003,4423.5739999999996,5801.1279999999997,6013.634,6005.6689999999999,6472.7079999999996,6340.8639999999996,5930.6809999999996,6145.65,5483.5320000000002,4405.9440000000004,5287.6989999999996,6323.3829999999998,5275.55,6366.4870000000001,5855.6469999999999,5280.2830000000004,5709.9129999999996,6646.7269999999999,6309.58,6444.9,5440.6189999999997,4905.92,5885.0379999999996,6534.3549999999996,6262.8040000000001,6674.8770000000004,6592.7020000000002,6222.2370000000001,4308.4120000000003,3864.127,3418.3440000000001,3396.4870000000001,3806.2080000000001,4867.4440000000004,5835.1459999999997,6385.9369999999999,6261.54,6593.6639999999998,6585.9129999999996,6448.018,6986.076,6959.4219999999996,6404.2160000000003,6858.5259999999998,6465.3549999999996,6436.5510000000004,6061.0640000000003,6297.098,6142.6760000000004,6405.9840000000004,5954.9880000000003,6040.4160000000002,4529.3950000000004,4692.41,5217.6180000000004,5238.5379999999996,4917.42,5208.8059999999996,6150.0929999999998,6649.875,6645.7740000000003,6560.4669999999996,6463.7240000000002,5574.1440000000002,4974.2969999999996,5656.4549999999999,5871.2439999999997,6356.1559999999999,5163.0929999999998,5313.8549999999996,5886.91,6545.9870000000001,6332.2389999999996,6239.2479999999996,6190.8059999999996,5967.0519999999997,6597.0609999999997,6811.0429999999997,6089.2169999999996,6168.6570000000002,5506.63,5676.7759999999998,5758.9080000000004,6257.933,5758.1769999999997,5916.0669999999991,6141.5519999999997,6328.2110000000002,6580.9179999999997,6886.5889999999999,5775.3689999999997,4765.6580000000004,3496.4920000000002,5080.473,5562.59,6510.018,5286.5910000000003,5409.01,4807.43,4258.2139999999999,4287.6310000000003,6102.67,4895.3440000000001,4863.6350000000002,5834.9139999999998,5991.8040000000001,5773.7129999999997,5941.4759999999997,5886.2380000000003,5490.1840000000002,5348.8280000000004,5486.22,6071.2219999999998,4980.9620000000004,4597.7120000000004,3661.9070000000002,3107.0479999999998,2174.694,2041.751,3682.3649999999998,3065.9859999999999,3445.7359999999999,4099.5609999999997,4098.3509999999997,4453.4639999999999,4585.1629999999996,3015.4140000000002,2964.835,1785.3620000000001,2230.875,2454.0859999999998,3212.9270000000001,1795.0940000000001,2689.4720000000002,3054.2979999999998,1997.712,1837.3240000000001,1696.0940000000001,1367.2760000000001,844.19683400000008,633.69799999999998,823.90599999999995,1322.5630000000001,2450.4160000000002,2835.7339999999999,2971.1260000000002,1987.136,1627.231,2039.8789999999999,2046.91,2465.9850000000001,2981.8594069999999,2442.991,2961.694,2727.0279999999998,4186.6130000000003,4069.8069999999998,4665.6499999999996,4282.6189999999997,3880.549,3790.1219999999998,5155.723,5284.4470000000001,4450.6859999999997,2519.9769999999999,3786.125,5062.384,4674.9290000000001,4819.2690000000002,3811.0169999999998,4058.4580369999999,3915.7240000000002,3592.1469999999999,2887.2489999999998,2416.6030000000001,1257.787,904.23199999999997,1901.7360000000001,2464.3339999999998,5226.9780000000001,4374.2529999999997,4539.9620000000004,4032.0120000000002,2511.31,4660.4269999999997,2116.6080000000002,756.298,1149.2190000000001,1222.6990000000001,3177.6909999999998,5007.9830000000002,5378.1710000000003,5052.8900000000003,5684.2669999999998,4391.0060000000003,3148.0790000000002,4047.7660000000001,4900.1130000000003,2941.5079999999998,2591.2600000000002,2955.7919999999999,2829.4630000000002,5330.826,6063.442,5202.1499999999996,4598.2759999999998,4304.6319999999996,4578.0150000000003,4628.2953669999997,2561.0259999999998,1806.4839999999999,1690.627,903.56100000000004,1036.145,2044.4770000000001,3659.5210000000002,3390.0650000000001,4304.2709999999997,4283.7070000000003,4457.4279999999999,5032.9750000000004,5166.1390000000001,3342.29,"-","-","-","-","-","-","-","-","-","-"]
[null,"Fuel + Gas",204.21799999999999,106.63200000000001,108.53100000000001,79.792000000000002,202.10499999999999,384.87799999999999,413.75400000000002,154.66399999999999,238.91200000000001,286.88600000000002,267.43900000000002,418.13499999999999,255.22300000000001,330.26900000000001,128.71299999999999,181.60300000000001,200.85400000000001,278.56799999999998,687.28200000000004,178.96100000000001,651.77,308.13900000000001,371.59300000000002,468.71,1299.375,1787.73,1434.2529999999999,698.91499999999996,614.41099999999994,147.673,415.72300000000001,221.51499999999999,529.48400000000004,185.83699999999999,87.533000000000001,41.134,95.265000000000001,339.47300000000001,343.83600000000001,259.45,99.405000000000001,120.458,38.927,88.599000000000004,185.27199999999999,52.688000000000002,79.194000000000003,74.58,99.884,90.411000000000001,115.89400000000001,122.31100000000001,19.071000000000002,97.451999999999998,377.67399999999998,54.8,84.703999999999994,118.869,64.489999999999995,166.625,152.78100000000001,37.526000000000003,143.05000000000001,120.69,108.38200000000001,288.23200000000003,593.74300000000005,231.72399999999999,578.34900000000005,658.57899999999995,432.286,315.82100000000003,15.11,185.81,257.11,138.06399999999999,30.667999999999999,162.97,265.834,140.58600000000001,231.84,97.462999999999994,243.30500000000001,274.57,261.459,382.80099999999999,453.16300000000001,496.78800000000001,437.55900000000003,493.38499999999999,819.47199999999998,582.31200000000001,735.84,822.64400000000001,542.72900000000004,524.38900000000001,69.924000000000007,100.93300000000001,152.994,52.481999999999999,36.298000000000002,200.45699999999999,473.96899999999999,507.113,713.85500000000002,389.214,997.22,1644.422,1502.4580000000001,1861.3040000000001,1086.079,532.75699999999995,168.64400000000001,532.41,1127.99,686.73099999999999,596.71299999999997,154.83099999999999,413.447,687.29899999999998,1113.6690000000001,491.26400000000001,1132.8869999999999,724.64300000000003,174.01300000000001,674.13099999999997,890.41,736.76900000000001,1450.383,931.17499999999995,755.077,490.87799999999999,502.29,406.87400000000002,415.24599999999998,162.84899999999999,332.142,1148.567,1351.6949999999999,1201.8900000000001,1299.134,1281.4549999999999,1320.4590000000001,2157.018,2663.5720000000001,1619.6969999999999,1419.443,1389.165,1086.731,1639.8030000000001,1896.914,889.726,1207.8599999999999,878.51300000000003,477.95100000000002,376.30700000000002,581.38300000000004,499.10700000000003,206.44800000000001,78.707999999999998,237.10300000000001,1224.425,1186.8030000000001,1068.492,943.46799999999996,648.37199999999996,347.553,409.78,431.41399999999999,344.90600000000001,608.28800000000001,174.5,312.65300000000002,737.54499999999996,1090.75,714.63199999999995,946.65800000000002,578.89200000000005,466.279,682.95100000000002,916.31399999999996,1095.0899999999999,1363.62,371.74299999999999,521.77099999999996,1160.585,1354.2950000000001,407.67500000000001,515.48199999999997,357.86500000000001,420.92899999999997,808.94899999999996,760.53599999999994,627.52300000000002,291.553,282.34699999999998,230.67099999999999,521.58600000000001,1004.05,339.096,760.59699999999998,340.62799999999999,131.166,106.30500000000001,102.61,220.43700000000001,191.126,113.172,166.47399999999999,83.596000000000004,272.95100000000002,212.661,233.035,127.13200000000001,199.01599999999999,168.55500000000001,142.142,124.255,70.555000000000007,137.19999999999999,147.767,248.85499999999999,154.96299999999999,242.51900000000001,189.06899999999999,200.066,227.26599999999999,190.238,128.80699999999999,119.209,191.56200000000001,137.76900000000001,91.483999999999995,147.09100000000001,212.322,171.65,154.518,104.51600000000001,165.87799999999999,164.78399999999999,153.209,126.666,22.518000000000001,105.508,163.869,165.56899999999999,138.49199999999999,113.152,138.31899999999999,124.90300000000001,166.81100000000001,147.00700000000001,0,0,0,0,0,0,0,0,0,0,0,0,0,0,0,0,0,0,0,0,0,0,0,0,0,0,0,0,0,0,0,0,0,0,0,0,0,0,0,0,0,0,0,0,0,0,0,0,0,0,0,0,0,0,0,0,0,0,0,0,0,0,0,0,0,0,0,0,0,0,0,0,0,0,"-","-","-","-","-","-","-","-","-","-"]
[null,"Ciclo combinado","-","-","-","-","-","-","-","-","-","-","-","-","-","-","-","-","-","-","-","-","-","-","-","-","-","-","-","-","-","-","-","-","-","-","-","-",0.21299999999999999,"-","-","-","-","-","-","-","-","-","-","-","-","-","-","-","-","-","-","-","-","-","-","-","-","-","-","-","-","-","-","-","-","-","-","-","-","-","-","-","-","-","-","-","-","-","-","-","-","-","-","-","-","-","-","-","-","-","-","-","-","-","-","-","-","-","-","-","-","-","-","-","-","-","-","-","-","-","-","-","-","-","-","-","-","-","-","-","-","-","-","-","-","-","-","-","-","-","-","-","-","-","-","-","-","-","-","-","-","-","-","-",121.518,305.00700000000001,520.59400000000005,763.19200000000001,1165.914,1151.1369999999999,610.33199999999999,517.97900000000004,436.83199999999999,845.81500000000005,761.98099999999999,386.589,799.41600000000005,1781.1379999999999,1927.3420000000001,1793.886,2025.4680000000001,1795.77,1208.1959999999999,863.65300000000002,1541.807,1943.2280000000001,2272.9110000000001,1822.15,2011.424,2317.6480000000001,2722.288,2333.433,2921.5369999999998,2845.4029999999998,2763.1559999999999,2817.86,3347.6289999999999,3357.8130000000001,3345.9479999999999,3237.21,3507.2539999999999,4645.3109999999997,5188.2110000000002,4424.9160000000002,4433.4340000000002,4074.636,4170.7370000000001,4113.6899999999996,5549.6480000000001,5482.8220000000001,4705.1390000000001,4650.8059999999996,4929.5569999999998,5469.55,6664.4570000000003,4828.1819999999998,6324.433,5050.22,4256.4570000000003,4211.1629999999996,6046.6490000000003,3813.0230000000001,3823.5529999999999,4054.7080000000001,4329.2470000000003,6168.9219999999996,6583.8389999999999,5145.5169999999998,5637.6090000000004,6092.1170000000002,7608.1620000000003,7269.5219999999999,7999.7709999999997,7995.5810000000001,6774.8040000000001,6899.11,7196.2809999999999,7596.2740000000003,8863.5310000000009,8223.3009999999995,7817.5169999999998,7214.4549999999999,6826.1670000000004,5693.94,5970.2749999999996,4444.1909999999998,5032.6499999999996,5434.4449999999997,5603.4830000000002,7620.6459999999997,8497.5750000000007,8177.8140000000003,7385.0879999999997,6555.009,5522.15,6135.9579999999996,5308.0950000000003,4758.78,4086.5899279999999,4360.6160999999993,4552.942,5475.442,6782.4560000000001,5736.69,6235.23,5277.7479999999996,5529.0940000000001,4851.2572170000003,5017.5481399999999,4626.0790999999999,3936.2882829999999,2780.183,4145.3770299999996,4837.5429999999997,4513.7520059999997,4686.5900339999998,4471.7389999999996,3709.547,3346.7570000000001,3340.253412,4223.4920000000002,3867.6390000000001,3070.4450000000002,2221.1074309999999,2396.9130299999997,3094.7109999999998,3351.596,3470.2919649999999,2874.5963450000004,3215.3029999999999,2947.85,2797.7220000000002,2607.2273,1958.4953500000001,1498.0340000000001,1120.7550000000001,1635.2412960000001,1378.832001,2221.196817,2365.5941080000002,2232.1579999999999,2535.2040000000002,2034.98,2772.864,1551.0370190000001,1268.5402469999999,1284.1469999999999,1230.0104410000001,1422.7929999999999,1773.52217,1859.79216,2219.6498360000001,2659.4920000000002,2137.4920299999999,1928.739,2001.539,2227.4250000000002,1716.241,1625.308002,1666.992,1600.5170000000001,1879.125,3407.078,2337.2719999999999,1999.653,2081.9119999999998,2093.5509999999999,2633.3939999999998,1875.1869999999999,1317.271,1366.2650000000001,1171.7449999999999,1499.5540000000001,1883.6594950000001,2383.1570000000002,2016.1822930000001,2143.0909999999999,3298.3040000000001,3423.6590000000001,3306.2860000000001,2834.400369,1511.4273999999998,"-","-","-","-","-","-","-","-","-","-"]
[null,"Régimen ordinario",12926.357,10581.564999999999,11416.075000000001,10457.180999999999,10461.036,10796.148000000001,11461.204000000002,10093.407999999999,10840.496000000003,10968.464000000002,11589.866000000002,12786.873000000001,13239.38,12083.618999999999,11425.396000000001,10980.723,11130.630999999998,10763.272000000001,11766.474,10313.691000000001,11266.512000000002,11548.643999999997,11906.550999999998,12314.346000000001,13871.503000000001,12736.595000000001,12381.88,10961.814999999999,10802.923000000001,10285.013999999999,11866.487999999999,10455.599000000002,11178.235999999999,11482.254000000001,11277.127,11860.464999999998,12705.377,11469.427000000001,12041.353999999996,10605.519999999997,10558.738000000001,10609.397000000003,11305.952000000001,10596.652,10976.277999999998,11325.451999999999,11747.044999999996,12188.336999999998,12685.643,11582.145,11358.462999999996,10920.803999999998,10944.569999999998,11311.628000000002,12222.555,10973.152999999998,11210.371000000001,10980.558999999999,11198.065000000001,12145.179000000004,12953.626000000002,11018.559000000003,12159.843999999999,10853.870000000004,11374.402999999997,11491.358,12141.378000000001,11184.483999999999,11280.693999999998,11320.003000000002,11578.094999999999,12373.954999999998,13470.736999999999,12799.213000000002,12315.147000000001,10601.276999999996,11212.282999999999,11508.811,12185.666999999999,10967.458999999999,11271.293000000001,11934.769000000002,12151.593000000001,12597.085999999999,14083.578000000001,11471.970000000001,11878.418999999998,12128.93,12304.189,12148.918999999998,13009.237000000003,12394.627000000002,12693.870999999999,12522.63,12636.612000000001,13761.592000000001,13369.915999999999,11969.025,12419.051000000001,11834.460999999999,11827.589000000002,12442.531000000001,13641.856999999998,12326.652,12874.096,12543.050000000001,12934.402,14321.236000000001,14458.407000000001,13049.906999999999,13078.465,11538.88,12115.561000000002,12702.124,14042.931,12642.026999999998,13255.187999999998,12904.402,13673.998,14536.451000000001,15736.309000000003,13497.509999999998,14079.450999999999,12797.216999999999,13250.671000000002,14032.49,14503.346999999998,13730.665000000001,14016.970000000001,13696.626,14495.565000000001,14979.624,16089.006000000001,14193.431,14863.669000000002,12645.645,13830.507000000001,14496.214,15167.697,14697.792000000001,14172.29,14437.813999999998,14989.92,16426.213,16693.004000000001,14071.603999999999,14372.266,13911.524999999998,14388.041000000001,15097.285,15800.802,14382.479000000003,14621.029000000002,14723.314000000002,14507.519000000002,15172.174999999999,16708.429,15726.468000000001,15179.310999999998,13592.332,14415.543999999996,15912.103999999999,17171.198,16407.002,15412.097000000002,15426.892,15466.623,16435.541000000001,16568.126,16449.046999999999,17098.934000000001,15006.021999999999,15529.905000000002,16707.550999999999,17927.985999999997,16541.084999999999,16414.573000000004,15859.625000000002,16551.557000000001,17087.504000000001,18243.370999999999,16973.586000000003,17044.812000000002,14837.507000000001,15523.875,17313.733999999997,18237.486000000001,16373.689999999999,17006.422999999999,16261.470999999998,17433.355999999996,18668.195,20262.534,18010.791999999994,17541.668999999998,14393.763999999999,16535.659,17910.976000000002,20594.048000000003,16754.415000000001,18085.466,16521.769,16682.085999999996,18675.330999999998,19751.378000000001,16523.958999999999,17507.055,16888.804,16579.203000000001,17333.553,19039.929,16995.284,17670.181,18206.593000000001,18648.744999999999,19925.703000000001,19800.373,18855.427,16917.789000000001,16495.352000000003,17109.577999999998,17260.227999999999,19220.999,17954.337,17194.444,16941.185000000001,16678.165000000001,17574.968000000001,18220.623,15040.960000000003,14569.678,13304.255000000001,13795.37,15569.023000000001,17482.846000000001,16761.399000000001,15545.411,14898.662999999999,13498.447,15042.440999999999,16581.893950000001,14727.736116999997,15244.312545999999,14236.158649999999,13329.089481999999,14764.740740000001,17347.935098000002,15963.713582,15824.488311999999,14344.450218,14687.169635999999,15440.754387000001,16519.798010999999,14025.343386,14664.133832,12829.966520000002,13162.761498999998,14021.066074,14901.497056,15374.780923999999,15246.575555999998,13766.588358999999,13726.916234,14003.894412,16160.525933999999,15457.36,14246.139933999999,11523.684390999999,12786.929278,13524.787606,14654.799175999999,15073.852099,13092.593220999999,14072.856331000001,12786.230934000001,13129.554977999998,12795.946234000001,12006.898327999999,12201.921988,11397.962444000001,10815.292750000001,10937.157823,14944.142915,13667.879122000002,13176.628215999999,12648.251822,11138.97,13690.481978,"-","-","-","-","-","-","-","-","-","-","-","-","-","-","-","-","-","-","-","-","-","-","-","-","-","-","-","-","-","-","-","-","-","-","-","-","-","-","-","-","-","-","-","-","-","-","-","-"]
[null,"Hidráulica/Resto hidráulica",105.99199999,92.305999990000004,64.729999989999996,90.829000010000001,84.022999960000007,91.299000000000007,55.459000000000003,57.632000010000006,34.01199999,69.633999989999992,110.01000001,126.70600002,179.13800000000001,122.81100000000001,215.011,190.10900000000001,195.07300000000001,144.59399999999999,99.561000000000007,80.388999999999996,78.209000000000003,93.88,141.988,164.018,125.13500000000001,89.668999999999997,114.31100000000001,191.75700000000001,193.59,203.803,181.00200000000001,118.066,117.869,215.52699999999999,233.875,297.16899999999998,208.39500000000001,120.724,171.35300000000001,192.554,247.309,207.114,151.58000000000001,102.715,108.434,243.80099999999999,228.351,251.898,342.685,275.54899999999998,261.048,218.69300000000001,253.36600000000001,170.89599999999999,113.035,101.443,106.75,171.69800000000001,238.982,221.12299999999999,329.74799999999999,321.577,299.32900000000001,168.03299999999999,176.27099999999999,142.42699999999999,114.44499999999999,86.066999999999993,110.54,88.179000000000002,129.774,256.48399999999998,431.99400000000003,394.01900000000001,364.69799999999998,371.68,349.161,242.65199999999999,197.03100000000001,174.12299999999999,161.74299999999999,181.57599999999999,235.11199999999999,440.05799999999999,440.79199999999997,368.97300000000001,267.72199999999998,216.18199999999999,261.68,278.39100000000002,254.60499999999999,204.18799999999999,190.68700000000001,154.25,310.86200000000002,480.66300000000001,492.71681900000027,339.41051800000037,327.06436500000001,403.45852500000007,412.07627199999973,315.95694499999991,207.93444699999981,197.43269499999997,167.836814,248.31532999999988,203.70192800000009,262.56925899999993,323.52239599999979,292.89981199999983,373.90223100000003,348.71718900000002,443.13831299999953,296.52359400000012,224.70694300000005,189.84542699999983,210.82529300000019,274.4117980000002,366.44797700000021,395.38163899999972,330.40558000000061,282.4367390000001,249.44621600000002,435.78321799999981,494.62790899999982,357.92745100000013,254.29291899999987,199.41030499999974,158.61218700000026,230.15518499999985,367.53720900000002,475.46501499999971,558.92030299999965,485.9960640000001,596.9482809999995,489.46396500000048,476.68399000000039,352.76099499999998,300.49062999999978,227.07167800000002,181.60083700000001,202.50831499999984,222.42956999999993,192.64800500000001,255.92034899999996,271.46624000000031,345.5155519999999,361.37205199999977,420.06244200000003,357.79012199999954,235.872343,210.05402300000023,204.41109700000004,280.620946,390.81764499999963,565.54952800000058,581.19393900000068,453.43333999999987,562.61659000000009,532.27852599999949,529.63067400000057,359.33567800000003,277.91316899999993,209.44763500000025,208.93049999999982,309.71749599999981,485.77285999999998,578.37363800000003,587.99536900000066,427.62895799999984,507.79213800000031,547.04272999999989,572.54148200000088,412.62300300000021,336.46757500000012,259.27092500000015,199.83813299999983,245.59888100000015,329.70104599999968,323.07814500000035,350.78451000000035,292.22942700000004,386.56584999999961,465.50854399999992,438.71030300000024,297.45351899999991,244.46804400000011,191.04961800000027,151.16209100000012,217.90684300000004,377.39904099999995,404.34514899999988,400.55887300000069,320.87833499999977,567.0589700000005,506.03915599999999,360.07454500000034,248.51400000000001,226.34899999999999,177.815,164.14,312.404,381.88099999999997,482.851,345.48899999999998,478.79599999999999,516.02800000000002,529.75900000000001,509.19,412.91699999999997,302.21199999999999,256.50099999999998,186.13399999999999,186.88800000000001,189.87299999999999,211.53800000000001,340.20600000000002,233.21799999999999,301.23399999999998,581.11099999999999,613.279,581.55499999999995,380.40899999999999,264.58100000000002,212.28,190.523,400.12099999999998,539.62599999999998,521.05499999999995,629.452,559.84500000000003,501.44200000000001,577.14200000000005,468.387,365.35300000000001,282.64999999999998,242.869,230.81,466.05,608.61800000000005,764.37,616.57799999999997,784.76,690.19600000000003,688.34299999999996,608.94799999999998,459.60300000000001,341.74799999999999,281.05,318.88900000000001,567.66,702.17499999999995,663.64800000000002,506.22,655.86300000000006,588.12800000000004,489.53800000000001,405.25799999999998,384.18599999999998,304.79399999999998,235.56299999999999,189.00200000000001,423.49200000000002,448.62299999999999,336.82299999999998,331.68099999999998,324.86200000000002,468.28100000000001,642.16,439.56299999999999,337.726,264.85199999999998,198.80799999999999,269.48399999999998,410.351,619.95500000000004,667.28899999999999,687.923,842.28099999999995,845.36900000000003,779.84699999999998,658.83900000000006,534.94100000000003,402.89299999999997,302.90899999999999,342.66300000000001,522.62599999999998,511.57499999999999,783.351,754.57299999999998,806.16800000000001,776.29499999999996,608.47699999999998,523.41800000000001,479.798,401.51499999999999,357.392,362.73,544.005,671.798,"-","-","-","-","-","-","-","-","-","-","-","-","-","-","-","-","-","-","-","-","-","-","-","-","-","-","-","-","-","-","-","-","-","-","-","-"]
[null,"Eólica",0.115,0.19899998999999999,0.18,0.189,0.17399999999999999,0.12,0.26,0.186,0.13100000000000001,0.17,0.20699999999999999,0.25599999000000001,0.192,0.14299999999999999,0.21199999999999999,0.56200000000000006,0.32200000000000001,0.2,0.184,0.21199999999999999,0.14399999999999999,0.24199999999999999,0.27100000000000002,0.18099999999999999,0.26200000000000001,0.22500000000000001,0.313,0.20699999999999999,0.19500000000000001,0.16300000000000001,0.19500000000000001,0.66600000000000004,1.2949999999999999,2.137,2.5070000000000001,9.1959999999999997,7.1150000000000002,11.385999999999999,7.3259999999999996,6.1639999999999997,5.2709999999999999,7.9740000000000002,7.391,6.9809999999999999,5.6310000000000002,7.1980000000000004,6.7279999999999998,5.6029999999999998,6.899,4.8140000000000001,8.7690000000000001,6.859,4.97,6.4619999999999997,3.859,5.3929999999999998,5.0469999999999997,6.3360000000000003,7.78,5.6719999999999997,7.87,7.6749999999999998,8.4960000000000004,11.901999999999999,9.2110000000000003,8.8979999999999997,14.465,17.63,14.853,27.623000000000001,13.795,17.439,18.829999999999998,22.030999999999999,24.646000000000001,26.102,23.157,27.099,25.434000000000001,15.643000000000001,22.706,30.321000000000002,31.616,36.543999999999997,39.627000000000002,32.179000000000002,46.04,56.365000000000002,39.409999999999997,43.759,57.268000000000001,41.052999999999997,45.835000000000001,69.47,72.793999999999997,76.084999999999994,85.726278999999991,73.041770999999997,100.15667400000001,97.154274999999998,87.936697000000009,72.687051000000011,112.78895799999999,131.01327799999996,104.74763500000003,104.14675399999999,128.51891699999999,138.738417,159.91106499999998,214.37513500000003,206.77279700000003,190.99942600000003,173.14856599999996,212.21415299999998,177.00095900000005,139.30212900000004,172.17858000000001,199.35031500000005,312.98064799999997,315.79952500000002,305.02478600000001,295.11369999999994,338.14951600000018,416.02144200000009,226.957358,365.846115,360.05244799999997,315.70721200000003,276.36600500000014,409.72117300000014,544.09382199999982,609.44247300000018,594.73167599999999,573.65477800000008,654.24861100000021,650.22456599999998,424.36108700000011,408.90728200000012,400.20572300000021,374.72081200000002,611.54289400000005,574.769948,768.828981,557.95175500000039,657.00929500000052,782.54075799999964,795.79277999999965,618.78730799999983,820.58633199999974,646.36536599999977,693.5828309999996,598.4340899999994,505.37139599999978,869.00001900000052,1056.9575050000003,1214.8690069999998,1395.1710190000006,997.62484999999981,837.86062599999968,1138.0008659999992,901.86601600000074,703.48306400000013,727.40598099999977,543.97083900000018,781.24529999999993,1086.9553520000009,1172.985179,1433.6770410000006,1685.3449229999994,1074.4477040000002,1281.2794619999981,1519.3727670000001,1019.3578530000005,1048.3327160000013,970.02610899999979,1114.316325,1147.637898,1635.2691430000013,1511.2452730000009,1747.4875960000002,1879.1933479999996,1745.3139569999989,1763.5135970000013,1926.4580810000014,1492.0681999999997,1261.4607640000008,1611.0284699999993,1640.4408529999992,1271.4945329999998,1902.7245970000004,1958.5321529999999,2405.4374059999986,1563.7009309999996,1924.8670310000009,2788.2671979999986,1955.917235000001,1670.5176799999992,1364.4480000000001,1171.7909999999999,2177.8209999999999,1465.816,2334.8020000000001,2279.5230000000001,2183.3850000000002,2149.8069999999998,2871.9189999999999,3086.2469999999998,1356.316,2605.873,1786.288,1888.6089999999999,2419.819,2028.855,1907.625,2752.3119999999999,2395.4850000000001,2651.4679999999998,2018.9480000000001,4092.55,3352.6860000000001,1737.1610000000001,2085.509,2124.2370000000001,1972.5229999999999,2129.8850000000002,2482.0129999999999,3462.6880000000001,3648.1819999999998,3503.799,3226.32,3100.5160000000001,3059.6579999999999,2698.0039999999999,2332.395,2426.1289999999999,2235.837,2466.7310000000002,3125.33,4792.63,4921.2280000000001,4292.0919999999996,4622.4350000000004,4546.5469999999996,2634.819,3619.3339999999998,2576.1970000000001,2798.1329999999998,2894.7440000000001,2301.3229999999999,3952.8310000000001,4348.0590000000002,4621.8819999999996,4018.65,4028.2460000000001,4690.99,3399.4090000000001,3165.6219999999998,2937.1970000000001,3254.7049999999999,2729.4850000000001,2322.9769999999999,3149.5050000000001,3819.8870000000002,4588.76,3645.5149999999999,5014.665,3805.5540000000001,5306.39,3707.8789999999999,3429.201,2981.913,3126.895,3937.4119999999998,3129.8209999999999,4604.8419999999996,5449.9780000000001,6291.5739999999996,5340.9960000000001,5749.1030000000001,4396.7820000000002,3932.35,3827.0520000000001,2844.2130000000002,3410.875,3214.2730000000001,3963.88,6429.8140000000003,4943.4399999999996,6539.4849999999997,5884.2849999999999,5050.3310000000001,3950.2179999999998,4134.8410000000003,3275.5990000000002,3591.6019999999999,2856.8409999999999,2132.614,3382.7719999999999,5071.9809999999998,4764.3209999999999,4912.46,5948.174,4865.1239999999998,3904.518,4800.4530000000004,2873.288,3053.3739999999998,3237.373,3002.6950000000002,3887.2489999999998,3699.88,3528.5619999999999,5604.8410000000003,6068.5870000000004,5410.0050000000001,4414.84,3902.5430000000001,3226.768,3463.4780000000001,3601.65,2665.8919999999998,2375.6239999999998,3884.2089999999998,2671.9070000000002,4812.8180000000002,4858.9031299999997,"-","-","-","-","-","-","-","-","-","-"]
[null,"Solar fotovoltaica",0,0,0,0,0,0,0,0,0,0,0,0,0,0,0,0,0,0,0,0,0,0,0,0,1.01,0.77200000000000002,0.57199999999999995,1.2889999999999999,1.113,1.1639999999999999,1.3069999999999999,1.155,1.2230000000000001,0.94399999999999995,0.56999999999999995,0.93700000000000006,0.53800000000000003,0.53300000000000003,1.252,1.3029999999999999,1.05,1.069,1.2729999999999999,1.1930000000000001,0.88,0.72,1.2629999999999999,0.92600000000000005,0.97799999999999998,1.242,1.0649999999999999,1.208,1.742,1.484,1.635,1.6679999999999999,1.69,1.5209999999999999,1.004,1.1259999999999999,0.80400000000000005,1.4119999999999999,1.84,1.8540000000000001,1.931,1.8660000000000001,1.7450000000000001,1.7949999999999999,1.8120000000000001,1.635,1.8340000000000001,1.679,1.81,1.5129999999999999,1.899,1.7649999999999999,1.421,1.788,1.889,1.748,1.673,1.7450000000000001,1.774,1.738,1.6839999999999999,1.714,2.044,1.7190000000000001,1.339,1.284,1.7330000000000001,1.9750000000000001,1.901,1.716,1.7929999999999999,1.9159999999999999,1.951689,1.7885360000000001,1.425942,1.8739959999999998,1.8842269999999999,1.793625,1.9180200000000001,1.781137,1.8583879999999999,1.8552709999999999,1.816025,1.7397629999999999,1.9466280000000002,1.574211,2.0290839999999997,1.8897650000000001,1.7445100000000002,1.2875479999999999,1.8613710000000001,1.9854320000000001,1.898779,1.9204680000000001,1.5768740000000001,1.934561,1.8886969999999998,1.9045989999999999,1.9596230000000001,1.8877579999999998,1.714456,1.8940679999999999,1.8841489999999999,2.1095300000000003,1.7999609999999999,1.943646,1.7119579999999999,1.8234300000000001,1.990993,1.7526979999999999,2.0312739999999998,1.8453709999999999,2.060721,2.0440679999999998,1.954216,2.0576880000000002,1.868215,1.6947139999999998,1.8682590000000001,2.004572,0.126051,0.22952900000000001,0.27410599999999996,0.39638100000000026,0.47843600000000014,0.47939100000000001,0.5380640000000001,0.53365199999999957,0.48980900000000005,0.41930600000000023,0.31798800000000005,0.27873900000000007,0.33177200000000012,0.40585699999999975,0.56218699999999999,0.71534800000000021,0.85679699999999903,0.97693399999999941,1.1408959999999975,1.0179979999999982,0.91532600000000108,0.80906499999999926,0.5318040000000005,0.66612099999999963,0.57597900000000002,0.83336899999999914,1.1270059999999986,1.3765969999999994,1.6380649999999966,1.9365689999999964,2.0151259999999924,2.030071999999997,1.8506319999999978,1.7061280000000048,1.3758539999999999,1.3286139999999964,1.3100380000000011,1.5964899999999982,2.7521050000000016,2.9168830000000008,3.6370650000000015,4.27022700000001,4.3964089999999914,4.5427230000000041,4.2910249999999994,3.9432079999999976,3.2481789999999919,3.1839970000000024,2.5656399999999966,4.3413879999999949,5.1637430000000002,7.3147159999999678,8.7745119999999783,10.192,11.021000000000001,13.52,11.63,9.9489999999999998,8.077,9.8260000000000005,9.6859999999999999,12.005000000000001,20.550999999999998,24.491,34.18,38.843000000000004,49.655000000000001,53.862000000000002,58.231000000000002,55.534999999999997,52.622,52.915999999999997,57.420999999999999,70.549000000000007,104.43300000000001,126.235,131.75399999999999,189.70699999999999,232.23400000000001,288.11200000000002,317.11099999999999,320.166,324.32100000000003,244.02699999999999,248.703,380.17399999999998,508.66199999999998,546.45500000000004,647.31700000000001,618.52800000000002,690.86199999999997,637.125,492.28899999999999,482.28500000000003,345.4,231.20500000000001,248.57499999999999,289.95,458.21699999999998,565.84,683.24800000000005,656.76599999999996,752.89,691.53200000000004,605.38800000000003,525.85500000000002,364.05200000000002,297.46899999999999,335.96800000000002,481.24700000000001,508.38400000000001,631.45399999999995,716.11800000000005,776.89800000000002,821.81,766.36800000000005,702.33399999999995,601.93499999999995,344.35599999999999,404.81599999999997,482.68,635.51400000000001,736.94500000000005,627.60400000000004,826.20899999999995,839.14599999999996,902.62699999999995,826.45399999999995,658.33399999999995,566.62,350.38200000000001,377.38600000000002,418.75299999999999,500.80700000000002,531.45600000000002,725.43600000000004,832.56,886.25199999999995,929.53700000000003,856.80600000000004,724.78499999999997,603.79,490.22800000000001,417.62799999999999,352.69099999999997,405.78500000000003,697.63,753.26400000000001,882.48699999999997,862.84699999999998,910.00900000000001,871.50300000000004,655.16399999999999,616.97400000000005,362.10700000000003,431.96300000000002,493.21899999999999,469.24299999999999,677.68200000000002,718.22900000000004,880.72199999999998,848.48,888.93600000000004,793.673,691.73900000000003,510.30200000000002,503.19499999999999,369.37799999999999,337.68900000000002,452.57799999999997,673.92200000000003,685.28800000000001,767.18,879.03399999999999,873.69399999999996,852.92600000000004,727.70899999999995,551.64400000000001,399.34500000000003,353.03100000000001,447.18799999999999,450.58679999999998,"-","-","-","-","-","-","-","-","-","-"]
[null,"Solar térmica","-","-","-","-","-","-","-","-","-","-","-","-","-","-","-","-","-","-","-","-","-","-","-","-","-","-","-","-","-","-","-","-","-","-","-","-","-","-","-","-","-","-","-","-","-","-","-","-","-","-","-","-","-","-","-","-","-","-","-","-","-","-","-","-","-","-","-","-","-","-","-","-","-","-","-","-","-","-","-","-","-","-","-","-","-","-","-","-","-","-","-","-","-","-","-","-","-","-","-","-","-","-","-","-","-","-","-","-","-","-","-","-","-","-","-","-","-","-","-","-","-","-","-","-","-","-","-","-","-","-","-","-","-","-","-","-","-","-","-","-","-","-","-","-","-","-","-","-","-","-","-","-","-","-","-","-","-","-","-","-","-","-","-","-","-","-","-","-","-","-","-","-","-","-","-","-","-","-","-","-","-","-","-","-","-","-","-","-","-","-","-","-",0,0,0,0,0,0,0,0,0,0,0,0,0,0,0.43099999999999999,0.34200000000000003,0.55800000000000005,0.88300000000000001,1.256,1.1160000000000001,0.63900000000000001,1.214,0.997,0.191,1.0840000000000001,0.79700000000000004,1.4610000000000001,0.95799999999999996,0.94199999999999995,1.9630000000000001,2.0379999999999998,1.98,0.85899999999999999,0.86599999999999999,1.27,1.1599999999999999,0.69,1.236,2.323,7.2039999999999997,7.6580000000000004,6.7519999999999998,12.414,23.867999999999999,17.539000000000001,23.446000000000002,16.183,10.51,13.151999999999999,11.682,23.731999999999999,36.92,69.084000000000003,72.531999999999996,104.59,121.9,100.917,71.745000000000005,31.619,33.747,34.25,88.656999999999996,98.456999999999994,137.833,154.07300000000001,232.48400000000001,284.20800000000003,235.32900000000001,228.55799999999999,172.91200000000001,80.436999999999998,85.159000000000006,117.342,200.34200000000001,235.113,177.77699999999999,348.38200000000001,414.74900000000002,541.31700000000001,485.12700000000001,368.64299999999997,285.79500000000002,133.96199999999999,135.58500000000001,113.494,204.00899999999999,125.37,300.89400000000001,499.26799999999997,647.33000000000004,758.52300000000002,661.85599999999999,478.95499999999998,294.24200000000002,199.22399999999999,158.36199999999999,79.801000000000002,103.265,385.17500000000001,435.52699999999999,729.93600000000004,687.28800000000001,811.15300000000002,833.178,389.596,289.33699999999999,90.186999999999998,124.47199999999999,176.95099999999999,190.92500000000001,415.82900000000001,393.16,694.83900000000006,734.05399999999997,888.91800000000001,607.62300000000005,483.25,188.16900000000001,226.81800000000001,84.698999999999998,59.914000000000001,133.02699999999999,387.89600000000002,408.32299999999998,498.49200000000002,813.99099999999999,825.32500000000005,805.81899999999996,595.62699999999995,284.70100000000002,139.69999999999999,118.872,149.214,122.50689999999999,"-","-","-","-","-","-","-","-","-","-"]
[null,"Térmica renovable/Otras renovables","-","-","-","-","-","-","-","-","-","-","-","-","-","-","-","-","-","-","-","-","-",0.47899999999999998,0.19500000000000001,0.18,0.22600000000000001,0.185,0.20899999999999999,0.186,0.219,2.4910000000000001,0.85499999999999998,1.6519999999999999,2.1949999999999998,3.1859999999999999,2.8519999999999999,2.2930000000000001,2.7469999999999999,4.2910000000000004,5.55,5.08,5.1909999999999998,4.069,4.4050000000000002,5.0549999999999997,4.7699999999999996,5.9989999999999997,6.5289999999999999,5.1360000000000001,6.1820000000000004,4.2009999999999996,7.7879999999999994,12.483000000000001,22.434000000000001,14.593,25.895,34.064,35.963000000000001,40.081000000000003,55.064999999999998,63.701000000000001,52.516000000000005,54.168999999999997,59.649000000000001,59.275000000000006,60.629999999999995,38.39,56.09,56.16,55.471000000000004,65.760999999999996,51.017000000000003,62.140999999999998,61.97,55.767000000000003,73.194000000000003,69.39,67.606999999999999,74.480999999999995,76.311000000000007,76.088999999999999,74.905000000000001,70.728000000000009,57.923000000000002,56.715000000000003,56.474000000000004,46.637,55.156000000000006,57.041000000000004,57.334000000000003,33.856000000000002,57.003,53.271999999999998,57.103999999999999,61.066000000000003,58.17,55.262,29.002800999999998,53.305843000000003,61.54951100000001,62.649002999999993,69.878224000000017,68.57453000000001,70.406914,67.345651000000004,60.385233999999997,67.235011999999998,69.010128999999992,69.403475,71.806641999999997,67.74066400000001,76.241169000000014,70.55664800000001,71.228352999999998,64.031021999999993,80.270443,79.088937999999999,85.153421000000009,84.480839000000003,82.713457999999989,74.942079000000007,77.705164000000011,72.094493,81.578700000000012,75.639544999999998,57.155141000000015,64.878718000000006,80.062335000000004,78.219893000000013,86.225769,91.935601000000005,96.959690999999992,98.655336000000005,114.03217000000001,103.259727,115.38466,106.780576,116.22663500000002,163.25343300000003,164.15603399999998,142.64494099999999,174.91251699999998,184.36809099999999,170.80096299999997,182.63868100000002,102.326662,103.97290799999999,114.93776699999999,113.40504600000001,116.82101699999998,106.527145,125.927582,138.27553399999999,128.41537399999999,130.56901199999999,128.796967,143.04027199999999,125.499869,125.666718,141.367661,136.22556399999999,148.43464900000001,135.67495399999999,145.85112000000001,152.32964200000001,154.93832699999999,162.073384,144.46359000000001,164.51626000000002,165.78169199999999,141.425287,163.310002,158.00111900000002,158.15428799999998,141.57013900000001,142.66767899999999,139.21697600000002,148.774135,152.85692900000001,147.72687300000001,158.60851299999999,174.85460999999998,150.82777100000001,176.75611499999999,159.635672,172.11730599999999,162.54098200000001,167.51991400000003,173.00340799999998,160.25450599999999,152.959924,165.98202600000002,171.40583599999999,172.08671999999999,164.50467899999998,179.21714800000001,172.15726300000003,184.66687200000001,201.17400000000001,194.67,180.72499999999999,181.291,197.31100000000001,176.12700000000001,178.67599999999999,195.417,170.86799999999999,196.96199999999999,184.11799999999999,197.114,193.24700000000001,203.05199999999999,202.649,191.273,224.429,204.15700000000001,212.399,218.304,215.69800000000001,223.7,221.483,218.887,220.45099999999999,223.50399999999999,218.31,211.55500000000001,229.72499999999999,225.65600000000001,224.21600000000001,243.68600000000001,231.25299999999999,252.346,275.29700000000003,250.078,229.126,236.274,235.85900000000001,264.07600000000002,325.339,249.01,251.94300000000001,250.94,226.42400000000001,245.99799999999999,252.761,274.92500000000001,268.96100000000001,268.02999999999997,278.80399999999997,262.93700000000001,279.28699999999998,269.12099999999998,293.61099999999999,357.05099999999999,328.661,349.27699999999999,351.05500000000001,328.80399999999997,335.64499999999998,357.9,355.29899999999998,375.1,383.14,375.33800000000002,387.57100000000003,393.7,372.92,398.17899999999997,371.93,360.83499999999998,406.08199999999999,421.35399999999998,400.50700000000001,373.05,413.07400000000001,400.88299999999998,433.63499999999999,435.82100000000003,414.99700000000001,452.92399999999998,421.41500000000002,437.99700000000001,392.45299999999997,431.91300000000001,417.43799999999999,398.00200000000001,404.68900000000002,413.637,444.28,423.54599999999999,331.35399999999998,365.40100000000001,338.69600000000003,410.02199999999999,406.22699999999998,411.334,445.07,422.226,387.61500000000001,372.54199999999997,403.94499999999999,239.40199999999999,205.804,234.04400000000001,179.708,226.202,276.375,299.334,311.42200000000003,301.42899999999997,310.14600000000002,303.68599999999998,286.399,268.935,260.66199999999998,254.62100000000001,209.02600000000001,276.34399999999999,286.863,310.57,326.46499999999997,307.17099999999999,305.92099999999999,304.16199999999998,305.779,326.20299999999997,299.2371,"-","-","-","-","-","-","-","-","-","-"]
[null,"Térmica no renovable/Cogeneración y resto/Cogeneración",35.685000010000024,38.351000019999979,45.945000009999994,29.542999990000006,39.724000039999993,36.553999999999988,59.265999999999998,54.415999989999989,70.548000009999996,79.426000009999981,86.149999990000012,79.248999989999987,95.989000000000019,93.531000000000006,115.05600000000001,116.111,113.29,97.624000000000009,119.55,109.12599999999999,134.50700000000001,150.72200000000001,140.30100000000002,150.17699999999999,158.54399999999998,156.649,153.35299999999998,133.67700000000002,150.357,147.03700000000003,147.13500000000008,155.59799999999998,159.136,169.63300000000004,179.52700000000002,192.23599999999996,216.233,207.39499999999998,238.97599999999997,228.40900000000002,230.78099999999998,243.42200000000008,273.03300000000002,222.17500000000004,290.86800000000005,356.51100000000002,393.02699999999999,406.67399999999998,424.01199999999994,397.50999999999993,428.83,427.68300000000005,448.76199999999989,440.01700000000005,418.09199999999998,419.03999999999996,459.93099999999993,463.43,473.75599999999997,509.86099999999993,487.31499999999994,460.59999999999997,536.87400000000002,512.53700000000003,529.81599999999992,521.28200000000004,523.27700000000004,508.96500000000009,558.12299999999993,603.70000000000005,623.61300000000006,655.50600000000009,647.52800000000002,672.755,691.91100000000006,719.59100000000012,705.5920000000001,706.62599999999986,762.26099999999985,719.4380000000001,744.74899999999991,826.2940000000001,869.50599999999997,905.697,905.78699999999992,825.31200000000001,927.09299999999985,909.4430000000001,931.09299999999996,900.9190000000001,982.44500000000005,908.52100000000007,945.76900000000001,1076.894,1049.2929999999999,1080.356,1130.5614119999998,1053.6083319999996,1178.169508,1138.7002010000001,1141.59358,1070.268849,1167.7396610000001,1088.8362390000002,1174.696929,1305.1916329999999,1293.7680009999999,1404.6300859999999,1377.9822690000005,1317.095178,1434.1807190000002,1382.954972,1423.7102580000001,1389.789683,1433.1422839999998,1348.4750739999999,1394.1439269999998,1535.5715799999998,1508.6560429999997,1571.2621960000004,1566.1007729999992,1436.0604689999998,1553.7609449999995,1467.7180370000005,1467.5181360000004,1425.027648,1438.0621490000001,1346.5350600000002,1375.0630779999997,1449.8963950000002,1350.1663200000003,1482.3937460000004,1508.0458580000004,1419.3187329999998,1478.4091740000003,1390.3025219999997,1476.9975669999997,1416.2512219999996,1479.7483969999998,1313.1858809999999,1434.3355369999999,1553.1139320000002,1585.864227,1579.5819869999993,1753.946643,1624.3835650000003,1752.2777950000002,1751.5292130000003,1747.5227730000001,1607.2819760000004,1731.7671800000005,1586.2397010000004,1675.7063240000002,1903.9247169999992,1846.9618950000001,1850.1104539999997,1949.8964009999988,1795.4542350000002,1917.1289360000001,1863.5466960000015,1892.4928639999987,1805.7993700000002,1913.7958340000005,1744.9618859999998,1903.9135469999999,2075.8847029999993,1958.6965669999997,2023.7759399999993,2046.9260369999997,1962.1146819999997,2107.6563920000017,1979.8427870000005,1934.4913119999985,1817.9965729999983,1921.3405109999997,1769.4697020000003,1826.6772020000005,1981.9419189999987,2074.2319539999994,2106.015132,2043.0234940000005,1951.7983550000013,2095.8113329999996,2039.9988199999989,2040.2971259999995,1919.5815079999988,1935.7391630000006,1786.1623980000002,1917.1898449999997,1838.2194279999994,1867.2426009999992,1828.6396120000024,1998.0738359999998,1940.3785669999995,2060.4519410000007,1910.7046299999986,1907.4363910000006,1747.2180000000001,1731.357,1635.847,1728.153,1850.3889999999999,1883.634,1925.296,1984.567,1757.03,1865.8879999999999,1831.5619999999999,1829.89,1893.941,1990.347,1868.579,1956.135,2102.7629999999999,2100.0659999999998,2146.989,2251.9169999999999,2226.8589999999999,2271.9859999999999,2229.3420000000001,2106.663,2078.8119999999999,2217.9769999999999,2016.6590000000001,2177.9,2358.9569999999999,2314.2759999999998,2324.6280000000002,2421.9630000000002,2242.4059999999999,2406.6460000000002,2338.3670000000002,2351.1260000000002,2309.7330000000002,2396.5940000000001,2034.3920000000001,2337.3000000000002,2464.42,2571.2600000000002,2591.7269999999999,2661.2139999999999,2477.0210000000002,2616.777,2550.3539999999998,2581.357,2541.7829999999999,2613.6729999999998,2153.4079999999999,2523.7640000000001,2647.1170000000002,2659.6819999999998,2762.902,2780.759,2596.0859999999998,2880.4789999999998,2687.991,2721.65,2576.5790000000002,2636.97,2201.011,2634.4760000000001,2759.1210000000001,2749.1669999999999,2826.723,2930.7240000000002,2780.5949999999998,2916.4430000000002,2814.6729999999998,2845.8359999999998,2681.83,2782.808,2350.1129999999998,2741.203,2903.6280000000002,2845.6439999999998,2899.3670000000002,3001.223,2689.5259999999998,2882.2240000000002,2782.855,2818.268,2650.7829999999999,2656.915,2097.047,2558.0140000000001,2616.5500000000002,2613.4690000000001,2669.8510000000001,2680.59,1980.6980000000001,1893.6320000000001,1709.93,2060.306,2193.4499999999998,2250.8989999999999,2101.0030000000002,2253.2530000000002,2263.2739999999999,2067.924,2140.5770000000002,2222.8029999999999,1961.5309999999999,2117.5819999999999,2033.1849999999999,2122.1669999999999,2073.4119999999998,2167.2449999999999,2041.69,2153.7280000000001,2214.8960000000002,2129.212,2180.5239999999999,2128.3229999999999,1967.5139999999999,2069.36,1992.35,2113.674,2167.4059999999999,2239.6550000000002,2110.4859999999999,2121.1590000000001,2290.3249999999998,2260.5680000000002,2294.5210000000002,2446.0889999999999,2124.4309700000003,"-","-","-","-","-","-","-","-","-","-"]
[null,"Residuos","-","-","-","-","-","-","-","-","-","-","-","-","-","-","-","-","-","-","-","-","-","-","-","-","-","-","-","-","-","-","-","-","-","-","-","-","-","-","-","-","-","-","-","-","-","-","-","-","-","-","-","-","-","-","-","-","-","-","-","-","-","-","-","-","-","-","-","-","-","-","-","-","-","-","-","-","-","-","-","-","-","-","-","-","-","-","-","-","-","-","-","-","-","-","-","-","-","-","-","-","-","-","-","-","-","-","-","-","-","-","-","-","-","-","-","-","-","-","-","-","-","-","-","-","-","-","-","-","-","-","-","-","-","-","-","-","-","-","-","-","-","-","-","-","-","-","-","-","-","-","-","-","-","-","-","-","-","-","-","-","-","-","-","-","-","-","-","-","-","-","-","-","-","-","-","-","-","-","-","-","-","-","-","-","-","-","-","-","-","-","-","-","-","-","-","-","-","-","-","-","-","-","-","-","-","-","-","-","-","-","-","-","-","-","-","-","-","-","-","-","-","-","-","-","-","-","-","-","-","-","-","-","-","-","-","-","-","-","-","-","-","-","-","-","-","-","-","-","-","-","-","-","-","-","-","-","-","-","-","-","-","-","-","-","-","-","-","-","-","-","-","-","-","-","-","-","-","-","-","-","-","-","-","-","-","-","-","-","-","-","-","-","-","-","-","-","-","-","-","-",242.70699999999999,222.54499999999999,256.03300000000002,187.488,242.40100000000001,255.27199999999999,270.19799999999998,271.27199999999999,257.48399999999998,276.35199999999998,263.34399999999999,242.27500000000001,258.16000000000003,235.71,266.61599999999999,206.11699999999999,161.27600000000001,250.70699999999999,306.59100000000001,303.47000000000003,299.04500000000002,290.08800000000002,270.06200000000001,271.11900000000003,281.59300000000002,248.97020000000001,"-","-","-","-","-","-","-","-","-","-"]
[null,"Régimen especial",141.79200000000003,130.85599999999999,110.85499999999999,120.56100000000001,123.92100000000001,127.973,114.985,112.23399999999999,104.691,149.22999999999996,196.36700000000002,206.21100000000001,275.31900000000002,216.48500000000001,330.279,306.78200000000004,308.685,242.41800000000001,219.29500000000002,189.72699999999998,212.86,245.32300000000001,282.755,314.55600000000004,285.17700000000002,247.5,268.75799999999998,327.11599999999999,345.47399999999999,354.65800000000002,330.49400000000003,277.137,281.71799999999996,391.42700000000002,419.33100000000002,501.83100000000002,435.02800000000002,344.32899999999995,424.45699999999999,433.51,489.60199999999998,463.64800000000002,437.68200000000002,338.11900000000003,410.58300000000003,614.22900000000004,635.89800000000002,670.23699999999997,780.75599999999997,683.31600000000003,707.5,666.92600000000004,731.27399999999989,633.452,562.51599999999996,561.60799999999995,609.38099999999986,683.06600000000003,776.58699999999999,801.48299999999995,878.25299999999993,845.43299999999999,906.18799999999999,753.601,777.85899999999992,712.86300000000006,710.02200000000005,670.61700000000008,740.79899999999998,786.89800000000002,820.03300000000002,993.24900000000002,1162.1320000000001,1146.085,1156.348,1188.528,1146.9380000000001,1052.6459999999997,1062.9259999999999,987.04100000000005,1005.7759999999998,1110.6640000000002,1195.931,1440.752,1444.364,1274.8150000000001,1298.0549999999998,1240.75,1290.856,1258.2090000000001,1353.0540000000001,1209.009,1241.296,1363.396,1492.9119999999998,1694.2820000000002,1739.9590000000001,1521.155,1668.366,1703.8360000000002,1713.3689999999997,1529.2809999999999,1560.788,1486.4090000000001,1509.5250000000001,1726.7439999999997,1696.8150000000001,1877.0809999999997,1935.1690000000003,1893.6849999999999,2093.1260000000002,1995.1179999999999,2112.9699999999993,1963.846,1916.982,1758.6969999999999,1864.2,2095.7350000000001,2272.375,2359.3200000000002,2281.125,2087.6099999999997,2224.8949999999995,2397.0500000000002,2247.973,2215.5740000000001,2134.3539999999998,1941.982,1898.067,2183.652,2360.4690000000001,2667.78,2777.721,2583.982,2847.0219999999999,2638.6170000000002,2496.33,2343.2169999999996,2346.5549999999998,2059.681,2404.2600000000002,2516.4549999999999,2749.7919999999999,2514.8249999999998,2769.3290000000006,2782.5929999999998,3008.7979999999998,2845.49,3105.471,2718.4439999999995,2787.6880000000001,2533.5370000000003,2514.3940000000002,3184.5339999999997,3423.8519999999999,3773.848,4052.0929999999998,3372.585,3459.5360000000001,3670.7669999999998,3473.2809999999999,3005.2700000000004,3066.107,2651.7280000000001,3049.9429999999998,3635.4399999999996,3762.45,4201.009,4486.6239999999998,3606.45,4061.165,4205.6360000000004,3686.183,3422.4589999999998,3372.5169999999998,3284.3040000000001,3324.7780000000002,4017.3730000000005,4064.2809999999999,4336.518,4449.1660000000002,4141.7659999999996,4425.3990000000013,4594.518,4146.83,3645.3069999999998,3963.152,3795.1989999999996,3504.3919999999998,4115.7539999999999,4372.4039999999995,4813.0120000000006,4136.9859999999999,4354.97,5600.1589999999997,4552.1329999999998,4131.47,3571.5460000000003,3335.1880000000001,4185.7280000000001,3551.03,4704.8550000000005,4729.2420000000002,4780.0340000000006,4684.9660000000003,5290.6179999999995,5686.107,3926.5880000000002,5176.8050000000003,4326.1189999999997,4435.1310000000003,4802.5259999999998,4421.2670000000007,4478.4539999999997,5300.027,5019.518,5520.4,4766.0689999999995,6995.3640000000005,6511.8150000000005,4808.6859999999997,5157.9969999999994,5180.3989999999994,4762.165,5049.59,5582.25,6728.3320000000003,6981.8389999999999,6939.8959999999988,6710.8409999999994,6830.3380000000016,6728.4230000000007,6531.3249999999998,5964.9210000000003,6127.6260000000002,5449.7309999999998,5820.8040000000001,6651.63,8440.5329999999994,8615.2309999999998,8230.3429999999989,8244.09,8676.030999999999,6730.8899999999994,7916.2909999999993,6725.1869999999999,6996.918999999999,6482.1360000000004,6075.3789999999999,7795.7240000000011,8240.1929999999993,8711.7860000000001,8190.326,8029.1170000000002,9183.4500000000007,7795.87,7575.8050000000003,7264.0609999999997,7739.7789999999986,6592.2860000000001,6499.0079999999998,7255.6150000000007,7792.6769999999997,8741.6519999999982,7906.7839999999997,9335.7169999999987,8417.0960000000014,9766.6550000000007,8731.3009999999995,8210.5709999999999,7967.7449999999999,7453.9480000000003,8277.4499999999989,7568.4219999999987,8746.0639999999985,9915.9060000000009,10928.153999999999,9838.2579999999998,10583.358,9472.7510000000002,9300.2900000000009,9062.7089999999989,8156.0420000000004,7846.9150000000009,7676.938000000001,8225.8140000000003,10668.998,9145.1359999999986,"-","-","-","-","-","-","-","-","-","-","-","-","-","-","-","-","-","-","-","-","-","-","-","-","-","-","-","-","-","-","-","-","-","-","-","-","-","-","-","-","-","-","-","-","-","-","-","-"]
[null,"Generación",13068.148999999999,10712.420999999998,11526.93,10577.741999999998,10584.957,10924.121000000001,11576.189000000002,10205.642,10945.187000000004,11117.694000000001,11786.233000000002,12993.084000000001,13514.698999999999,12300.103999999999,11755.675000000001,11287.504999999999,11439.315999999997,11005.69,11985.769,10503.418000000001,11479.372000000003,11793.966999999997,12189.305999999997,12628.902000000002,14156.68,12984.095000000001,12650.637999999999,11288.930999999999,11148.397000000001,10639.671999999999,12196.982,10732.736000000003,11459.954,11873.681,11696.458000000001,12362.295999999998,13140.405000000001,11813.756000000001,12465.810999999996,11039.029999999997,11048.340000000002,11073.045000000002,11743.634000000002,10934.771000000001,11386.860999999999,11939.680999999999,12382.942999999996,12858.573999999997,13466.398999999999,12265.461000000001,12065.962999999996,11587.729999999998,11675.843999999997,11945.080000000002,12785.071,11534.760999999999,11819.752,11663.625,11974.652,12946.662000000004,13831.879000000003,11863.992000000002,13066.031999999999,11607.471000000005,12152.261999999997,12204.221,12851.400000000001,11855.100999999999,12021.492999999999,12106.901000000002,12398.127999999999,13367.203999999998,14632.868999999999,13945.298000000003,13471.495000000001,11789.804999999997,12359.221,12561.456999999999,13248.592999999999,11954.499999999998,12277.069000000001,13045.433000000003,13347.524000000001,14037.838,15527.942000000001,12746.785000000002,13176.473999999998,13369.68,13595.045,13407.127999999999,14362.291000000003,13603.636000000002,13935.166999999999,13886.026,14129.524000000001,15455.874,15109.875,13490.18,14087.417000000001,13538.296999999999,13540.958000000002,13971.812000000002,15202.644999999999,13813.061,14383.620999999999,14269.794000000002,14631.217000000001,16198.317000000001,16393.576000000001,14943.591999999999,15171.591,13533.998,14228.531000000001,14665.97,15959.913,14400.723999999998,15119.387999999999,15000.137000000001,15946.373,16895.771000000001,18017.434000000001,15585.119999999999,16304.345999999998,15194.267,15498.644000000002,16248.064,16637.700999999997,15672.647000000001,15915.037,15880.278,16856.034,17647.403999999999,18866.727000000003,16777.413,17710.691000000003,15284.262000000001,16326.837000000001,16839.431,17514.252,16757.473000000002,16576.550000000003,16954.269,17739.712,18941.038,19462.333000000002,16854.197,17381.063999999998,16757.014999999999,17493.512000000002,17815.728999999999,18588.489999999998,16916.016000000003,17135.423000000003,17907.848000000002,17931.371000000003,18946.023000000001,20760.522000000001,19099.053,18638.846999999998,17263.099000000002,17888.824999999997,18917.374,20237.305,19058.73,18462.04,19062.331999999999,19229.073,20636.550000000003,21054.75,20055.496999999999,21160.099000000002,19211.657999999999,19216.088000000003,20130.009999999998,21300.502999999997,19825.388999999999,19739.351000000002,19876.998000000003,20615.838,21424.022000000001,22692.537,21115.352000000003,21470.211000000003,19432.025000000001,19670.705000000002,20959.040999999997,22200.637999999999,20168.888999999999,20510.814999999999,20377.224999999999,21805.759999999995,23481.207000000002,24399.52,22365.761999999995,23141.827999999998,18945.896999999997,20667.129000000001,21482.522000000004,23929.236000000004,20940.143,21636.495999999999,21226.624,21411.327999999994,23455.364999999998,24436.344000000001,21814.576999999997,23193.162,20815.392,21756.008000000002,21659.671999999999,23475.06,21797.809999999998,22091.448,22685.046999999999,23948.771999999997,24945.221000000001,25320.773000000001,23621.495999999999,23913.153000000002,23007.167000000001,21918.263999999996,22418.224999999999,24401.398000000001,22716.502,22244.034,22523.435000000001,23406.497000000003,24556.807000000001,25160.519,21751.801000000003,21400.016000000003,20032.678,20326.695,21533.944000000003,23610.472000000002,22211.13,21366.215,21550.292999999998,21938.98,23657.671999999999,24812.236949999999,22971.826116999997,23920.343546,20967.048649999997,21245.380482,21489.927739999999,24344.854098,22445.849581999999,21899.867311999998,22140.174218,22927.362636000002,24152.540386999997,24710.124011,22054.460385999999,23847.583832,20625.836520000001,20738.566499,21285.127074,22641.276056000002,21967.066923999999,21745.583556000001,21022.203359000003,21519.593234,22745.546412,24067.309934000001,24793.077000000001,22663.235934,21290.339390999998,21518.230277999999,21735.358605999998,22622.544175999999,22527.800099,21370.043221,21641.278331000001,21532.294934000001,23045.460977999999,23724.100234000001,21845.156328000001,22785.279988000002,20870.713443999997,20115.582750000001,19999.866823,23100.184914999998,21514.794122000003,20853.566215999999,20874.065822,21807.968000000001,22835.617977999998,22982.070962999998,21582.603137999999,21758.094467999999,20006.760168000001,20255.563363000001,20336.119063999999,21997.307011999997,20794.002111999998,20960.885338,20499.429811000002,20187.982,22216.99,23543.711309999999,22227.605736999998,22159.998822999998,19640.604163,20140.069153,20653.931989000001,24003.060739,21603.896495999998,20125.944618000001,19765.073669000001,19935.460170000002,20587.992622999998,21605.330160999998,20700.272111000002,22024.900907000003,20703.040677000001,19548.299749999998,19479.71329,21601.288239000001,20709.636567000001,19928.748281,20570.204914000002,20663.633508999999,20790.729010000003,24083.15094,19881.208600000002,"-","-","-","-","-","-","-","-","-","-"]
[null,"Consumos en bombeo",-230.679,-122.288,-14.289,-28.145,-43.485999999999997,-13.114000000000001,-22.103999999999999,-49.978000000000002,-160.71299999999999,-155.501,-44.506999999999998,-154.46799999999999,-268.90800000000002,-218.38300000000001,-171.68600000000001,-12.201000000000001,-15.629,-41.384,-57.712000000000003,-72.09,-112.773,-80.879000000000005,-188.52699999999999,-192.56100000000001,-261.99200000000002,-144.315,-170.44,-297.59300000000002,-198.61500000000001,-246.85400000000001,-277.39299999999997,-274.77800000000002,-274.41399999999999,-292.15699999999998,-181.749,-170.405,-138.74100000000001,-112.68899999999999,-188.994,-202.54400000000001,-227.06899999999999,-134.422,-139.846,-190.28299999999999,-202.364,-190.64699999999999,-85.039000000000001,-74.921000000000006,-304.07600000000002,-125.633,-16.009,-34.588999999999999,-53.005000000000003,-40,-112.842,-29.006,-168.63399999999999,-188.04300000000001,-112.602,-160.94999999999999,-229.93299999999999,-151.828,-149.91399999999999,-139.09899999999999,-126.803,-126.251,-163.94499999999999,-157.261,-174.29900000000001,-178.249,-166.69,-317.45400000000001,-761.34500000000003,-190.41399999999999,-30.027000000000001,-33.853000000000002,-44.027999999999999,-72.870999999999995,-66.353999999999999,-12.074,-23.202999999999999,-39.189,-69.679000000000002,-179.58099999999999,-252.93600000000001,-37.277999999999999,-12.262,-21.497,-81.885999999999996,-85.456999999999994,-118.164,-176.339,-190.05099999999999,-144.696,-266.06099999999998,-374.262,-277.15499999999997,-134.83799999999999,-111.211,-214.86099999999999,-181.761,-114.55800000000001,-203.37299999999999,-319.92500000000001,-193.376,-171.72300000000001,-213.786,-451.18700000000001,-468.77199999999999,-342.76100000000002,-234.381,-215.75899999999999,-219.82599999999999,-177.636,-214.518,-260.83800000000002,-340.93099999999998,-489.76400000000001,-316.02600000000001,-385.16800000000001,-368.59199999999998,-313.25400000000002,-345.67200000000003,-513.572,-617.92600000000004,-330.21499999999997,-323.44200000000001,-246.34100000000001,-256.83199999999999,-362.529,-451.67700000000002,-776.83399999999995,-539.07299999999998,-307.35899999999998,-387.49700000000001,-200.959,-214.62100000000001,-258.66300000000001,-303.01100000000002,-291.53199999999998,-368.74900000000002,-364.09899999999999,-336.14600000000002,-559.55499999999995,-652.85199999999998,-506.24200000000002,-466.28899999999999,-443.39299999999997,-559.45699999999999,-628.45799999999997,-699.81299999999999,-572.27200000000005,-597.97400000000005,-575.56700000000001,-570.42200000000003,-683.94299999999998,-587.33500000000004,-379.733,-368.65,-218.7,-265.99099999999999,-415.71499999999997,-419.84399999999999,-472.31900000000002,-437.02499999999998,-390.30099999999999,-322.12400000000002,-400.39699999999999,-404.81700000000001,-276.12,-339.00299999999999,-328.995,-393.37799999999999,-425.60700000000003,-408.31200000000001,-386.44200000000001,-387.786,-411.48399999999998,-358.57499999999999,-484.18799999999999,-553.09,-432.93799999999999,-492.58699999999999,-450.62,-643.06799999999998,-634.52700000000004,-693.31299999999999,-446.08,-519.71799999999996,-482.77600000000001,-454.59100000000001,-553.63900000000001,-586.44100000000003,-529.91899999999998,-374.92099999999999,-305.80099999999999,-313.70299999999997,-370.08100000000002,-513.35599999999999,-400.35399999999998,-486.57299999999998,-541.52300000000002,-541.572,-384.12900000000002,-371.77600000000001,-395.87900000000002,-384.16800000000001,-293.39699999999999,-397.62200000000001,-356.25400000000002,-333.52100000000002,-371.38200000000001,-345.92500000000001,-317.00099999999998,-384.15499999999997,-481.20699999999999,-430.83600000000001,-419.30500000000001,-401.79399999999998,-219.05799999999999,-206.07300000000001,-285.255,-253.78200000000001,-190.80199999999999,-226.55600000000001,-297.14499999999998,-411.25599999999997,-460.64,-492.22699999999998,-392.03500000000003,-281.47199999999998,-255.75899999999999,-247.49799999999999,-224.59399999999999,-241.018,-245.006,-254.49299999999999,-284.12299999999999,-397.50099999999998,-478.46300000000002,-756.58548100000007,-554.72222199999999,-544.66441799999996,-303.16059899999999,-279.94919199999998,-230.155124,-199.16812999999999,-231.14395499999998,-233.69566899999998,-346.11598499999997,-322.22366899999997,-456.19813299999998,-430.91918800000002,-280.66478600000005,-347.70577100000003,-297.00992200000002,-158.92510200000001,-139.95152400000001,-173.53430600000002,-181.06439699999999,-176.06341800000001,-301.62591900000001,-325.48060800000002,-402.01487400000002,-448.91067399999997,-444.12264199999998,-429.06647600000002,-565.84194300000001,-360.20398999999998,-322.06323800000001,-285.67122799999999,-365.72605300000004,-454.578665,-397.03421900000001,-403.31192900000002,-546.01673100000005,-697.63724999999999,-562.65698600000007,-1052.4229879999998,-872.86187399999994,-452.79265899999996,-384.57999899999999,-256.57863700000001,-231.78292800000003,-211.57028500000001,-305.59618699999999,-348.25588500000003,-581.10931200000005,-858.01401699999997,-633.18831499999999,-524.05132400000002,-508.09411,-434.99119899999999,-325.47192799999999,-239.80621400000001,-218.068423,-215.90781899999999,-408.39204999999998,-518.48742099999993,-445.117231,-479.60648900000001,-543.86398299999996,-478.82839000000001,-406.19568500000003,-422.73500000000001,-154.35719500000002,-167.860691,-301.47133700000001,-245.09551099999999,-374.45159699999999,-436.89324499999998,-508.73505599999999,-897.23722699999996,-716.42767700000002,-590.25587100000007,-584.07853499999999,-474.71409,-210.517944,-141.61362500000001,-157.40858300000002,-122.319526,-229.38049699999999,-352.86669000000001,-342.59280999999999,-433.831684,-458.08479999999997,"-","-","-","-","-","-","-","-","-","-"]
[null,"Enlace Península-Baleares","-","-","-","-","-","-","-","-","-","-","-","-","-","-","-","-","-","-","-","-","-","-","-","-","-","-","-","-","-","-","-","-","-","-","-","-","-","-","-","-","-","-","-","-","-","-","-","-","-","-","-","-","-","-","-","-","-","-","-","-","-","-","-","-","-","-","-","-","-","-","-","-","-","-","-","-","-","-","-","-","-","-","-","-","-","-","-","-","-","-","-","-","-","-","-","-","-","-","-","-","-","-","-","-","-","-","-","-","-","-","-","-","-","-","-","-","-","-","-","-","-","-","-","-","-","-","-","-","-","-","-","-","-","-","-","-","-","-","-","-","-","-","-","-","-","-","-","-","-","-","-","-","-","-","-","-","-","-","-","-","-","-","-","-","-","-","-","-","-","-","-","-","-","-","-","-","-","-","-","-","-","-","-","-","-","-","-","-","-","-","-","-","-","-","-","-","-","-","-","-","-","-","-","-","-","-","-","-","-","-","-","-","-","-","-","-","-","-","-","-","-","-","-","-","-","-","-","-","-","-","-","-","-","-","-","-","-","-","-","-",0,0,0,0,0,0,0,0,0,0,0,0,0,0,0,0,0,0,0,0,0,0,4.3890999999999999E-2,-0.52029999999999998,-2.681381,-25.375897000000002,-36.694078999999995,-35.112659000000001,-27.254534,-35.803857000000001,-36.379671999999999,-68.014381999999998,-74.016632999999999,-70.230888000000007,-67.437619000000012,-91.247602000000001,-108.822873,-90.838239000000002,-84.296937,-88.234445000000008,-83.69395200000001,-112.811098,-145.595967,-157.38788099999999,-113.87852599999999,-108.85674300000001,-86.136350000000007,-87.955589000000003,-98.644521999999995,-86.919696000000002,-88.247651000000005,-80.403573999999992,-85.675402000000005,-124.876598,-153.19399999999999,-165.07300000000001,-146.82962899999998,-101.059,-79.551937000000009,-87.789394999999999,-110.89759600000001,-111.884631,-100.736395,-87.606187000000006,-65.672035000000008,-123.28710700000001,-181.06009899999998,-170.38412599999998,-119.55534900000001,-99.372747000000004,-71.777664000000001,-93.54886599999999,-89.213442999999998,-91.217189000000005,-111.467448,-86.955767999999992,-105.354345,-124.74375900000001,-144.84169399999999,-152.53868,-109.260447,-90.882304000000005,-58.978756999999995,-85.128667000000007,-96.651403000000002,-64.557599999999994,"-","-","-","-","-","-","-","-","-","-"]
[null,"Saldo intercambios internacionales",-269.29700000000003,16.550999999999998,-11.987,-20.997,159.398,0.442,-28.161000000000001,-32.036000000000001,14.863,-21.733000000000001,-139.47,-87.152000000000001,-24.533000000000001,22.888999999999999,-122.07,-226.91900000000001,-191.566,-45.838999999999999,-92.111999999999995,27.849,-99.835999999999999,-14.272,56.173999999999999,33.649000000000001,-96.052000000000007,-312.209,-213.21600000000001,188.66300000000001,271.98,371.25900000000001,87.992000000000004,216.89599999999999,131.30699999999999,-16.239000000000001,8.0229999999999997,2.72,95.905000000000001,222.43799999999999,184.267,48.24,224.11500000000001,217.79499999999999,282.58,18.097999999999999,-4.7850000000000001,-0.85399999999999998,-0.36499999999999999,-20.361999999999998,-20.454999999999998,19.067,44.103000000000002,42.116,71.337999999999994,56.383000000000003,128.05099999999999,134.20599999999999,271.50099999999998,383.18400000000003,371.48200000000003,354.12900000000002,382.27800000000002,376.39499999999998,379.125,353.88600000000002,378.61599999999999,369.63499999999999,406.47899999999998,389.68700000000001,389.56900000000002,434.89600000000002,380.024,248.45500000000001,-23.15,-228.839,95.808999999999997,234.45,175.22300000000001,297.35899999999998,337.60500000000002,288.54199999999997,53.530999999999999,-123.297,-16.169,-31.698,-483.959,-204.565,-220.011,-410.142,-439.19400000000002,-268.20999999999998,-397.76100000000002,-455.005,-103.389,13.218999999999999,65.415999999999997,-169.27099999999999,339.84100000000001,345.96100000000001,404.92,388.81900000000002,355.11399999999998,244.86199999999999,284.57,320.09500000000003,-25.49,206.148,283.52199999999999,253.50200000000001,244.11699999999999,366.79399999999998,462.85599999999999,712.678,628.45799999999997,570.85799999999995,515.62199999999996,504.84,210.995,438.75,625.31500000000005,437.96199999999999,196.386,415.9,422.24900000000002,519.16999999999996,683.53800000000001,173.875,258.827,208.52799999999999,340.72800000000001,443.80599999999998,516.19799999999998,261.39,-38.209000000000003,21.672999999999998,-83.963999999999999,447.06200000000001,578.60299999999995,504.50400000000002,431.03699999999998,282.04500000000002,283.08600000000001,139.702,402.85199999999998,489.56900000000002,532.01599999999996,648.78599999999994,721.60400000000004,705.34900000000005,259.03800000000001,187.01,575.93600000000004,236.11799999999999,428.06299999999999,298.13900000000001,490.714,245.995,26.416,50.988,247.018,-36.927,134.05699999999999,409.34500000000003,237.34800000000001,123.48699999999999,160.179,55.116,-24.058,-119.06699999999999,-318.32600000000002,-299.78699999999998,-234.03200000000001,-621.22,-303.66399999999999,-321.33600000000001,-241.46199999999999,-454.68900000000002,-53.951999999999998,-330.99,-45.66,198.1,295.54899999999998,299.65800000000002,51.222999999999999,68.78,176.042,176.29,31.582000000000001,-174.63399999999999,-495.36900000000003,-662.58799999999997,-689.60500000000002,-420.322,-365.17399999999998,-583.77499999999998,-799.06,41.878,18.827999999999999,-262.10700000000003,-377.87900000000002,63.244999999999997,-310.53500000000003,-236.93299999999999,-285.29700000000003,-175.709,94.564999999999998,-235.49199999999999,-243.36199999999999,-261.05399999999997,-494.78800000000001,-223.46299999999999,-289.77800000000002,-314.01400000000001,-846.57600000000002,-1153.7719999999999,-1052.93,-729.80100000000004,-456.80399999999997,-655.58699999999999,-1199.348,-1291.615,-761.27499999999998,-1052.3420000000001,-907.81299999999999,-796.07299999999998,-935.81,-1102.0160000000001,-948.447,-932.45600000000002,-897.62800000000004,-474.27699999999999,-192.952,-548.93399999999997,-437.37599999999998,-769.16099999999994,-944.90899999999999,-817.41700000000003,-711.16800000000001,-941.36500000000001,-897.21199999999999,-454.01499999999999,-304.71344599999998,-506.196753,-560.11404599999992,-729.095102,-542.81502899999998,-821.22575100000006,-1000.6535670000001,-758.60105700000008,-964.2554520000001,-1295.5098870000002,-593.21057400000007,-256.28839399999998,-611.33580500000005,-358.84235899999999,-762.63600899999994,-1074.8113170000001,-233.62379999999999,-404.76718699999998,-470.93457000000001,-197.10088099999999,-548.75685799999997,-381.58426100000003,-579.51663300000007,-466.21665400000001,-525.29093599999999,-1375.7932209999999,-869.96906999999999,-1211.9197819999999,-939.84038100000009,-625.32935199999997,-629.52545599999996,-646.20974899999999,-1047.302604,-1457.208903,-791.40693099999999,-1080.1572060000001,-364.45221100000003,-642.39397799999995,-430.41725799999995,-411.18220100000002,-132.05559299999999,-358.69515000000001,-1060.4316310000002,-517.67452200000002,-821.87308799999994,-679.119191,-892.91131900000005,-420.92630800000001,28.099829000000003,-490.54062400000004,-225.94670300000001,-652.23227599999996,-256.41148300000003,-285.58111300000002,-481.72024800000003,-236.69277,-336.25484,-303.54976099999999,195.372657,-360.667597,-259.102957,-558.85504600000002,-396.75677899999999,-295.55073599999997,180.77279000000001,0.88915499999999992,-184.17543000000001,-251.793361,-169.941732,436.52791200000001,453.10844900000001,911.71451000000002,847.59026500000004,960.46906000000001,174.95739399999999,-106.684112,762.50236499999994,1083.2692120000002,917.73114199999998,1034.6561139999999,1130.5906419999999,-433.77785799999998,357.21121500000004,938.722174,-531.54929799999991,528.49059999999997,"-","-","-","-","-","-","-","-","-","-"]
[null,"Demanda transporte (b.c.)",12568.172999999999,10606.683999999997,11500.654,10528.599999999999,10700.868999999999,10911.449000000001,11525.924000000003,10123.628000000001,10799.337000000003,10940.460000000001,11602.256000000003,12751.464,13221.258,12104.609999999999,11461.919000000002,11048.385,11232.120999999996,10918.467000000001,11835.945000000002,10459.177000000001,11266.763000000004,11698.815999999995,12056.952999999998,12469.990000000002,13798.636,12527.571,12266.981999999998,11180.000999999998,11221.762000000001,10764.076999999999,12007.581,10674.854000000003,11316.847,11565.285000000002,11522.732,12194.610999999997,13097.569000000001,11923.505000000001,12461.083999999995,10884.725999999997,11045.386000000002,11156.418000000001,11886.368000000002,10762.586000000001,11179.712,11748.179999999998,12297.538999999995,12763.290999999997,13141.868,12158.895,12094.056999999995,11595.256999999998,11694.176999999998,11961.463000000002,12800.279999999999,11639.960999999999,11922.619000000001,11858.766,12233.531999999999,13139.841000000004,13984.224000000004,12088.559000000003,13295.242999999999,11822.258000000005,12404.074999999997,12447.605,13093.934000000001,12087.526999999998,12236.762999999997,12363.548000000003,12611.461999999998,13298.204999999998,13848.374,13526.045000000002,13537.277,11990.401999999998,12490.415999999999,12785.945,13519.843999999999,12230.967999999997,12307.397000000003,12882.947000000002,13261.676000000001,13826.558999999999,14791.047,12504.942000000001,12944.200999999997,12938.041000000001,13073.965,13053.460999999999,13846.366000000002,12972.292000000003,13641.727000000001,13754.548999999999,13928.879000000001,14912.340999999999,15172.561,13701.303,14381.126000000002,13712.254999999997,13714.311000000002,14102.116,15283.841999999999,13813.231,14164.754999999999,14304.219000000001,14700.953000000001,16000.632000000001,16168.921,14967.624999999998,15400.066000000001,14030.916999999999,14637.163000000002,15059.191999999999,16261.017,14644.725999999999,14989.451999999999,14949.123000000001,16255.662,16948.564999999999,17845.227999999999,15687.765999999998,16380.922999999997,15199.865,15564.256000000003,16091.724,16573.085999999999,15634.834000000001,15998.932999999999,15961.555,16920.555,17131.96,18289.445000000003,16491.726999999999,17239.230000000003,15530.365,16690.819000000003,17085.272000000001,17642.278000000002,16747.986000000001,16490.887000000002,16729.872000000003,17806.417999999998,18871.052,19341.497000000003,16996.740999999998,17636.378999999997,17018.970999999998,17193.093000000004,17374.280999999999,18464.613000000001,16579.862000000001,16965.512000000002,17630.420000000002,17851.663000000004,18508.075000000001,20199.603000000003,18770.308000000001,18517.214999999997,17007.472000000002,17756.890999999996,18911.004000000001,20054.809000000001,18709.898000000001,18185.194,18727.147000000001,18882.891,20117.086000000003,20331.607,19479.59,20587.064000000002,18261.442999999999,18519.046000000002,19383.066999999999,20650.728999999996,18984.258000000002,19297.613000000001,19134.524000000001,20211.602999999999,21137.934000000001,22434.995999999999,20982.072000000004,21028.847000000005,19050.185000000001,19203.679000000004,20500.803999999996,21538.906999999999,19548.174999999999,19495.727999999999,19231.860999999997,20661.563999999995,22507.246000000003,23447.905000000002,21252.067999999992,21967.846999999998,18681.973999999998,20372.254000000001,20850.334000000006,23038.001000000004,20603.034,20839.387999999999,20448.167999999998,20584.458999999995,22895.526999999998,24159.132999999998,21183.205999999998,22565.631999999998,20260.940999999999,20863.598000000002,21079.954999999998,22851.761000000002,21112.413999999997,20898.947,21214.273999999998,22511.686999999998,23734.213000000003,24433.133000000002,22546.603999999999,22312.010999999999,21496.493999999999,20950.915999999994,21080.627999999997,23239.803000000004,21729.627,21081.667999999998,21124.274000000001,22046.794000000002,23163.711000000003,23770.664000000001,20885.489000000005,20925.592000000001,19227.985000000001,19641.821,20540.189000000002,22424.545000000002,21148.706999999999,20400.554,20324.804999999997,20644.267,22725.194,23750.938022999999,21910.907142,22815.565081999997,19934.792949000002,20422.616260999999,20438.546864999997,23145.032401,21456.10457,20701.916191,20498.548346,22011.928392999998,23440.05386,23667.869017999998,21414.953240999999,22737.242052000001,19254.015281,20346.017596999998,20740.408363000002,21996.80718,21588.901646000002,21020.763280000003,20338.993179000001,20614.639884,21876.794583999999,23090.426942999999,22947.785239999997,21327.506309,19477.465006999999,20190.931372999999,20752.162159000003,21670.967820000002,21447.849914999999,19794.145318999999,19716.804321,20270.138454999997,21328.039439,22553.187899999997,20549.267124999998,21218.142804999999,19498.434923999997,19447.040546,19143.780576000001,21637.578679999999,20607.948791000003,19706.244317000001,19780.493701000003,20480.664445999999,21745.626769000002,22053.512252999997,20371.954502999997,20919.84879,18766.030208,19478.485279,19600.189425,21122.58655,20174.167919,20261.893050000002,19686.429,19785.315298999998,21323.415776999998,22694.104267999999,21013.002077000001,21183.677259,18851.251554999999,19832.434907999999,20377.176842000001,23469.964519000001,20880.247671999998,19591.352026,19727.777236999998,19879.897710000001,20897.423210999998,21466.469756000002,20853.096304999999,21498.134982,19925.322261999998,19730.733680000001,20227.720798999999,22232.564061999998,21434.345418000001,20827.758949999999,19816.164255,20608.999276999999,21301.729706999999,23021.118555000001,19887.056800000002,"-","-","-","-","-","-","-","-","-","-"]
[]
[null,"Balance eléctrico mensual Islas Baleares (MWh)","2006-01-01","2006-02-01","2006-03-01","2006-04-01","2006-05-01","2006-06-01","2006-07-01","2006-08-01","2006-09-01","2006-10-01","2006-11-01","2006-12-01","2007-01-01","2007-02-01","2007-03-01","2007-04-01","2007-05-01","2007-06-01","2007-07-01","2007-08-01","2007-09-01","2007-10-01","2007-11-01","2007-12-01","2008-01-01","2008-02-01","2008-03-01","2008-04-01","2008-05-01","2008-06-01","2008-07-01","2008-08-01","2008-09-01","2008-10-01","2008-11-01","2008-12-01","2009-01-01","2009-02-01","2009-03-01","2009-04-01","2009-05-01","2009-06-01","2009-07-01","2009-08-01","2009-09-01","2009-10-01","2009-11-01","2009-12-01","2010-01-01","2010-02-01","2010-03-01","2010-04-01","2010-05-01","2010-06-01","2010-07-01","2010-08-01","2010-09-01","2010-10-01","2010-11-01","2010-12-01","2011-01-01","2011-02-01","2011-03-01","2011-04-01","2011-05-01","2011-06-01","2011-07-01","2011-08-01","2011-09-01","2011-10-01","2011-11-01","2011-12-01","2012-01-01","2012-02-01","2012-03-01","2012-04-01","2012-05-01","2012-06-01","2012-07-01","2012-08-01","2012-09-01","2012-10-01","2012-11-01","2012-12-01","2013-01-01","2013-02-01","2013-03-01","2013-04-01","2013-05-01","2013-06-01","2013-07-01","2013-08-01","2013-09-01","2013-10-01","2013-11-01","2013-12-01","2014-01-01","2014-02-01","2014-03-01","2014-04-01","2014-05-01","2014-06-01","2014-07-01","2014-08-01","2014-09-01","2014-10-01","2014-11-01","2014-12-01","2015-01-01","2015-02-01","2015-03-01","2015-04-01","2015-05-01","2015-06-01","2015-07-01","2015-08-01","2015-09-01","2015-10-01","2015-11-01","2015-12-01","2016-01-01","2016-02-01","2016-03-01","2016-04-01","2016-05-01","2016-06-01","2016-07-01","2016-08-01","2016-09-01","2016-10-01","2016-11-01","2016-12-01","2017-01-01","2017-02-01","2017-03-01","2017-04-01","2017-05-01","2017-06-01","2017-07-01","2017-08-01","2017-09-01","2017-10-01","2017-11-01","2017-12-01"]
[null,"Carbón",281585,245804,280062,239665,271836,287051,292771,281322,254499,177022,201042,264651,253259,227525,220374,263500,228127,222675,278923,292687,263412,229147,201758,262468,287616,269886,265619,216223,246771,279366,294598,301838,286166,244583,217953,188207,186398,267602,230164,242090,270324,291327,298599,307579,259941,281704,254121,280614,288628.96399999998,253130.43700000001,284143.58,270785.11,229324.10800000001,279046.16200000001,292090,286753.92800000001,285293.82500000001,217296.101,192203.66699999999,222661.68400000001,271039.09399999998,222552.524,133127.45199999999,193302.56099999999,240528.49600000001,255173.84400000001,292281.72899999999,285531.25400000002,269841.23499999999,199222.62899999999,166762.40400000001,235503.62899999999,265065.64199999999,219166.837,224145.144,203970.12299999999,227618.82199999999,243421,272060,272045,234898,185556,160648,173937,182300,172763,186533,175478,187897,200607,246667,248252,229417,169690.17,168250.60200000001,182826,183089,150083,160256,174013,194494.804,206570,234613,238509,227703,156196,86830,175269,180780.08,171710.04,173706,70780.108999999997,127697.454,185477.54,218839.82199999999,250939.772,199152.05600000001,83006.979000000007,103751.19,99427.255000000005,115147.24099999999,99808.854999999996,105038.973,151496.986,197176.087,225485.47200000001,286133.93099999998,265479.10800000001,256769.33100000001,224344.495,180604.21100000001,196283.61199999999,221058.21400000001,193225.10500000001,"-","-","-","-","-","-","-","-","-","-"]
[null,"Motores diesel",79209,68329,70721,64718,79303,85154,104210,101456,93527,79792,63493,74990,78135,66061,74782,71646,84385,92577,102578,105250,96624,79159,73984,80425,80489,70911,75416,72520,86002,96520,116196,118501,98449,78246,72700,81131,85013,68206,71555,74273,75820,91793,105509,106425,86067,70751,62004,74409,80487.338000000003,71127.048999999999,78081.048999999999,70171.271999999997,83167.909,94393.464000000007,113035.62,113945.387,97806.403000000006,76729.221000000005,67045.221999999994,81630.111999999994,81369.630999999994,64795.156999999999,77210.808999999994,71556.933999999994,83563.773000000001,89642.910999999993,96268.777000000002,98322.804999999993,81466.168999999994,55484.904999999999,49587.178,74506.566999999995,80432.365999999995,74636.626000000004,73731.683999999994,72451.134000000005,83642.36,94717.668000000005,104719.432,103888.321,81520.528999999995,62130.65,47317.415000000001,55581.767999999996,59201.000999999997,53145.453000000001,52697.133999999998,55012.707999999999,67405.004000000001,69930.770999999993,90133.123000000007,86504.202999999994,65992.843999999997,50254.603000000003,38564,55111,57916.595999999998,54814.648000000001,38555.430999999997,37428.254999999997,51478.368000000002,60837.201999999997,69849.784,77074.995999999999,69718.804000000004,50951.88,51297.131000000001,51325.232000000004,56436.175999999999,54370.103999999999,51246.678999999996,53388.938999999998,63795.298999999999,64962.411999999997,92963.654999999999,83680.463000000003,67767.982000000004,52976.819000000003,38052.409,50124.936999999998,38443.442000000003,63296.957000000002,77413.615000000005,75104.327000000005,87415.225999999995,92667.361999999994,107561.81299999999,107598.818,92554.883000000002,88598.664999999994,62253.616999999998,70496.269,84317.429000000004,72086.016000000003,"-","-","-","-","-","-","-","-","-","-"]
[null,"Turbina de gas",6947,10938,22831,13569,15378,29015,55976,40768,31591,29413.95199999999,18468,17160,23585,20894,20510,16976,36834,31757,41358,38367,21309,20978,20783,18090,17521,19944,19984,12615,13376,22615,34364,38299,31566,20899,19341,21978,18986,20558,19663,12270,24409,33876,53107,52569,37227,24608,21181,20915,23036.824000000001,25540.649000000001,22064.976999999999,16837.77,15550.541999999999,20236.732,41379.637000000002,42027.091,26953.491999999998,22516.812000000002,21406.807000000001,21863.032999999999,16995.936000000002,20869.650000000001,17680.794999999998,13200.816000000001,17102.748,28124.346000000001,49934.766000000003,59310.271000000001,47553.175000000003,38916.805999999997,31018.1,10217.727000000001,12720.373,24628.482,14603.772000000001,8007.7259999999997,12723.262000000001,29862.117999999999,42997.555,61596.516000000003,39058.875999999997,34035.275000000001,28986.828000000001,31723.758000000002,30572.664000000001,33019.775000000001,31897.867999999999,25229.128000000001,32068.698,39400.116000000002,61334.673999999999,68281.490999999995,57303.716999999997,50631.493999999999,41970.712,37596.616000000002,28446.728999999999,24552.032999999999,42849.538999999997,44140.442000000003,47118.786999999997,57803.786999999997,75697.593999999997,79161.104999999996,66060.736000000004,52001.822,27833.902999999998,36061.230000000003,36489.4,32594.472000000002,38185.656999999999,31999.216,43482.358999999997,58635.014999999999,77101.896999999997,80387.589000000007,57873.42,47588.997000000003,40863.165999999997,36936.794000000002,47667.171000000002,19844.912,13369.73,9070.5879999999997,18358.821,33002.701999999997,46444.019,55165.428999999996,43433.79,18338.288,20288.044000000002,13304.507,13253.123,8584.5789999999997,"-","-","-","-","-","-","-","-","-","-"]
[null,"Fuel + Gas",86156,79267,93552,78287,94681,114169,160186,142224,125118,109205.95199999999,81961,92150,101720,86955,95292,88622,121219,124334,143936,143617,117933,100137,94767,98515,98010,90855,95400,85135,99378,119135,150560,156800,130015,99145,92041,103109,103999,88764,91218,86543,100229,125669,158616,158994,123294,95359,83185,95324,103524.16200000001,96667.698000000004,100146.026,87009.042000000001,98718.451000000001,114630.19600000001,154415.25699999998,155972.478,124759.895,99246.03300000001,88452.028999999995,103493.14499999999,98365.566999999995,85664.807000000001,94891.603999999992,84757.75,100666.52100000001,117767.257,146203.54300000001,157633.076,129019.344,94401.710999999996,80605.277999999991,84724.293999999994,93152.739000000001,99265.108000000007,88335.455999999991,80458.86,96365.622000000003,124579.78600000001,147716.98699999999,165484.837,120579.405,96165.925000000003,76304.243000000002,87305.525999999998,89773.664999999994,86165.228000000003,84595.001999999993,80241.835999999996,99473.702000000005,109330.88699999999,151467.79700000002,154785.69399999999,123296.56099999999,100886.09700000001,80534.712,92707.616000000009,86363.324999999997,79366.680999999997,81404.97,81568.697,98597.154999999999,118640.989,145547.378,156236.101,135779.54,102953.70199999999,79131.034,87386.462,92925.576000000001,86964.576000000001,89432.335999999996,85388.154999999999,107277.658,123597.427,170065.552,164068.05200000003,125641.402,100565.81600000001,78915.574999999997,87061.731,86110.613000000012,83141.869000000006,90783.345000000001,84174.915000000008,105774.04699999999,125670.06399999998,154005.83199999999,162764.247,135988.67300000001,106936.95299999999,82541.660999999993,83800.775999999998,97570.551999999996,80670.595000000001,"-","-","-","-","-","-","-","-","-","-"]
[null,"Ciclo combinado",115133,112851,71802,58291,79596,107515,173341,167753,132665,163572,80257,79139,109535,97337,133306,66630,113287,174631,186393,169251,141173,143962,135271,113219,92464,91614,97252,120602,114746,106773,178739,177899,121342,111682,111297,199080,206459,81850,132809,89788,70003,97131,175334,166521,120693,57370,29377,64848,83745.201000000001,90692.047000000006,69947.986000000004,35630.942999999999,87840.323999999993,61960.637999999999,159205.10999999999,145959.23199999999,74275.328999999998,107178.246,98555.293999999994,120643.372,87325.831999999995,101278.758,204244.842,87108.138999999996,89672.712,94536.337,118352.70699999999,152014.503,115098.602,118552.891,95594.106,62958.957000000002,68913.751999999993,134285.43599999999,53854.985000000001,51852.373,56400.712,94530.842999999993,109975.276,123495.86500000001,47459.366999999998,71343.37,43422,35026.341,37837,51552.052000000003,39448.04,25643.305,38630.023000000001,16346,35588.271999999997,29770,3965,53247.095000000001,34705.777999999998,46843.258999999998,33410,44603,51991.088000000003,15938.374,33331.379999999997,16418,18189.412,27263.169000000002,16977.942999999999,52913.580999999998,82131.793999999994,33756.963000000003,37290.881999999998,37658.481,38154.074999999997,110890.848,103324.583,47975.309000000001,79053.868000000002,26774.830999999998,35536.51,123453.66899999999,75824.937000000005,93301.375,92999.952000000005,108546.993,109982.183,51876.309000000001,19259.797999999999,12974.432000000001,15678.454,25123.114000000001,27082.419000000002,16743.347000000002,35138.470999999998,27146.894,37932.815999999999,34291.703999999998,"-","-","-","-","-","-","-","-","-","-"]
[null,"Generación auxiliar",0,0,0,0,0,0,213,3531,2469,1,0,136.219999999972,0,0,0,0,0,0,2447,8618,1547,0,0,0,0,0,0,0,0,0,2048,2600,1282,1,0,0,0,0,0,0,0,0,1489,3042,1037,-2,0,0,0,0,0,0,0,45.686,2619.5369999999998,2927.97,1100.336,0.80300000000000005,0,0,0,0,0,0,0,1061.171,2481.41,3645.4070000000002,1536.693,0,0,0,0,0,0,0,0,984.28700000000003,2564,3950.4380000000001,1310,1,0,0,0,0,0,0,1,625,2313.25,3044.55,917,2E-3,0,0,0,0,0,0,0,0,2542,3212.201,1940,1,0,0,0,0,0,0,0,337,3682.482,4194.6139999999996,2367.759,0,0,0,0,0,0,0,0,1214,2921.6309999999999,3386.1239999999998,2144,426,0,0,0,0,"-","-","-","-","-","-","-","-","-","-"]
[null,"Régimen ordinario",482874,437922,445416,376243,446113,508735,626511,594830,514751,449800.95199999999,363260,436076.22,464514,411817,448972,418752,462633,521640,611699,614173,524065,473246,431796,474202,478090,452355,458271,421960,460895,505274,625945,639137,538805,455411,421291,490396,496856,438216,454191,418421,440556,514127,634038,636136,504965,434431,366683,440786,475898.32699999999,440490.18200000003,454237.59200000006,393425.09499999997,415882.88300000003,455682.68199999997,608329.90399999998,591613.60800000001,485429.38500000001,423721.18300000002,379210.99,446798.201,456730.49299999996,409496.08900000004,432263.89799999999,365168.44999999995,430867.72899999999,468538.609,559319.38900000008,598824.24,515495.87400000001,412177.23099999997,342961.788,383186.87999999995,427132.13299999997,452717.38099999999,366335.58499999996,336281.35600000003,380385.15600000002,463515.91600000003,532316.26299999992,564976.14,404246.772,353066.29499999998,280374.24300000002,296268.86700000003,309910.66499999998,310480.28000000003,310576.04199999996,281363.141,326001.72499999998,326908.88699999999,436036.31900000002,435852.24400000001,357595.56099999999,323823.36399999994,283491.092,322376.87500000006,"-","-","-","-","-","-","-","-","-","-","-","-","-","-","-","-","-","-","-","-","-","-","-","-","-","-","-","-","-","-","-","-","-","-","-","-","-","-","-","-","-","-","-","-","-","-","-","-"]
[null,"Eólica",514.35,371.37400000000002,548.18799999999999,366.096,438.988,366.65,202.55,548.33199999999999,264.46800000000002,347.64699999999999,407.40800000000002,501.30500000000001,402,480,585,246,392,334,358,444,320,541,784,770,415,420,575,741,212,290,272,328,462,470,620,692,472,688,529,482,477,383,126,147,346,531,538,824,599,689,590,377,312,275,322,395,303,477,529,703,472,638,627,553,435,359,432,356,229,587,549,592,479,1092,557,570,377,358,430,261,666,424,540,751,687,674,767,552,439,391,211,355,349,477,772,486,587,635,749,441,509,342,354,302,236,371,552,761,600,696,580,434.88,636,253,309,231,509,555.89,415.25,97,530,661,708,665,486,239,471,478,222,292,402,260,469,311.3,"-","-","-","-","-","-","-","-","-","-"]
[null,"Solar fotovoltaica",43.972999999999999,50.86,83.445999999999998,87.706999999999994,102.911,110.639,126.145,120.86799999999999,111.756,105.83499999999999,84.200999999999993,72.453999999999994,95,122,165,156,211,207,226,209,180,139,119,123,134,194,416,664,955,1807,2659,4719,4821,4337,3391,4283,3838,5190,7556,7099,8802,9040,8898,8709,6680,6538,5096,3487,3845,4810,6958,8061,9047,8957,10437,10003,8360,6793,5600,4886,5358,6378,8047,9928,10914,10324,10211,11535,9702,8434,4998,5392,6183,6956,10152,10230,12309,11697,12533,12420,10873,9500,6016,6725,7273,7404,11494,11209,12639,13817,14316,12847,10745,8781,5602,5971,5828,8461,11098,12721,12507,13247,13533,12560,10352,10338,6491,5637,6880,7213,10111,12577.61,13499,13458,13857,12164,9669.8700000000008,8932,8008,6276,7084,7533,10664,11169,12597,13138,13833,13327,10356,8432,6554,5733,5832,7094.4,"-","-","-","-","-","-","-","-","-","-"]
[null,"Térmica renovable/Otras renovables","-","-","-","-","-","-","-","-","-","-","-","-","-","-","-","-","-","-","-","-","-","-","-","-","-","-","-","-","-","-","-","-","-","-","-","-","-","-","-","-","-","-","-","-","-","-","-","-","-","-","-","-","-","-","-","-","-","-","-","-","-","-","-","-","-","-","-","-","-","-","-","-",45,23,79,49,42,39,36,47,53,57,55,44,73,47,75,93,16,73,75,30,44,65,60,92,123,172,228,199,261,167,89,121,92,132,185,175,229.29,171.29,164,221,173,100,181,109,119,130.97,148,226,176,164.92,176,153,126,32,36,43,33,93,139,138,159,152.47999999999999,"-","-","-","-","-","-","-","-","-","-"]
[null,"Térmica no renovable/Cogeneración y resto/Cogeneración",13134.677,11651.766,12757.366,12126.197,9241.1010000000006,11667.710999999999,11282.305,11336.8,10957.776,11996.518,10537.391,12423.241,10231,11272,12861,12018,8170,9987,8947,9642,9504,1019,8067,12215,11005,12227,12415,11349,11758,11450,11883,11405,10678,11820,11914,12428,12679,9600,972,11178,12259,11199,11190,10723,11294,11475,11970,12503,10815,9246,11253,11204,10903,10391,11522,22957,25904,13766,17545,20738,15300,13950,13834,17844,12581,24337,27559,28922,29380,27852,22326,26863,23089,18830,21757,18602,25063,22209,29853,28907,23443,16726,16004,27593,19631,14416,18168,15890,19024,26233,24865,25589,30297,19897,17598,20007,17963,14698,20661,23967,11904,28025,32114,24993,30718,30760,19807,25780,3123,2527,2771,1697.16,2205,1133.1600000000001,2922,2816,2464,3140,3260,3461,3256,3209.64,3099,3053,2121,3355,2925,2931,2901,2744,2387,2672,3018,3024.12,"-","-","-","-","-","-","-","-","-","-"]
[null,"Residuos",null,null,null,null,null,null,null,null,null,null,null,null,null,null,null,null,null,null,null,null,null,null,null,null,null,null,null,null,null,null,null,null,null,null,null,null,null,null,null,null,null,null,null,null,null,null,null,null,0,0,0,0,0,0,0,0,0,0,0,0,0,0,0,0,0,0,0,0,0,0,0,0,0,0,0,0,0,0,0,0,0,0,0,0,0,0,0,0,0,0,0,0,0,0,0,0,0,0,0,0,0,0,0,0,0,0,0,0,18327,13817,22788,27278,29580,27409,25706,24975,29554,29329,28636,24797,17129,9936,17224,24220,29020,27234,22533,25370,25227,27325,18542,17851,15088,14752,"-","-","-","-","-","-","-","-","-","-"]
[null,"Régimen especial",13693,12074,13389,12580,9783,12145,11611,12006,11334,12450,11029,12997,10728,11874,13611,12420,8773,10528,9531,10295,10004,1699,8970,13108,11554,12841,13406,12754,12925,13547,14814,16452,15961,16627,15925,17403,16989,15478,9057,18759,21538,20622,20214,19579,18320,18544,17604,16814,15259,14745,18801,19642,20262,19623,22281,33355,34567,21036,23674,26327,21130,20966,22508,28325,23930,35020,38202,40813,39311,36873,27873,32847,29796,26901,32545,29451,37791,34303,42852,41635,35035,26707,22615,35113,27664,22541,30504,27744,32118,40514,39467,38821,41435,29220,24032,26556,"-","-","-","-","-","-","-","-","-","-","-","-","-","-","-","-","-","-","-","-","-","-","-","-","-","-","-","-","-","-","-","-","-","-","-","-","-","-","-","-","-","-","-","-","-","-","-","-"]
[null,"Generación",496567,449996,458805,388823,455896,520880,638122,606836,526085,462250.95199999999,374289,449073.22,475242,423691,462583,431172,471406,532168,621230,624468,534069,474945,440766,487310,489644,465196,471677,434714,473820,518821,640759,655589,554766,472038,437216,507799,513845,453694,463248,437180,462094,534749,654252,655715,523285,452975,384287,457600,491157.32699999999,455235.18199999997,473038.592,413067.09499999997,436144.88299999997,475305.68199999997,630610.90399999998,624968.60800000001,519996.38500000001,444757.18300000002,402884.99,473125.201,477860.49300000002,430462.08899999998,454771.89799999999,393493.45,454797.72899999999,503558.609,597521.38899999997,639637.24,554806.87399999995,449050.23100000003,370834.788,416033.88,456928.13299999997,479618.38099999999,398880.58500000002,365732.35600000003,418176.15600000002,497818.91600000003,575168.26300000004,606611.14,439281.772,379773.29499999998,302989.24300000002,331381.86700000003,337574.66499999998,333021.28000000003,341080.04200000002,309107.141,358119.72499999998,367422.88699999999,475503.31900000002,474673.24400000001,399030.56099999999,353043.364,307523.092,348932.875,327363.32500000001,298018.68099999998,326388.05800000002,308848.071,351604.33899999998,383409.989,446981.79,463196.47100000002,423798.48300000001,353665.283,275127.82799999998,328765.42499999999,340155.82799999998,320757.38699999999,337706.41100000002,309267.76199999999,384392.69500000001,399740.43599999999,514616.72399999999,486272.26899999997,405013.59700000001,349114.32400000002,298958.95199999999,314647.36099999998,322432.80599999998,313002.277,337675.50099999999,326808.21000000002,366559.93199999997,409341.96799999999,498537.848,498901.59299999999,460723.42300000001,387336.79499999998,326308.34299999999,333885.28200000001,381127.58199999999,333521.70400000003,"-","-","-","-","-","-","-","-","-","-"]
[null,"Enlace Península-Baleares","-","-","-","-","-","-","-","-","-","-","-","-","-","-","-","-","-","-","-","-","-","-","-","-","-","-","-","-","-","-","-","-","-","-","-","-","-","-","-","-","-","-","-","-","-","-","-","-",0,0,0,0,0,0,0,0,0,0,0,0,0,0,0,0,0,0,0,0,0,0,-43.890999999999998,520.29999999999995,2681.3809999999999,25375.897000000001,36694.078999999998,35112.659,27254.534,35803.857000000004,36379.671999999999,68014.381999999998,74016.633000000002,70230.888000000006,67437.619000000006,91247.601999999999,108822.87300000001,90838.239000000001,84296.937000000005,88234.445000000007,83693.952000000005,112811.098,145595.967,157387.88099999999,113878.526,108856.743,86136.35,87955.589000000007,98644.521999999997,86919.695999999996,88249.650999999998,80404.573999999993,85669.402000000002,124876.598,153191.78599999999,165070.70499999999,146829.62899999999,101058.571,79551.937000000005,87790.395000000004,110897.59600000001,111884.63099999999,100736.395,87606.187000000005,65670.035000000003,123291.107,181060.09899999999,170384.12599999999,119558.349,99376.747000000003,71777.664000000004,93548.865999999995,89213.442999999999,91217.188999999998,111467.448,86955.767999999996,105354.345,124743.75900000001,144841.69399999999,152538.68,109260.447,90882.304000000004,58978.756999999998,85128.667000000001,96651.403000000006,64557.599999999999,"-","-","-","-","-","-","-","-","-","-"]
[null,"Demanda transporte (b.c.)",496567,449996,458805,388823,455896,520880,638122,606836,526085,462250.95199999999,374289,449073.22,475242,423691,462583,431172,471406,532168,621230,624468,534069,474945,440766,487310,489644,465196,471677,434714,473820,518821,640759,655589,554766,472038,437216,507799,513845,453694,463248,437180,462094,534749,654252,655715,523285,452975,384287,457600,491157.32699999999,455235.18199999997,473038.592,413067.09499999997,436144.88299999997,475305.68199999997,630610.90399999998,624968.60800000001,519996.38500000001,444757.18300000002,402884.99,473125.201,477860.49300000002,430462.08899999998,454771.89799999999,393493.45,454797.72899999999,503558.609,597521.38899999997,639637.24,554806.87399999995,449050.23100000003,370790.897,416554.18,459609.51400000002,504994.27799999999,435574.66399999999,400845.01500000001,445430.69,533622.77300000004,611547.93500000006,674625.522,513298.40500000003,450004.18300000002,370426.86200000002,422629.46899999998,446397.538,423859.51899999997,425376.97899999999,397341.58600000001,441813.67700000003,480233.98499999999,621099.28599999996,632061.125,512909.087,461900.10700000002,393659.44199999998,436888.46399999998,426007.84700000001,384938.37699999998,414637.70899999997,389252.64500000002,437273.74099999998,508286.587,600173.576,628267.17599999998,570628.11199999996,454723.85399999999,354679.76500000001,416555.82,451053.424,432642.01799999998,438442.80599999998,396873.94900000002,450062.73,523031.54300000001,695676.82299999997,656656.39500000002,524571.946,448491.071,370736.61599999998,408196.22700000001,411646.24900000001,404219.46600000001,449142.94900000002,413763.978,471914.277,534085.72699999996,643379.54200000002,651440.27300000004,569983.87,478219.09899999999,385287.1,419013.94900000002,477778.98499999999,398079.304,"-","-","-","-","-","-","-","-","-","-"]
[]
[null,"Balance eléctrico mensual Islas Canarias (MWh)","2006-01-01","2006-02-01","2006-03-01","2006-04-01","2006-05-01","2006-06-01","2006-07-01","2006-08-01","2006-09-01","2006-10-01","2006-11-01","2006-12-01","2007-01-01","2007-02-01","2007-03-01","2007-04-01","2007-05-01","2007-06-01","2007-07-01","2007-08-01","2007-09-01","2007-10-01","2007-11-01","2007-12-01","2008-01-01","2008-02-01","2008-03-01","2008-04-01","2008-05-01","2008-06-01","2008-07-01","2008-08-01","2008-09-01","2008-10-01","2008-11-01","2008-12-01","2009-01-01","2009-02-01","2009-03-01","2009-04-01","2009-05-01","2009-06-01","2009-07-01","2009-08-01","2009-09-01","2009-10-01","2009-11-01","2009-12-01","2010-01-01","2010-02-01","2010-03-01","2010-04-01","2010-05-01","2010-06-01","2010-07-01","2010-08-01","2010-09-01","2010-10-01","2010-11-01","2010-12-01","2011-01-01","2011-02-01","2011-03-01","2011-04-01","2011-05-01","2011-06-01","2011-07-01","2011-08-01","2011-09-01","2011-10-01","2011-11-01","2011-12-01","2012-01-01","2012-02-01","2012-03-01","2012-04-01","2012-05-01","2012-06-01","2012-07-01","2012-08-01","2012-09-01","2012-10-01","2012-11-01","2012-12-01","2013-01-01","2013-02-01","2013-03-01","2013-04-01","2013-05-01","2013-06-01","2013-07-01","2013-08-01","2013-09-01","2013-10-01","2013-11-01","2013-12-01","2014-01-01","2014-02-01","2014-03-01","2014-04-01","2014-05-01","2014-06-01","2014-07-01","2014-08-01","2014-09-01","2014-10-01","2014-11-01","2014-12-01","2015-01-01","2015-02-01","2015-03-01","2015-04-01","2015-05-01","2015-06-01","2015-07-01","2015-08-01","2015-09-01","2015-10-01","2015-11-01","2015-12-01","2016-01-01","2016-02-01","2016-03-01","2016-04-01","2016-05-01","2016-06-01","2016-07-01","2016-08-01","2016-09-01","2016-10-01","2016-11-01","2016-12-01","2017-01-01","2017-02-01","2017-03-01","2017-04-01","2017-05-01","2017-06-01","2017-07-01","2017-08-01","2017-09-01","2017-10-01","2017-11-01","2017-12-01"]
[null,"Hidráulica",0,0,0,0,0,0,0,0,0,0,0,0,0,0,0,0,0,0,0,0,0,0,0,0,0,0,0,0,0,0,0,0,0,0,0,0,0,0,0,0,0,0,0,0,0,0,0,0,0,0,0,0,0,0,0,0,0,0,0,0,0,0,0,0,0,0,0,0,0,0,0,0,0,0,0,0,0,0,0,0,0,0,0,0,0,0,0,0,0,0,0,0,0,0,0,0,0,0,0,0,0,0,0,0,0,0,0,0,303.60000000000002,270,304.60000000000002,292,295,296,304,303,296,311,301,309,309,282,311,299,308,301,313,266,282,271,260,270,264,0,"-","-","-","-","-","-","-","-","-","-"]
[null,"Motores diesel",165513,148359,156468,143502,170858,177722,176016,179233,182517,179648,157979,169849,187608,153155,170227,158998,161066,167755,183062,178646,169801,172067,170171,169446,169904,169953,164609,171005,184619,170736,180381,181406,184435,177595,169810,179313,175499,161432,167927,161723,174920,177098,181952,183950,185161,193478,183078,194481,187860.42600000001,166955.34899999999,187977.302,173369.21400000001,162133.90599999999,164800.02900000001,181346.47099999999,198336.867,189919.53599999999,200384.633,184885.12599999999,185418.913,188502.864,169922.07500000001,187482.117,176962.42800000001,170170.94399999999,179381.94099999999,187314.6,185824.93599999999,188071.837,178369.31599999999,172999.69399999999,178373.34299999999,179500.23499999999,176820.42600000001,179805.49600000001,178161.291,179655.16699999999,163882.432,172623.93900000001,197998.946,172035.13200000001,174704.734,163848.48800000001,171094.64300000001,179868.34,166432.49600000001,179991.954,156656.79,166958.14600000001,161808.769,167404.83799999999,183067.236,171801.899,179535.08100000001,180393.31200000001,184639.32500000001,182041.55900000001,166724.26,184161.93100000001,173494.46100000001,173886.989,175680.00399999999,177884.16800000001,192713.80300000001,182878.91,182334.08799999999,165752.552,187559.179,183398.663,167418.43700000001,185448.82,175172.701,184138.62400000001,162753.29800000001,184557.63500000001,199833.99400000001,198140.223,191165.39300000001,181351.79800000001,194312.774,191382.783,171121.66500000001,189600.554,179374.39799999999,182068.07199999999,175199.829,195773.45699999999,199399.29,172730.772,198093.171,184851.45199999999,188070.08300000001,188283.13200000001,171043.63099999999,"-","-","-","-","-","-","-","-","-","-"]
[null,"Turbina de gas",52857,58444,91260,61071,57809,75033,67196,68751,76471.12,83282,74117,58140,64149,63769,68930,63759,61840,50272,47789,55948,62897,57361,55111,47645,49303,38729,28799,32804,40343,47105,47074,42237,50914,36660,29392,30166,34805,21886,30042,11292,38398,37443,25400,29481,39778.542000000016,31205,25237.511999999988,17204,13491.04,18753.394,20108.357,13928.882,30855.155999999999,31941.35,29817.828000000001,24986.524000000001,28373.723999999998,46582.514999999999,44841.277999999998,39601.608999999997,34501.046999999999,37022.040999999997,48996.798000000003,30090.472000000002,33696.629000000001,29253.317999999999,46053.292999999998,43711.142,56663.614000000001,57351.207000000002,58097.326999999997,53609.258999999998,49954.794000000002,46945.324000000001,50673.428999999996,43039.485999999997,43644.055,41616.254000000001,41444.798000000003,49387.207999999999,59150.887000000002,62477.417999999998,48260.309000000001,53988.732000000004,33759.934000000001,27745.124,31738.947,35768.232000000004,25760.225999999999,22539.748,31573.401000000002,33220.502,28044.227999999999,35123.300999999999,32417.243999999999,28837.824000000001,26534.567999999999,32861.773999999998,19596.028999999999,21361.484,24865.670999999998,29044.708999999999,26256.525000000001,19704.468000000001,50295.97,36660.589,36644.1,39940.959000000003,28149.965,28792.431,24246.495999999999,23841.564999999999,37191.684999999998,35424.377999999997,28336.128000000001,25334.37,32683.006000000001,24129.387999999999,22541.904999999999,20232.469000000001,18719.830000000002,21856.048999999999,18621.348999999998,19322.266,17715.981,14422.895,15882.528,31498.591,37833.684000000001,27452.880000000001,26044.13,29769.361000000001,31339.258000000002,19520.755000000001,"-","-","-","-","-","-","-","-","-","-"]
[null,"Turbina de vapor",348359,305913,351244,298246,274223,249935,254565,265884,284703,261074,270998,264847,267716,244594,270944,295087,222900,280003,253974,300035,289769,297640,280624,303519,325375,311290,288853,271239,285962,228474,273542,273013,285098,298907,282718,289770,283886,246215,277471,250511,289749,254556,266775,281781,281193,297557,249395,264539,275233.60499999998,239085.291,258003.02499999999,233931.054,254626.209,255627.035,246393.45,264783.53899999999,255925.19500000001,219068.06,221691.14600000001,248219.49600000001,239152.19,224589.21100000001,264589.24699999997,228431.98499999999,220646.28899999999,180534.772,228077.55900000001,216593.97700000001,207647.78599999999,232308.245,184270.27900000001,210977.70300000001,234910.72899999999,199336.31400000001,227404.86499999999,205202.234,198111.728,221665.34599999999,237362.986,233682.87599999999,221969.495,235563.274,244573.82199999999,226155.13399999999,194241.535,194878.78899999999,217861,205723.48800000001,195840,176159.163,213945.36199999999,213545,203418,222976.21599999999,206361,220100,216734.185,176820.28400000001,150580.23300000001,152882.11199999999,146331.71,168933.78899999999,183295.43400000001,180439.144,162676.41099999999,170399.29300000001,169086.92,195856.557,202078.565,176220.30100000001,182024.82699999999,159738.79300000001,150618.451,185584.929,204266.86600000001,206409.50700000001,216761.283,163670.58600000001,156374.23000000001,221565.19099999999,229365.61300000001,206627.829,219237.899,193798.73,173434.728,204683.361,222433.549,236381.93400000001,224084.522,208666.932,172369.114,245579.43599999999,210604.08499999999,197884.05799999999,"-","-","-","-","-","-","-","-","-","-"]
[null,"Fuel + Gas",566729,512716,598972,502819,502890,502690,497777,513868,543691.12,524004,503094,492836,519473,461518,510101,517844,445806,498030,484825,534629,522467,527068,505906,520610,544582,519972,482261,475048,510924,446315,500997,496656,520447,513162,481920,499249,494190,429533,475440,423526,503067,469097,474127,495212,506132.54200000002,522240,457710.51199999999,476224,476585.071,424794.03399999999,466088.68400000001,421229.15,447615.27099999995,452368.41399999999,457557.74900000001,488106.93,474218.45499999996,466035.20799999998,451417.55,473240.01800000004,462156.10100000002,431533.32700000005,501068.16200000001,435484.88500000001,424513.86199999996,389170.03099999996,461445.45200000005,446130.05499999999,452383.23699999996,468028.76799999998,415367.3,442960.30499999999,464365.75799999997,423102.06400000001,457883.79000000004,426403.011,421410.94999999995,427164.03200000001,451431.723,481069.02999999997,453155.51400000002,472745.42599999998,456682.61900000001,451238.50899999996,407869.80900000001,389056.40899999999,429591.90100000001,398148.51,388558.37199999997,360507.68,412923.60100000002,429832.73800000001,403264.12699999998,437634.598,419171.55599999998,433577.14899999998,425310.31200000003,376406.31800000003,354338.19300000003,347738.05700000003,345084.37,373658.50199999998,387436.12699999998,392857.41500000004,395851.29099999997,389393.97,371483.57200000004,423356.69500000001,413627.19299999997,372431.16899999999,391720.14299999998,358753.05900000001,371948.76,383762.60499999998,417160.62900000002,431577.87100000004,447584.51199999999,378965.36700000003,360267.93300000002,436110.43400000001,439468.22600000002,399605.54300000001,427459.80200000003,392495.39399999997,373218.78099999996,394306.08499999996,434089.53399999999,467279.815,434648.978,434212.98300000001,383264.696,463418.88,430226.47499999998,388448.44400000002,"-","-","-","-","-","-","-","-","-","-"]
[null,"Ciclo combinado",125939,107765,79372,139320,154766,168017,187960,206155,200181,216209,204172,217541,203577,170340,199354,152118,243924,185380,229495,189228,195544,230632,226835,216848,199787,167592,219679,215393,194309,240047,218649,221342,228900,217782,219404,230433,218103,205178,222643,198070,148582,202502,234690,211977,201745,231922,241597,235319,230101.864,203031.70800000001,228450.67800000001,216494.734,193292.74799999999,190320.30900000001,218682.10200000001,224299.34099999999,235057.37,266936.90600000002,253781.81899999999,247960.606,252928.86600000001,190920.098,187526.745,212566.242,245524.253,275132.26,221773.29199999999,252862.68299999999,256339.48699999999,268452.36700000003,290455.41499999998,264393.52899999998,258410.93100000001,234103.44699999999,227913.742,212401.38500000001,248853.609,229398.86900000001,233205.38,233457.065,272722.63900000002,254754.65100000001,229874.65900000001,242675.19699999999,278031.61300000001,223389,245774,243841,250123,244898,263512.41499999998,270469,270577,264188,246468,251409,248686.91099999999,228402.05799999999,280046.83,274981.90600000002,280289.39600000001,252045.92199999999,271160.34499999997,264740.07900000003,318190.978,336165.95299999998,298564.98200000002,258173.584,256340.41899999999,226895.34400000001,255027.685,261373.916,260976.97200000001,242886.79,257449.17300000001,257210.08600000001,261505.807,350690.36800000002,311693.576,270991.93400000001,247044.88200000001,217849.75099999999,233400.21299999999,247033.402,271015.08100000001,238084.59599999999,241073.81,247232.45699999999,240643.52799999999,294696.65299999999,304199.90299999999,249425.23499999999,282319.56300000002,237707.28200000001,"-","-","-","-","-","-","-","-","-","-"]
[null,"Generación auxiliar",0,0,0,0,0,0,0,0,0,0,0,0,12171,11523,11651,11641,10919,9438,10685,12461,11325,11933,10055,9038,10202,9659,10861,10032,6829,6410,7670,7858,5141,4729,5487,4869,4385,3909,4661,2586,2823,3208,5305,3351,1680,811,899,170,0,0,0,0,0,0,0,0,0,0,0,0,0,0]
[null,"Régimen ordinario",692668,620481,678344,642139,657656,670707,685737,720023,743872.12,740213,707266,710377,735221,643381,721106,681603,700649,692848,725005,736318,729336,769633,742796,746496,754571,697223,712801,700473,712062,692772,727316,725856,754488,735673,706811,734551,716678,638620,702744,624182,654472,674807,714122,710540,709557.54200000002,754973,700206.51199999999,711713,706686.93500000006,627825.74199999997,694539.36199999996,637723.88400000008,640908.01899999997,642688.723,676239.85100000002,712406.27099999995,709275.82499999995,732972.11400000006,705199.36899999995,721200.62400000007,715084.96700000006,622453.42500000005,688594.90700000001,648051.12699999998,670038.11499999999,664302.29099999997,683218.74400000006,698992.73800000001,708722.72399999993,736481.13500000001,705822.71499999997,707353.83400000003,722776.68900000001,657205.51099999994,685797.53200000001,638804.39599999995,670264.55899999989,656562.90100000007,684637.103,714526.09499999997,725878.15300000005,727500.07700000005,686557.27800000005,693913.70600000001,685901.42200000002,612445.40899999999,675365.90100000007,641989.51,638681.37199999997,605405.67999999993,676436.01600000006,700301.73800000001,673841.12699999998,701822.598,665639.55599999998,684986.14899999998,"-","-","-","-","-","-","-","-","-","-","-","-","-","-","-","-","-","-","-","-","-","-","-","-","-","-","-","-","-","-","-","-","-","-","-","-","-","-","-","-","-","-","-","-","-","-","-","-"]
[null,"Hidroeólica",0,0,0,0,0,0,0,0,0,0,0,0,0,0,0,0,0,0,0,0,0,0,0,0,0,0,0,0,0,0,0,0,0,0,0,0,0,0,0,0,0,0,0,0,0,0,0,0,0,0,0,0,0,0,0,0,0,0,0,0,0,0,0,0,0,0,0,0,0,0,0,0,0,0,0,0,0,0,0,0,0,0,0,0,0,0,0,0,0,0,0,0,0,0,0,0,0,0,0,0,0,0,0.311,314.81299999999999,161.52500000000001,195.471,201.01499999999999,198.726,416.17599999999999,374.87299999999999,243.78399999999999,125.636,242.05799999999999,362.42099999999999,2082.991,1928.8240000000001,742,484.64600000000002,882.971,670.68600000000004,814.1,1779.5260000000001,1522.376,1303.018,923.46299999999997,2002.62,2580.2730000000001,2223.9,2171.9670000000001,733.35400000000004,1012.851,1035.191,1084.578,1404.7149999999999,"-","-","-","-","-","-","-","-","-","-"]
[null,"Hidráulica/Resto hidráulica",0,0,0,0,0,0,0,0,0,0,0,0,0,0,0,0,0,0,82,190,247,92,278,287,287,244,240,0,185,315,305,97,0,0,0,0,9,164,175,50,0,0,0,0,0,0,0,0,0,0,0,0,0,0,0,0,0,0,0,0,0,0,2,239,165,131,245,179,201,238,164,111.408,116.43899999999999,7.4999999999999997E-2,163.001,246.87899999999999,218.845,207.49700000000001,62.734999999999999,231.00200000000001,221.7,205.726,40.073,75.364000000000004,222.602,204.523,136.68199999999999,136.99,292.267,286.38799999999998,286.267,286.37400000000002,292.33800000000002,303.71199999999999,293.16300000000001,306,305,276,301,290,300,283,308,310.02100000000002,296,272,261,277,"-","-","-","-","-","-","-","-","-","-","-","-","-","-","-","-","-","-","-","-","-","-","-","-","-","-","-","-","-","-","-","-","-","-","-","-"]
[null,"Eólica",17431.845000000001,18906.552,22433.485000000001,28613.578000000001,35233.5,25590.253000000001,56231.544000000002,38386.534,22680.768,19552.138999999999,15309.171,25694.21,17536,22919,37045,26057,34949,31706,57951,48557,26273,19181,16085,18581,12697,16352,39237,36025,31842,39889,59648,61491,17713,33991,22016,25574,23706,17290,24349,46455,32116,20734,55995,57105,22914,12762,24732,20549,11740,14778,23015,32147,36251,38838,47304,42622,35769,14015,17956,16928,11345,24277,22847,23944,19554,37648,55422,51939,31495,25599,15790,34295,18963.88,33726.285000000003,33681.697,30021.198,26774.771000000001,44057.214,57535.39,54601,12813.212,17087.317999999999,16904.712,15601.111999999999,24542.069,28387.059000000001,13294,27647.999,38088.171000000002,48342,41479,42314,24540,24190,27763,22147,29456,32606,45694,27506,42525,35026,45220,59362,12482,15750,20599,23738,41442,43677,41792.052000000003,28967,40094,30389,59611,49740,17421,10614,24303,8611,19200,40945,33833,26154,30569,44446,57020,48823,46832,13434,17631,15673,15064,24462.879000000001,"-","-","-","-","-","-","-","-","-","-"]
[null,"Solar fotovoltaica",36.402000000000001,46.195999999999998,66.179000000000002,67.328000000000003,76.62,77.052999999999997,98.995000000000005,430.70800000000003,484.04,533.36199999999997,462.50200000000001,536.16499999999996,610,833,1268,1459,1737,1692,2046,2433,2017,2022,1635,1621,2022,2658,3713,4145,4312,4894,5548,5693,6152,9825,7689,6849,8709,10847,12492,16156,16219,16256,17530,17568,12555,13377,11497,9124,10698,10306,16328,16499,19138,19607,22480,21526,17621,15830,12519,12614,15178,16843,19656,19729,20773,23349,23817,24739,20929,17684,14494,14948,15819,17853,23039,20676,24978,25023,26449,26299,23158,19232,16071,17914,20253,19458,23739,27152,27710,30875,30903,26948,24098,22190,17740,15636,18995,20132,27162,25919,29372,27594,27933,29920,21433,20634,16824,16373,18338.863000000001,17768,25470.297999999999,25100,29874,27309,30356,26058,20796,17895,18495,18094,19687,19975,24013,24125,25229,29403,29164,27390,25675,20095,16929,15590,17847,18645.307000000001,"-","-","-","-","-","-","-","-","-","-"]
[null,"Térmica renovable/Otras renovables",8687.5660000000044,11201.251999999999,21105.335999999999,20726.093999999997,19570.879999999997,20816.694,21169.460999999999,19156.758000000002,13239.191999999999,22026.499000000003,17532.326999999997,22967.625,21162,19576,5693,17196,15807,15288,19273,20695,19120,18295,18031,23147,22239,19665,20200,19685,21462,14780,144,21585,13957,17447,22889,23166,23472,22220,12230,24755,22920,23920,24575,24604,23900,22497,23578,24384,23902,18935,16313,24282,25112,19550,10072,5987,5025,5016,3979,2388,3274,5746,5969,5585,6959,1329,735,722,702,703,749,675.36300000000006,612.11,489.72300000000001,585.19799999999998,682.91600000000005,647.63499999999999,645.86599999999999,716.72299999999996,723.62,743.06100000000004,760.45899999999995,617.47500000000002,825.66800000000001,628.67399999999998,697.577,800.20100000000002,747.98099999999999,798.7,697.58100000000002,798.74400000000003,711.54100000000005,628.87699999999995,722.197,511,644,787,707,778,663,669,643,797,820.72199999999998,629,747,835,731,378,350,448,494,606,795.298,837.91800000000001,841,865,810,840,788,861,735,824,817,884,679,761,696,738,786,765,789,811,0,"-","-","-","-","-","-","-","-","-","-"]
[null,"Térmica no renovable/Cogeneración y resto/Cogeneración",2832.1869999999999,0,0,0,0,0,0,0,0,0,0,0,0,0,0,0,0,0,0,0,0,0,0,0,0,0,0,0,0,0,0,0,0,0,0,0,0,0,0,0,10,10,0,0,0,0,0,0,0,0,0,0,0,0,0,0,0,0,0,0,0,0,0,0,0,0,0,0,0,0,0,0,0,0,0,0,0,0,0,0,0,0,0,0,0,0,0,0,0,0,0,0,0,0,0,0,0,0,0,0,0,0,0,0,0,0,0,0,0,0,0,0,0,0,0,0,0,0,0,0,0,0,0,0,0,0,0,0,0,0,0,0,0,0,"-","-","-","-","-","-","-","-","-","-"]
[null,"Régimen especial",28988,30154,43605,49407,54881,46484,77500,57974,36404,42112,33304,49198,39308,43328,44006,44712,52493,48686,79352,71875,47657,39590,36029,43636,37245,38919,63390,59855,57801,59878,65645,88866,37822,61263,52594,55589,55896,50521,49246,87416,71265,60920,98100,99277,59369,48636,59807,54057,46340,44019,55656,72928,80501,77995,79856,70135,58415,34861,34454,31930,29797,46866,48474,49497,47451,62457,80219,77579,53327,44224,31197,50029.771000000001,35511.429000000004,52069.082999999999,57468.895999999993,51626.993000000002,52619.251000000004,69933.577000000005,84763.847999999998,81854.622000000003,36935.972999999998,37285.502999999997,33633.26,34416.143999999993,45646.345000000001,48747.159,37969.883000000002,55684.97,66889.137999999992,80200.969000000012,73467.010999999999,70259.915000000008,49559.215000000004,47405.909,46307.163,38733,"-","-","-","-","-","-","-","-","-","-","-","-","-","-","-","-","-","-","-","-","-","-","-","-","-","-","-","-","-","-","-","-","-","-","-","-","-","-","-","-","-","-","-","-","-","-","-","-"]
[null,"Generación",721656,650635,721949,691546,712537,717191,763237,777997,780276.12,782325,740570,759575,774529,686709,765112,726315,753142,741534,804357,808193,776993,809223,778825,790132,791816,736142,776191,760328,769863,752650,792961,814722,792310,796936,759405,790140,772574,689141,751990,711598,725737,735727,812222,809817,768926.54200000002,803609,760013.51199999999,765770,753026.93500000006,671844.74199999997,750195.36199999996,710651.88399999996,721409.01899999997,720683.723,756095.85100000002,782541.27099999995,767690.82499999995,767833.11400000006,739653.36899999995,753130.62400000007,744881.96700000006,669319.42500000005,737068.90700000001,697548.12699999998,717489.11499999999,726759.29099999997,763437.74400000006,776571.73800000001,762049.72399999993,780705.13500000001,737019.71499999997,757383.60499999998,758288.11800000002,709274.59399999992,743266.42799999996,690431.38899999997,722883.80999999994,726496.47800000012,769400.951,796380.71699999995,762814.12600000005,764785.58000000007,720190.53800000006,728329.85,731547.76699999999,661192.56799999997,713335.7840000001,697674.48,705570.51,685606.64899999998,749903.027,770561.65300000005,723400.34199999995,749228.50699999998,711946.71900000004,723719.14899999998,723540.223,658529.37600000005,708320.02300000004,677097.96299999999,698239.76599999995,689250.424,732854.78300000005,748325.05,749043.79399999999,763158.39399999997,708768.56900000002,722848.005,730846.25100000005,661766.38600000006,715006.56200000003,675105.61100000003,704036.79,685801.11399999994,767801.71100000001,767658.78099999996,749210.31900000002,759770.38100000005,716783.48,735575.054,727384.20799999998,681171.82,721363.39099999995,692226.81400000001,702147.32499999995,709222.30099999998,765001.61699999997,793911.17200000002,750991.473,764228.99,724062.45,746201.30599999998,747616.61600000004,670668.62699999998,"-","-","-","-","-","-","-","-","-","-"]
[null,"Demanda transporte (b.c.)",721656,650635,721949,691546,712537,717191,763237,777997,780276.12,782325,740570,759575,774529,686709,765112,726315,753142,741534,804357,808193,776993,809223,778825,790132,791816,736142,776191,760328,769863,752650,792961,814722,792310,796936,759405,790140,772574,689141,751990,711598,725737,735727,812222,809817,768926.54200000002,803609,760013.51199999999,765770,753026.93500000006,671844.74199999997,750195.36199999996,710651.88399999996,721409.01899999997,720683.723,756095.85100000002,782541.27099999995,767690.82499999995,767833.11400000006,739653.36899999995,753130.62400000007,744881.96700000006,669319.42500000005,737068.90700000001,697548.12699999998,717489.11499999999,726759.29099999997,763437.74400000006,776571.73800000001,762049.72399999993,780705.13500000001,737019.71499999997,757383.60499999998,758288.11800000002,709274.59399999992,743266.42799999996,690431.38899999997,722883.80999999994,726496.47800000012,769400.951,796380.71699999995,762814.12600000005,764785.58000000007,720190.53800000006,728329.85,731547.76699999999,661192.56799999997,713335.7840000001,697674.48,705570.51,685606.64899999998,749903.027,770561.65300000005,723400.34199999995,749228.50699999998,711946.71900000004,723719.14899999998,723540.223,658529.37600000005,708320.02300000004,677097.96299999999,698239.76599999995,689250.424,732854.78300000005,748325.05,749043.79399999999,763158.39399999997,708768.56900000002,722848.005,730846.25100000005,661766.38600000006,715006.56200000003,675105.61100000003,704036.79,685801.11399999994,767801.71100000001,767658.78099999996,749210.31900000002,759770.38100000005,716783.48,735575.054,727384.20799999998,681171.82,721363.39099999995,692226.81400000001,702147.32499999995,709222.30099999998,765001.61699999997,793911.17200000002,750991.473,764228.99,724062.45,746201.30599999998,747616.61600000004,670668.62699999998,"-","-","-","-","-","-","-","-","-","-"]
[]
[null,"Balance eléctrico mensual Ceuta (MWh)","2007-01-01","2007-02-01","2007-03-01","2007-04-01","2007-05-01","2007-06-01","2007-07-01","2007-08-01","2007-09-01","2007-10-01","2007-11-01","2007-12-01","2008-01-01","2008-02-01","2008-03-01","2008-04-01","2008-05-01","2008-06-01","2008-07-01","2008-08-01","2008-09-01","2008-10-01","2008-11-01","2008-12-01","2009-01-01","2009-02-01","2009-03-01","2009-04-01","2009-05-01","2009-06-01","2009-07-01","2009-08-01","2009-09-01","2009-10-01","2009-11-01","2009-12-01","2010-01-01","2010-02-01","2010-03-01","2010-04-01","2010-05-01","2010-06-01","2010-07-01","2010-08-01","2010-09-01","2010-10-01","2010-11-01","2010-12-01","2011-01-01","2011-02-01","2011-03-01","2011-04-01","2011-05-01","2011-06-01","2011-07-01","2011-08-01","2011-09-01","2011-10-01","2011-11-01","2011-12-01","2012-01-01","2012-02-01","2012-03-01","2012-04-01","2012-05-01","2012-06-01","2012-07-01","2012-08-01","2012-09-01","2012-10-01","2012-11-01","2012-12-01","2013-01-01","2013-02-01","2013-03-01","2013-04-01","2013-05-01","2013-06-01","2013-07-01","2013-08-01","2013-09-01","2013-10-01","2013-11-01","2013-12-01","2014-01-01","2014-02-01","2014-03-01","2014-04-01","2014-05-01","2014-06-01","2014-07-01","2014-08-01","2014-09-01","2014-10-01","2014-11-01","2014-12-01","2015-01-01","2015-02-01","2015-03-01","2015-04-01","2015-05-01","2015-06-01","2015-07-01","2015-08-01","2015-09-01","2015-10-01","2015-11-01","2015-12-01","2016-01-01","2016-02-01","2016-03-01","2016-04-01","2016-05-01","2016-06-01","2016-07-01","2016-08-01","2016-09-01","2016-10-01","2016-11-01","2016-12-01","2017-01-01","2017-02-01","2017-03-01","2017-04-01","2017-05-01","2017-06-01","2017-07-01","2017-08-01","2017-09-01","2017-10-01","2017-11-01","2017-12-01"]
[null,"Motores diesel",17987,16069,16710,15678,16366,16225,17421,17411,16812,17279,16847,17839,18351,17181,16737,16313,16713,16662,18076,18122,17406,17168,17471,19471,19477,16819,17213,15436,16246,17311,18716,16715,17948,18184,16095,18156,16835.431,16928.368999999999,17444.607,16234.076999999999,17320.935000000001,17763.089,19394.422999999999,20221.285,18911.028999999999,18433.375,17839.231,17340.393,16727.881000000001,15217.21,16429.356,14974.758,15954.127,17325.873,18625.857,18453.02,16688.655999999999,17719.741999999998,16751.113000000001,17804.328000000001,18519.808000000001,17894.414000000001,17521.669000000002,16664.298999999999,17367.828000000001,17463.541000000001,17737.678,18518.044000000002,17121.613000000001,17633.501,17338.467000000001,17742.492999999999,17871.498,15517.114,15413.289000000001,14540.856,15588.026,15754.197,17866.71,18953.246999999999,17325.048999999999,16943.32,17475.432000000001,18463.232,18803.363000000001,17215.982,17659.373,14795.035,17087.592000000001,17314.243999999999,18277.513999999999,18625.962,18513.111000000001,18195.284,17359.330999999998,18317.776000000002,19053.228999999999,16016.588,16277.81,15464.3,16941.84,16886,19016,18610.287,16586.142,16965.087,15808.663,17089.672999999999,17310.635999999999,16980.969000000001,16401.867999999999,16859.536,16947,16955.065999999999,18292,19186,18115.226999999999,17861.330000000002,17439.016,18263.341,18539.718000000001,16572.716,"-","-","-","-","-","-","-","-","-","-"]
[null,"Turbina de gas",0,0,0,0,0,0,0,0,0,0,0,0,0,0,0,0,0,0,0,0,0,0,0,0,0,0,0,0,0,0,159,1859,0,0,1026,209,2043.2850000000001,554.101,0,147.30500000000001,121.071,0,0,0,0,0,0,3.105,26.117999999999999,31.277000000000001,0,0,171.80099999999999,31.510999999999999,20.882000000000001,0.93100000000000005,0,3.8050000000000002,6.5309999999999997,8.1189999999999998,0,140.90799999999999,107.63500000000001,9.984,132.47800000000001,24.65,16.8,38.817999999999998,2.2269999999999999,55.817999999999998,19.222999999999999,0,34.442,39.906999999999996,0.03,31.384,112.964,8.6,0,0,0,0,10.622999999999999,10.144,2.427,0,76.222999999999999,0,0.24299999999999999,0.21,0,0.216,0.24299999999999999,0.29399999999999998,9.2989999999999995,0,0.16200000000000001,220,-0.16,0.25,65,9,139,0.93300000000000005,0.48799999999999999,0,289.024,0.28399999999999997,0.51500000000000001,0.64100000000000001,0.5,0.41199999999999998,0.504,0.17899999999999999,0.60299999999999998,0.52300000000000002,92.182000000000002,3.8860000000000001,15.701000000000001,0.51200000000000001,0.35199999999999998,2.8839999999999999,"-","-","-","-","-","-","-","-","-","-"]
[null,"Fuel + Gas",17987,16069,16710,15678,16366,16225,17421,17411,16812,17279,16847,17839,18351,17181,16737,16313,16713,16662,18076,18122,17406,17168,17471,19471,19477,16819,17213,15436,16246,17311,18875,18574,17948,18184,17121,18365,18878.716,17482.469999999998,17444.607,16381.382,17442.006000000001,17763.089,19394.422999999999,20221.285,18911.028999999999,18433.375,17839.231,17343.498,16753.999,15248.486999999999,16429.356,14974.758,16125.928,17357.383999999998,18646.739000000001,18453.951000000001,16688.655999999999,17723.546999999999,16757.644,17812.447,18519.808000000001,18035.322,17629.304,16674.282999999999,17500.306,17488.191000000003,17754.477999999999,18556.862000000001,17123.84,17689.319,17357.690000000002,17742.492999999999,17905.939999999999,15557.020999999999,15413.319000000001,14572.24,15700.99,15762.797,17866.71,18953.246999999999,17325.048999999999,16943.32,17486.055,18473.376,18805.79,17215.982,17735.596000000001,14795.035,17087.834999999999,17314.453999999998,18277.513999999999,18626.178,18513.353999999999,18195.578000000001,17368.629999999997,18317.776000000002,19053.391,16236.588,16277.65,15464.55,17006.84,16895,19155,18611.22,16586.63,16965.087,16097.687,17089.956999999999,17311.150999999998,16981.61,16402.367999999999,16859.948,16947.504000000001,16955.244999999999,18292.602999999999,19186.523000000001,18207.409,17865.216,17454.717000000001,18263.852999999999,18540.07,16575.599999999999,"-","-","-","-","-","-","-","-","-","-"]
[null,"Régimen ordinario",17987,16069,16710,15678,16366,16225,17421,17411,16812,17279,16847,17839,18351,17181,16737,16313,16713,16662,18076,18122,17406,17168,17471,19471,19477,16819,17213,15436,16246,17311,18875,18574,17948,18184,17121,18365,18878.716,17482.469999999998,17444.607,16381.382,17442.006000000001,17763.089,19394.422999999999,20221.285,18911.028999999999,18433.375,17839.231,17343.498,16753.999,15248.486999999999,16429.356,14974.758,16125.928,17357.383999999998,18646.739000000001,18453.951000000001,16688.655999999999,17723.546999999999,16757.644,17812.447,18519.808000000001,18035.322,17629.304,16674.282999999999,17500.306,17488.191000000003,17754.477999999999,18556.862000000001,17123.84,17689.319,17357.690000000002,17742.492999999999,17905.939999999999,15557.020999999999,15413.319000000001,14572.24,15700.99,15762.797,17866.71,18953.246999999999,17325.048999999999,16943.32,17486.055,18473.376,"-","-","-","-","-","-","-","-","-","-","-","-","-","-","-","-","-","-","-","-","-","-","-","-","-","-","-","-","-","-","-","-","-","-","-","-","-","-","-","-","-","-","-","-","-","-","-","-"]
[null,"Generación",17987,16069,16710,15678,16366,16225,17421,17411,16812,17279,16847,17839,18351,17181,16737,16313,16713,16662,18076,18122,17406,17168,17471,19471,19477,16819,17213,15436,16246,17311,18875,18574,17948,18184,17121,18365,18878.716,17482.469999999998,17444.607,16381.382,17442.006000000001,17763.089,19394.422999999999,20221.285,18911.028999999999,18433.375,17839.231,17343.498,16753.999,15248.486999999999,16429.356,14974.758,16125.928,17357.383999999998,18646.739000000001,18453.951000000001,16688.655999999999,17723.546999999999,16757.644,17812.447,18519.808000000001,18035.322,17629.304,16674.282999999999,17500.306,17488.191000000003,17754.477999999999,18556.862000000001,17123.84,17689.319,17357.690000000002,17742.492999999999,17905.939999999999,15557.020999999999,15413.319000000001,14572.24,15700.99,15762.797,17866.71,18953.246999999999,17325.048999999999,16943.32,17486.055,18473.376,18805.79,17215.982,17735.596000000001,14795.035,17087.834999999999,17314.453999999998,18277.513999999999,18626.178,18513.353999999999,18195.578000000001,17368.629999999997,18317.776000000002,19053.391,16236.588,16277.65,15464.55,17006.84,16895,19155,18611.22,16586.63,16965.087,16097.687,17089.956999999999,17311.150999999998,16981.61,16402.367999999999,16859.948,16947.504000000001,16955.244999999999,18292.602999999999,19186.523000000001,18207.409,17865.216,17454.717000000001,18263.852999999999,18540.07,16575.599999999999,"-","-","-","-","-","-","-","-","-","-"]
[null,"Demanda transporte (b.c.)",17987,16069,16710,15678,16366,16225,17421,17411,16812,17279,16847,17839,18351,17181,16737,16313,16713,16662,18076,18122,17406,17168,17471,19471,19477,16819,17213,15436,16246,17311,18875,18574,17948,18184,17121,18365,18878.716,17482.469999999998,17444.607,16381.382,17442.006000000001,17763.089,19394.422999999999,20221.285,18911.028999999999,18433.375,17839.231,17343.498,16753.999,15248.486999999999,16429.356,14974.758,16125.928,17357.383999999998,18646.739000000001,18453.951000000001,16688.655999999999,17723.546999999999,16757.644,17812.447,18519.808000000001,18035.322,17629.304,16674.282999999999,17500.306,17488.191000000003,17754.477999999999,18556.862000000001,17123.84,17689.319,17357.690000000002,17742.492999999999,17905.939999999999,15557.020999999999,15413.319000000001,14572.24,15700.99,15762.797,17866.71,18953.246999999999,17325.048999999999,16943.32,17486.055,18473.376,18805.79,17215.982,17735.596000000001,14795.035,17087.834999999999,17314.453999999998,18277.513999999999,18626.178,18513.353999999999,18195.578000000001,17368.629999999997,18317.776000000002,19053.391,16236.588,16277.65,15464.55,17006.84,16895,19155,18611.22,16586.63,16965.087,16097.687,17089.956999999999,17311.150999999998,16981.61,16402.367999999999,16859.948,16947.504000000001,16955.244999999999,18292.602999999999,19186.523000000001,18207.409,17865.216,17454.717000000001,18263.852999999999,18540.07,16575.599999999999,"-","-","-","-","-","-","-","-","-","-"]
[]
[null,"Balance eléctrico mensual Melilla (MWh)","2007-01-01","2007-02-01","2007-03-01","2007-04-01","2007-05-01","2007-06-01","2007-07-01","2007-08-01","2007-09-01","2007-10-01","2007-11-01","2007-12-01","2008-01-01","2008-02-01","2008-03-01","2008-04-01","2008-05-01","2008-06-01","2008-07-01","2008-08-01","2008-09-01","2008-10-01","2008-11-01","2008-12-01","2009-01-01","2009-02-01","2009-03-01","2009-04-01","2009-05-01","2009-06-01","2009-07-01","2009-08-01","2009-09-01","2009-10-01","2009-11-01","2009-12-01","2010-01-01","2010-02-01","2010-03-01","2010-04-01","2010-05-01","2010-06-01","2010-07-01","2010-08-01","2010-09-01","2010-10-01","2010-11-01","2010-12-01","2011-01-01","2011-02-01","2011-03-01","2011-04-01","2011-05-01","2011-06-01","2011-07-01","2011-08-01","2011-09-01","2011-10-01","2011-11-01","2011-12-01","2012-01-01","2012-02-01","2012-03-01","2012-04-01","2012-05-01","2012-06-01","2012-07-01","2012-08-01","2012-09-01","2012-10-01","2012-11-01","2012-12-01","2013-01-01","2013-02-01","2013-03-01","2013-04-01","2013-05-01","2013-06-01","2013-07-01","2013-08-01","2013-09-01","2013-10-01","2013-11-01","2013-12-01","2014-01-01","2014-02-01","2014-03-01","2014-04-01","2014-05-01","2014-06-01","2014-07-01","2014-08-01","2014-09-01","2014-10-01","2014-11-01","2014-12-01","2015-01-01","2015-02-01","2015-03-01","2015-04-01","2015-05-01","2015-06-01","2015-07-01","2015-08-01","2015-09-01","2015-10-01","2015-11-01","2015-12-01","2016-01-01","2016-02-01","2016-03-01","2016-04-01","2016-05-01","2016-06-01","2016-07-01","2016-08-01","2016-09-01","2016-10-01","2016-11-01","2016-12-01","2017-01-01","2017-02-01","2017-03-01","2017-04-01","2017-05-01","2017-06-01","2017-07-01","2017-08-01","2017-09-01","2017-10-01","2017-11-01","2017-12-01"]
[null,"Motores diesel",14250,12593,13459,13734.55,15030,15717.05,17790.86,17035.759999999998,16233.4,16172.12,14199,15653,15536,14623,14355,14494,14972,16029,18094,19226,16880,15757,15458,17701,17753,15189,15459,14176,15222,16183,18807,19379,16442,17363,15428,16152,16952.252,15255.491,16387.781999999999,15007.841,15685.419,16778.191999999999,18965.345000000001,20588.25,17840.763999999999,16821.623,16795.423999999999,17639.588,17153.75,15687.581,16335.433000000001,14891.459000000001,16230.351000000001,17378.183000000001,18744.133999999998,20150.581999999999,18022.712,17479.501,16862.537,18360.63,18982.949000000001,18439.042000000001,17598.366000000002,16008.083000000001,17071.491000000002,18279.878000000001,20047.005000000001,20975.616999999998,17694.951000000001,17457.093000000001,15636.494000000001,16659.874,17115.314999999999,15530.096,15812.071,15148.964,16036.971,15760.647999999999,18177.462,19692.631000000001,17663.716,16819.196,16654.163,17052.628000000001,17118.326000000001,15201.501,16103.739,14934.156000000001,15882.369000000001,16465.359,18018.314999999999,19102.751,17938.815999999999,16800.553,16113.986999999999,16483.738000000001,17344.713,16116.182000000001,15853.05,15037.97,15928.74,16467.5,20942,20511.47,17059.901999999998,16541.39,16050.43,16374.786,16091.574000000001,15296.040999999999,15130.281999999999,15195.992,15696.293,16469.571,17928.629000000001,19658.901000000002,17864.674999999999,16595.343000000001,16240.307000000001,16158.705,17669.7,16077.652,"-","-","-","-","-","-","-","-","-","-"]
[null,"Turbina de gas",389,201,257,105.44999999999999,69,0.95,123.13999999999999,231.23999999999998,37.599999999999994,48.879999999999995,484,465,838,433,488,171,45,136,205,76,213,250,217,9,10,11,77,53,2,63,0,61,78,7,126,57,16.721,21.806999999999999,3.2509999999999999,24.138000000000002,34.966000000000001,92.513000000000005,106.417,34.25,37.728999999999999,33.689,53.722999999999999,39.252000000000002,32.543999999999997,2.2170000000000001,6.0549999999999997,42.744,23.423999999999999,34.478000000000002,134.26499999999999,34.911000000000001,9.9920000000000009,126.021,46.3,10.09,4.4249999999999998,0,0,1.526,4.5659999999999998,8.4990000000000006,21.271000000000001,0,70.233000000000004,0,1.829,0,0,0.875,0,0,1.1830000000000001,0.33400000000000002,0.35899999999999999,0,0,67.254999999999995,0,14.781000000000001,3.0590000000000002,44.712000000000003,9.57,0,0,64.411000000000001,29.164999999999999,0,52.308999999999997,92.685000000000002,202,226.292,310,0,49.45,0,0,1.73,124,0.88900000000000001,0,0,99.494,2.2949999999999999,0,0.254,0.52900000000000003,108,12.135,28.161999999999999,58.256,15,16.379000000000001,0,0,2.8180000000000001,0,3.05,"-","-","-","-","-","-","-","-","-","-"]
[null,"Fuel + gas",14639,12794,13716,13840,15099,15718,17914,17267,16271,16221,14683,16118,16374,15056,14843,14665,15017,16165,18299,19302,17093,16007,15675,17710,17763,15200,15536,14229,15224,16246,18807,19440,16520,17370,15554,16209,16968.973000000002,15277.298000000001,16391.032999999999,15031.979000000001,15720.385,16870.704999999998,19071.762000000002,20622.5,17878.492999999999,16855.311999999998,16849.147000000001,17678.84,17186.294000000002,15689.798000000001,16341.488000000001,14934.203000000001,16253.775000000001,17412.661,18878.398999999998,20185.492999999999,18032.703999999998,17605.522000000001,16908.837,18370.72,18987.374,18439.042000000001,17598.366000000002,16009.609,17076.057000000001,18288.377,20068.276000000002,20975.616999999998,17765.184000000001,17457.093000000001,15638.323,16659.874,17115.314999999999,15530.971,15812.071,15148.964,16038.154,15760.982,18177.821,19692.631000000001,17663.716,16886.451000000001,16654.163,17067.409,17121.385000000002,15246.213,16113.308999999999,14934.156000000001,15882.369000000001,16529.77,18047.48,19102.751,17991.125,16893.238000000001,16315.986999999999,16710.030000000002,17654.713,16116.182000000001,15902.5,15037.97,15928.74,16469.23,21066,20512.359,17059.901999999998,16541.39,16149.924000000001,16377.081,16091.574000000001,15296.295,15130.811,15303.992,15708.428,16497.733,17986.885000000002,19673.901000000002,17881.054,16595.343000000001,16240.307000000001,16161.522999999999,17669.7,16080.701999999999,"-","-","-","-","-","-","-","-","-","-"]
[null,"Régimen ordinario",14639,12794,13716,13840,15099,15718,17914,17267,16271,16221,14683,16118,16374,15056,14843,14665,15017,16165,18299,19302,17093,16007,15675,17710,17763,15200,15536,14229,15224,16246,18807,19440,16520,17370,15554,16209,16968.973000000002,15277.298000000001,16391.032999999999,15031.979000000001,15720.385,16870.704999999998,19071.762000000002,20622.5,17878.492999999999,16855.311999999998,16849.147000000001,17678.84,17186.294000000002,15689.798000000001,16341.488000000001,14934.203000000001,16253.775000000001,17412.661,18878.398999999998,20185.492999999999,18032.703999999998,17605.522000000001,16908.837,18370.72,18987.374,18439.042000000001,17598.366000000002,16009.609,17076.057000000001,18288.377,20068.276000000002,20975.616999999998,17765.184000000001,17457.093000000001,15638.323,16659.874,17115.314999999999,15530.971,15812.071,15148.964,16038.154,15760.982,18177.821,19692.631000000001,17663.716,16886.451000000001,16654.163,17067.409,"-","-","-","-","-","-","-","-","-","-","-","-","-","-","-","-","-","-","-","-","-","-","-","-","-","-","-","-","-","-","-","-","-","-","-","-","-","-","-","-","-","-","-","-","-","-","-","-"]
[null,"Solar fotovoltaica",0,0,0,0,0,0,0,0,0,0,0,0,1,0,0,0,0,1,1,1,1,0,1,0,8,17,22,28,9,8,8,8,7,6,0,1,1,5,6,7,9,1,8,9,7,6,5,3,4,7,7,7,8,8,7,6,5,5,4,4,5,7,7,9,9,9,9,8,7,6,4,4,5,5,7,7,9,9,8,8,7,7,5,4,4,6,8,9,9,9,9,9,7,7,4,4,5,5,8,6,8,8,9,7,7,6,5,4,4,6,8,9,9,8,7,8,7,6,5,4,5,0,"-","-","-","-","-","-","-","-","-","-"]
[null,"Térmica no renovable/Cogeneración y resto/Cogeneración",747,694,836,656,886,845,733,805,275,611,799,853,937,797,849,810,755,694,0,0,0,0,0,0,819,726,782,888,819,747,783,727,707,1,0,736,699,606,781,808,921,710,772,797,897,486,0,551,929,796,861,747,674,670,765,676,693,209,16,0,0,0,0,63,0,0,0,171,552,47,672,804,781,648,605,726,627,794,679,647,611,893,165,863,878,853,900,784,684,655,775,700,720,789,179,981,0,0,0,0,0,0,0,0,0,0,0,0,0,0,0,0,0,0,0,0,0,0,0,0,0,0,"-","-","-","-","-","-","-","-","-","-"]
[null,"Residuos","-","-","-","-","-","-","-","-","-","-","-","-","-","-","-","-","-","-","-","-","-","-","-","-","-","-","-","-","-","-","-","-","-","-","-","-","-","-","-","-","-","-","-","-","-","-","-","-","-","-","-","-","-","-","-","-","-","-","-","-","-","-","-","-","-","-","-","-","-","-","-","-","-","-","-","-","-","-","-","-","-","-","-","-","-","-","-","-","-","-","-","-","-","-","-","-",812,769,799,769,799,725,612,661,699,848,221,877,973,826,776,900,743,813,790,805,829,1009,222,1013,904,728.00699999999995,"-","-","-","-","-","-","-","-","-","-"]
[null,"Régimen especial",747,694,836,656,886,845,733,805,275,611,799,853,938,797,849,810,755,695,1,1,1,0,1,0,827,743,804,916,828,755,791,735,714,7,0,737,700,611,787,815,930,711,780,806,904,492,5,554,933,803,868,754,682,678,772,682,698,214,20,4,5,7,7,72,9,9,9,179,559,53,676,808,786,653,612,733,636,803,687,655,618,900,170,867,"-","-","-","-","-","-","-","-","-","-","-","-","-","-","-","-","-","-","-","-","-","-","-","-","-","-","-","-","-","-","-","-","-","-","-","-","-","-","-","-","-","-","-","-","-","-","-","-"]
[null,"Generación",15386,13488,14552,14496,15985,16563,18647,18072,16546,16832,15482,16971,17312,15853,15692,15475,15772,16860,18300,19303,17094,16007,15676,17710,18590,15943,16340,15145,16052,17001,19598,20175,17234,17377,15554,16946,17668.973000000002,15888.298000000001,17178.032999999999,15846.978999999999,16650.384999999998,17581.705000000002,19851.761999999999,21428.5,18782.492999999999,17347.312000000002,16854.147000000001,18232.84,18119.294000000002,16492.797999999999,17209.488000000001,15688.203,16935.775000000001,18090.661,19650.399000000001,20867.492999999999,18730.704000000002,17819.522000000001,16928.837,18374.72,18992.374,18446.042000000001,17605.366000000002,16081.609,17085.057000000001,18297.377,20077.276000000002,21154.616999999998,18324.184000000001,17510.093000000001,16314.323,17467.874,17901.314999999999,16183.971,16424.071,15881.964,16674.153999999999,16563.982,18864.821,20347.631000000001,18281.716,17786.451000000001,16824.163,17934.409,18003.384999999998,16105.213,17021.309000000001,15727.156000000001,16575.368999999999,17193.77,18831.48,19811.751,18718.125,17689.238000000001,16498.987000000001,17695.03,18471.713,16890.182000000001,16709.5,15812.97,16735.740000000002,17202.23,21687,21180.359,17765.901999999998,17395.39,16375.924000000001,17258.080999999998,17068.574000000001,16128.295,15914.811,16212.992,16460.428,17318.733,18783.884999999998,20486.901000000002,18717.054,17610.343000000001,16467.307000000001,17178.523000000001,18578.7,16808.708999999999,"-","-","-","-","-","-","-","-","-","-"]
[null,"Demanda transporte (b.c.)",15386,13488,14552,14496,15985,16563,18647,18072,16546,16832,15482,16971,17312,15853,15692,15475,15772,16860,18300,19303,17094,16007,15676,17710,18590,15943,16340,15145,16052,17001,19598,20175,17234,17377,15554,16946,17668.973000000002,15888.298000000001,17178.032999999999,15846.978999999999,16650.384999999998,17581.705000000002,19851.761999999999,21428.5,18782.492999999999,17347.312000000002,16854.147000000001,18232.84,18119.294000000002,16492.797999999999,17209.488000000001,15688.203,16935.775000000001,18090.661,19650.399000000001,20867.492999999999,18730.704000000002,17819.522000000001,16928.837,18374.72,18992.374,18446.042000000001,17605.366000000002,16081.609,17085.057000000001,18297.377,20077.276000000002,21154.616999999998,18324.184000000001,17510.093000000001,16314.323,17467.874,17901.314999999999,16183.971,16424.071,15881.964,16674.153999999999,16563.982,18864.821,20347.631000000001,18281.716,17786.451000000001,16824.163,17934.409,18003.384999999998,16105.213,17021.309000000001,15727.156000000001,16575.368999999999,17193.77,18831.48,19811.751,18718.125,17689.238000000001,16498.987000000001,17695.03,18471.713,16890.182000000001,16709.5,15812.97,16735.740000000002,17202.23,21687,21180.359,17765.901999999998,17395.39,16375.924000000001,17258.080999999998,17068.574000000001,16128.295,15914.811,16212.992,16460.428,17318.733,18783.884999999998,20486.901000000002,18717.054,17610.343000000001,16467.307000000001,17178.523000000001,18578.7,16808.708999999999,"-","-","-","-","-","-","-","-","-","-"]
[]
[null,"Balance eléctrico mensual nacional (GWh)","2007-01-01","2007-02-01","2007-03-01","2007-04-01","2007-05-01","2007-06-01","2007-07-01","2007-08-01","2007-09-01","2007-10-01","2007-11-01","2007-12-01","2008-01-01","2008-02-01","2008-03-01","2008-04-01","2008-05-01","2008-06-01","2008-07-01","2008-08-01","2008-09-01","2008-10-01","2008-11-01","2008-12-01","2009-01-01","2009-02-01","2009-03-01","2009-04-01","2009-05-01","2009-06-01","2009-07-01","2009-08-01","2009-09-01","2009-10-01","2009-11-01","2009-12-01","2010-01-01","2010-02-01","2010-03-01","2010-04-01","2010-05-01","2010-06-01","2010-07-01","2010-08-01","2010-09-01","2010-10-01","2010-11-01","2010-12-01","2011-01-01","2011-02-01","2011-03-01","2011-04-01","2011-05-01","2011-06-01","2011-07-01","2011-08-01","2011-09-01","2011-10-01","2011-11-01","2011-12-01","2012-01-01","2012-02-01","2012-03-01","2012-04-01","2012-05-01","2012-06-01","2012-07-01","2012-08-01","2012-09-01","2012-10-01","2012-11-01","2012-12-01","2013-01-01","2013-02-01","2013-03-01","2013-04-01","2013-05-01","2013-06-01","2013-07-01","2013-08-01","2013-09-01","2013-10-01","2013-11-01","2013-12-01","2014-01-01","2014-02-01","2014-03-01","2014-04-01","2014-05-01","2014-06-01","2014-07-01","2014-08-01","2014-09-01","2014-10-01","2014-11-01","2014-12-01","2015-01-01","2015-02-01","2015-03-01","2015-04-01","2015-05-01","2015-06-01","2015-07-01","2015-08-01","2015-09-01","2015-10-01","2015-11-01","2015-12-01","2016-01-01","2016-02-01","2016-03-01","2016-04-01","2016-05-01","2016-06-01","2016-07-01","2016-08-01","2016-09-01","2016-10-01","2016-11-01","2016-12-01","2017-01-01","2017-02-01","2017-03-01","2017-04-01","2017-05-01","2017-06-01","2017-07-01","2017-08-01","2017-09-01","2017-10-01","2017-11-01","2017-12-01"]
[null,"Hidráulica",2180.2910000000002,2816.85,3681.2779999999998,2543.08,2606.62,2145.8719999999998,2385.9169999999999,1774.248,1432.069,1747.45,1421.001,1346.903,1354.557,1017.947,1055.817,2312.2390000000028,2901.1320000000001,2793.6149999999998,1979.105,1408.5820000000001,1259.7329999999999,1112.6410000000001,1480.5540000000001,2281.4679999999998,2097.9879999999998,3127.0059999999999,2431.4079999999999,1883.19,2181.9209999999998,1816.87,1561.7719999999999,1338.6790000000001,928.48599999999999,1227.0160000000001,1839.212,2954.6869999999999,4943.8859499999999,3839.0311169999995,5413.0431369999997,4242.06855,3370.5034819999996,3107.1967400000003,2576.5870980000004,1856.882582,1412.9943119999998,1524.8942180000001,2269.414636,3573.4001699999999,4736.5628710000001,2661.6892859999998,3413.7218309999998,3149.45552,2414.9504689999999,1754.2660740000001,1378.1070500000001,1346.7738899999999,1126.0635560000001,1274.6933589999999,1952.7332340000003,2016.8889999999999,1609.526934,1159.229,1252.6359339999999,1581.8849599999999,2116.5652480000003,1863.3216060000002,1529.5821759999999,1326.369134,1106.9148759999998,1403.075294,1852.2709339999999,2378.397978,2718.6579339999998,3206.1979780000001,4235.7799880000002,4914.1344440000003,3283.0264539999998,2759.058822,2359.4900980000002,1902.6690140000001,1663.8942159999999,1738.634822,2524.9989999999998,2270.638978,3919.5779440000001,5374.0318909999996,4837.8854680000004,4532.4247269999996,2487.6323629999997,2166.4078939999999,2042.0008519999999,1790.9552760000001,1600.810338,1538.6477809999999,2233.1350000000002,2935.3649999999998,2886.2129100000002,3851.043737,4171.6554210000004,2911.6831630000001,3189.1991050000001,2611.6269889999999,2165.9147390000003,1837.7454960000002,1764.069618,1896.4676689999999,2164.5671699999998,1771.1892560000001,3895.8781610000001,4485.5141109999995,4714.1469069999994,5656.5196770000002,5401.5337499999996,3107.8617949999998,2361.545239,2151.0182740000005,1755.1702809999999,1794.0609140000001,1750.163509,2095.34501,2334.3965710000002,2167.2811000000002,"-","-","-","-","-","-","-","-","-","-"]
[null,"Nuclear",5319.1580000000004,4778.3050000000003,4947.4629999999997,4342.93,3485.058,3161.45,3855.7460000000001,3976.62,4877.2839999999997,4891.0659999999998,3934.346,5069.5010000000002,5322.9409999999998,5119.9319999999998,5354.7060000000001,4039.7550000000001,4689.7039999999997,4579.7330000000002,4541.0349999999999,5013.9489999999996,4482.3890000000001,4314.4620000000004,4045.8270000000002,4955.8580000000002,5438.39,4335.1400000000003,3949.223,4063.489,3687.607,3530.33,3998.25,5278.1620000000003,4387.8469999999998,3957.8240000000001,3973.4949999999999,3949.6880000000001,4480.6099999999997,4635.9830000000002,4877.9646469999998,4894.268,4417.8689999999997,4693.97,5399.9840000000004,5421.2550000000001,5066.8190000000004,5429.7690000000002,5094.6189999999997,4829.2110000000002,4718.777,4271.59,4332.2643109999999,4457.3370000000004,3640.74,4702.2290000000003,4823.0249999999996,5271.61,4983.1229999999996,4499.7290000000003,4546.8770000000004,4856.63,5171.7839999999997,5146.0450000000001,5472.3729999999996,5200.7150000000001,4487.326,3504.3710000000001,5098.692,5457.9219999999996,5300.0649999999996,5396.02,4070.386,4361.2879999999996,4582.8119999999999,4425.6019999999999,5210.3209999999999,4458.8410000000003,3995.2890000000002,4334.933,5136.4780000000001,5025.3630000000003,4740.6139999999996,4342.4009999999998,4067.681,3986.5520000000001,4535.384,4723.7730000000001,5288.5060000000003,5057.6959999999999,4341.3779999999997,3439.377,4262.5479999999998,4221.3969999999999,4806.0709999999999,5129.5820000000003,4369.2830000000004,4695.2439999999997,5242.7219999999998,4720.8609999999999,5205.7860000000001,4690.1409999999996,3554.4010480000002,3771.7689999999998,4798.9250000000002,4963.9790000000003,4873.9170000000004,4095.259,3973.4929999999999,4863.5860000000002,4615.6859999999997,3973.2069999999999,5191.7529999999997,5055.57,3891.866,4819.2470000000003,5178.0649999999996,5151.8209999999999,5009.8950000000004,5096.1009999999997,3774.5970000000002,4341.1639999999998,5285.3739999999998,4755.5749999999998,"-","-","-","-","-","-","-","-","-","-"]
[null,"Carbón",6355.9290000000001,5122.8689999999997,5084.009,6098.4139999999998,6219.9310000000005,5996.3879999999999,6220.3989999999994,6178.9250000000002,5753.5960000000005,5577.9750000000004,5687.9780000000001,6333.69,5268.5780000000004,4867.5980000000009,3927.5260000000003,3323.2709999999997,2421.4650000000001,2321.1170000000002,3976.9629999999997,3367.8240000000001,3731.902,4344.1439999999993,4316.3040000000001,4641.6710000000003,4771.5609999999997,3283.0160000000001,3194.9989999999998,2027.452,2501.1990000000001,2745.4129999999996,3511.5260000000003,2102.6730000000002,2949.413,3336.002,2251.8330000000001,2117.9380000000001,1984.722964,1620.4064370000001,1128.3404140000002,904.4831099999999,1053.230108,1601.6091620000002,2742.5060000000003,3122.487928,3256.4198250000004,2204.4321009999999,1819.434667,2262.5406840000001,2317.9490940000001,2688.5375240000003,3114.9868590000001,2636.293561,3202.2224959999999,2982.2018439999997,4478.8947290000006,4355.3382540000002,4935.4912349999995,4481.8416289999996,4047.311404,4025.6256289999997,5420.7886419999995,5503.6138369999999,4674.8311439999998,2723.9471229999999,4013.7438219999999,5305.8050000000003,4946.9890000000005,5091.3140000000003,4045.915,4244.0140369999999,4076.3720000000003,3766.0839999999998,3069.549,2589.366,1444.32,1079.71,2089.6330000000003,2664.9409999999998,5473.6450000000004,4622.5050000000001,4769.3790000000008,4201.7021700000005,2679.560602,4843.2529999999997,2299.6970000000001,906.38099999999997,1309.4750000000001,1396.712,3372.1858039999997,5214.5529999999999,5612.7840000000006,5291.3990000000003,5911.97,4547.2020000000002,3234.9090000000001,4223.0349999999999,5080.8930799999998,3113.2180399999997,2764.9660000000003,3026.5721089999997,2957.1604540000003,5516.3035399999999,6282.2818219999999,5453.0897719999994,4797.4280559999997,4387.6389789999994,4681.7661900000003,4727.7226219999993,2676.173241,1906.2928549999999,1795.6659729999999,1055.057986,1233.321087,2269.9624720000002,3945.654931,3655.5441080000001,4561.0403310000002,4508.0514950000006,4638.0322109999997,5229.2586120000005,5387.1972139999998,3535.5151049999999,"-","-","-","-","-","-","-","-","-","-"]
[null,"Fuel + Gas",768.6,809.29600000000005,838.596,760.79700000000003,775.88300000000004,747.34100000000001,950.17899999999997,946.66399999999999,919.39,799.77,841.274,830.67499999999995,829.66100000000006,776.97799999999995,690.65699999999993,738.39300000000003,796.62799999999993,853.54200000000003,852.61299999999994,943.85699999999997,880.45299999999997,850.27800000000002,839.86,834.64599999999996,768.62099999999998,673.43399999999997,795.63,680.08900000000006,729.07300000000009,778.62199999999996,889.54100000000005,870.26300000000003,821.12954200000001,758.47799999999995,740.34751200000005,771.07600000000002,769.16592200000014,680.88749999999982,622.58834999999999,645.15955300000007,743.36511300000006,767.24708999999996,791.55072799999994,801.00316300000009,775.18720799999994,725.47373100000004,741.36895700000014,758.76250100000016,594.46196099999997,548.13641900000005,628.73061000000007,550.15159600000004,557.56008599999984,542.76850400000001,647.65554300000008,646.04798199999993,617.66063399999996,597.759548,529.63905899999986,563.86776599999996,595.02567899999985,558.84153600000013,581.4469160000001,539.54576300000008,552.35293499999989,588.50467299999991,639.53546399999993,690.0367839999999,609.933943,604.058763,565.98287499999992,572.94640199999992,532.66472899999997,506.30962900000003,545.41229299999998,508.11154999999997,519.77221799999995,501.987346,602.74917900000003,626.30885999999998,562.466453,572.35046799999998,533.84648600000003,561.82555000000002,547.60081200000002,488.23519400000004,469.5920680000001,459.03594500000003,476.65172900000005,526.14371499999993,571.8504989999999,590.03464600000007,570.07531000000006,527.43748799999992,484.29922300000004,545.77096299999994,543.26087299999995,491.748515,513.332629,474.64373399999999,512.16199800000004,541.06126199999994,631.12966299999994,638.96411599999999,609.24020499999995,513.03766000000007,471.43111900000002,556.63920300000007,558.98156400000005,515.02531699999997,549.77632600000004,508.834249,511.64875999999998,554.64312699999994,627.29648499999996,672.29061000000002,608.87011400000006,576.03649499999995,499.50138099999992,581.64503200000001,564.00679699999989,501.77534099999997,"-","-","-","-","-","-","-","-","-","-"]
[null,"Ciclo combinado",6359.7610000000004,4080.7000000000003,4156.2129999999997,4273.4560000000001,4686.4580000000005,6528.933,6999.7269999999999,5503.9960000000001,5974.326,6466.7110000000002,7970.268,7599.5889999999999,8292.021999999999,8254.7870000000003,7091.7349999999997,7235.1049999999996,7505.3360000000002,7943.0940000000001,9260.9190000000017,8622.5419999999995,8167.759,7543.9189999999999,7156.8680000000004,6123.4529999999995,6394.8369999999995,4731.2190000000001,5388.1019999999999,5722.3029999999999,5822.0680000000002,7920.2789999999995,8907.5990000000002,8556.3119999999999,7707.5259999999998,6844.3010000000004,5793.1239999999998,6436.125,5621.9420650000002,5052.5037549999997,4384.9885919999997,4612.7417769999993,4834.0750719999996,5727.7229470000002,7160.3432119999998,6106.9485729999997,6544.5626990000001,5651.8631519999999,5881.4311129999996,5219.8611950000004,5357.8028379999996,4918.2779559999999,4328.05987,3079.8573809999998,4480.5739949999997,5207.2115969999995,4853.8780049999996,5091.4672199999995,4843.1770889999998,4096.5522579999997,3732.806521,3667.6058979999998,4550.816683,4236.0278829999997,3352.2137270000003,2485.3611889999997,2702.1673509999996,3418.6407119999999,3694.776656,3827.2448949999998,3194.7783510000004,3541.4010209999997,3221.146659,3075.423538,2923.0959130000001,2233.4364020000003,1783.2560400000002,1390.2393050000001,1923.9943190000001,1640.0760009999999,2520.2975040000001,2665.8331080000003,2506.6999999999998,2852.639095,2316.1537779999999,3071.1162589999999,1833.13393,1541.5453049999999,1616.1849179999999,1520.9307210000002,1736.4137759999999,2041.9860920000001,2149.1419169999999,2511.653084,2994.6609210000001,2526.5715639999999,2309.4357760000003,2293.4695470000001,2521.0563010000001,1980.7948249999999,1918.4897619999999,2039.256764,1964.8185550000001,2169.9870989999999,3743.5810409999999,2621.2569169999997,2296.6953170000002,2556.0560369999998,2481.0695129999999,2997.6873089999999,2215.2318340000002,1643.6677439999999,1709.6473960000001,1470.6547109999999,1789.8288790000001,2134.718523,2639.9092639999999,2288.5378639999999,2410.8169469999998,3609.7440000000001,3762.997374,3582.8581290000002,3154.652748,1783.4263859999999,"-","-","-","-","-","-","-","-","-","-"]
[null,"Régimen ordinario",20983.739000000001,17608.02,18707.559000000001,18018.677,17773.95,18579.984,20411.968000000001,18380.453000000001,18956.665000000001,19482.972000000002,19854.866999999998,21180.358,21067.758999999998,20037.241999999998,18120.440999999999,17648.763000000003,18314.264999999999,18491.100999999999,20610.635000000002,19356.754000000001,18522.236000000001,18165.444,17839.413,18837.095999999998,19471.396999999997,16149.814999999999,15759.361999999997,14376.523000000001,14921.868000000002,16791.513999999999,18868.688000000002,18146.089,16794.401542,16123.620999999999,14598.011512000001,16229.513999999999,17800.326901,15828.811808999997,16426.925139999999,15298.720989999998,14419.042774999998,15897.745939000002,18670.971038000003,17308.577246000001,17055.983044000001,15536.432202,15806.268372999999,16643.775550000002,17725.553764,15088.231185000001,15817.763481000002,13873.095058000001,14296.047046,15188.677018999999,16181.560326999999,16711.237345999998,16505.515513999999,14950.575793999998,14809.367217999999,15130.618293,17347.941938,16603.757256000001,15333.500721,12531.454034999999,13872.155355999999,14680.642991000001,15909.575296000001,16392.886812999997,14257.607169999999,15188.569115,13786.158468,14154.139918000001,13826.779576000001,12960.912009,13219.089320999999,12351.036298999999,11811.714990999999,11900.996168999998,16092.659781000002,14842.678982000001,14243.053669000001,13707.727555000001,12122.240866,14733.385786999999,"-","-","-","-","-","-","-","-","-","-","-","-","-","-","-","-","-","-","-","-","-","-","-","-","-","-","-","-","-","-","-","-","-","-","-","-","-","-","-","-","-","-","-","-","-","-","-","-"]
[null,"Hidroeólica","-","-","-","-","-","-","-","-","-","-","-","-","-","-","-","-","-","-","-","-","-","-","-","-","-","-","-","-","-","-","-","-","-","-","-","-","-","-","-","-","-","-","-","-","-","-","-","-","-","-","-","-","-","-","-","-","-","-","-","-","-","-","-","-","-","-","-","-","-","-","-","-","-","-","-","-","-","-","-","-","-","-","-","-","-","-","-","-","-","-","-",0.31481300000000001,0.161525,0.19547100000000001,0.201015,0.19872599999999999,0.41617599999999999,0.37487300000000001,0.243784,0.125636,0.242058,0.36242099999999999,2.0829909999999998,1.9288240000000001,0.74199999999999999,0.48464600000000002,0.88297099999999995,0.670686,0.81410000000000005,1.7795260000000002,1.522376,1.303018,0.92346299999999992,2.0026199999999998,2.580273,2.2239,2.171967,0.73335400000000006,1.0128509999999999,1.035191,1.084578,1.4047149999999999,"-","-","-","-","-","-","-","-","-","-"]
[null,"Hidráulica/Resto hidráulica",345.48899999999998,478.79599999999999,516.02800000000002,529.75900000000001,509.19,412.91699999999997,302.29399999999998,256.69099999999997,186.381,186.98000000000002,190.15099999999998,211.82500000000002,340.49299999999999,233.46199999999999,301.47399999999999,581.11099999999999,613.46399999999994,581.87,380.714,264.678,212.28,190.523,400.12099999999998,539.62599999999998,521.06399999999996,629.61599999999999,560.02,501.49200000000002,577.14200000000005,468.387,365.35300000000001,282.64999999999998,242.869,230.81,466.05,608.61800000000005,764.37,616.57799999999997,784.76,690.19600000000003,688.34299999999996,608.94799999999998,459.60300000000001,341.74799999999999,281.05,318.88900000000001,567.66,702.17499999999995,663.64800000000002,506.22,655.86500000000001,588.36700000000008,489.70300000000003,405.38899999999995,384.43099999999998,304.97299999999996,235.76399999999998,189.24,423.65600000000001,448.73440799999997,336.93943899999999,331.68107499999996,325.02500100000003,468.52787899999998,642.37884499999996,439.77049699999998,337.78873499999997,265.08300199999996,199.02969999999999,269.68972600000001,410.39107300000001,620.03036400000008,667.51160200000004,688.127523,842.4176819999999,845.50599,780.13926700000002,659.12538800000004,535.22726699999998,403.179374,303.20133799999996,342.96671200000003,522.91916300000003,511.88099999999997,783.65599999999995,754.84899999999993,806.46900000000005,776.58499999999992,608.77699999999993,523.70100000000002,480.10599999999999,401.82502099999999,357.68799999999999,363.00200000000001,544.26599999999996,672.07500000000005,"-","-","-","-","-","-","-","-","-","-","-","-","-","-","-","-","-","-","-","-","-","-","-","-","-","-","-","-","-","-","-","-","-","-","-","-"]
[null,"Eólica",2167.7449999999999,2895.3179999999998,3123.877,1382.6190000000001,2641.2139999999999,1818.328,1946.9179999999999,2468.8200000000002,2055.4479999999999,1927.347,2769.181,2414.8360000000002,2664.58,2035.72,4132.3620000000001,3389.4520000000002,1769.2150000000001,2125.6880000000001,2184.1570000000002,2034.3419999999999,2148.0600000000004,2516.4739999999997,3485.3240000000001,3674.4479999999999,3527.9769999999999,3244.2980000000002,3125.3940000000002,3106.5949999999998,2730.5969999999998,2353.5120000000002,2482.25,2293.0889999999999,2489.9910000000004,3138.623,4817.9000000000005,4942.6009999999997,4304.4309999999996,4637.902,4570.1519999999991,2667.3429999999998,3655.8969999999999,2615.31,2845.759,2937.761,2337.395,3967.3230000000003,4366.5439999999999,4639.5129999999999,4030.4670000000001,4053.1610000000001,4714.4639999999999,3423.9059999999999,3185.6109999999999,2975.2040000000002,3310.5589999999997,2781.78,2354.701,3175.6910000000003,3836.2260000000001,4623.6469999999999,3664.9578799999999,5049.4832850000003,3839.7926969999999,5336.9811980000004,3735.0307709999997,3473.6162140000001,3039.8783899999999,3181.7570000000001,3950.891212,3147.3323179999998,4622.2867120000001,5466.3301119999996,6316.8030689999996,5370.0570589999998,5763.1639999999998,4424.9819990000005,3970.8771710000001,3875.7850000000003,2885.9030000000002,3453.5439999999999,3239.1620000000003,3988.547,6458.3490000000002,4966.0729999999994,6569.5279999999993,5917.5259999999998,5096.7740000000003,3978.165,4177.875,3310.9670000000001,3637.1759999999999,2916.5050000000001,2145.3319999999999,3398.893,5093.1319999999996,4788.82,4954.5020000000004,5992.5469999999996,4907.4960519999995,3933.9198799999999,4841.183,2903.93,3113.2939999999999,3287.3440000000001,3020.625,3898.4188899999999,3724.59825,3537.27,5624.5709999999999,6110.1930000000002,5444.5460000000003,4441.6590000000006,3933.598,3271.453,3520.9690000000001,3650.951,2712.9459999999999,2389.35,3902.2419999999997,2687.84,4828.3510000000006,4883.6773089999997,"-","-","-","-","-","-","-","-","-","-"]
[null,"Solar fotovoltaica",10.391,12.96,21.983999999999998,26.105999999999998,36.128,40.742000000000004,51.927,56.504000000000005,60.428000000000004,57.695999999999998,54.375999999999998,54.66,59.578000000000003,73.40100000000001,108.56200000000001,131.04400000000001,137.02099999999999,196.40899999999999,240.44200000000001,298.52500000000003,328.08499999999998,334.32799999999997,335.40200000000004,255.15899999999999,261.25799999999998,396.22799999999995,528.73199999999997,569.73800000000006,672.34699999999998,643.83199999999999,717.298,663.41,511.53100000000001,502.20600000000002,361.99299999999999,243.81700000000001,263.11899999999997,305.07099999999997,481.50900000000001,590.40700000000004,711.44200000000001,685.33100000000002,785.81499999999994,723.07,631.37599999999998,548.48400000000004,382.17600000000004,314.97199999999998,356.50800000000004,504.47500000000002,536.09400000000005,661.11799999999994,747.8130000000001,810.57900000000006,855.84499999999991,802.64800000000002,732.96999999999991,628.05799999999999,363.85199999999998,425.15999999999997,504.68700000000001,660.33,770.14300000000003,658.51900000000001,863.505,875.875,941.61799999999994,865.18099999999993,692.37199999999996,595.35799999999995,372.47300000000001,402.029,446.28399999999999,527.67399999999998,566.69600000000003,763.80400000000009,872.91799999999989,930.95299999999997,974.76400000000001,896.60900000000004,759.63499999999999,634.76799999999992,513.57500000000005,439.23899999999998,377.51799999999997,434.38400000000001,735.89800000000002,791.91300000000001,924.375,903.697,951.48400000000004,913.99200000000008,686.95600000000002,647.95300000000009,385.42600000000004,453.97700000000003,518.44286299999999,494.22899999999998,713.271298,755.91261000000009,924.10299999999995,889.255,933.15800000000002,831.90200000000004,722.21187000000009,537.13499999999999,529.70299999999997,393.75200000000001,364.464,480.09199999999998,708.60699999999997,720.59100000000001,805.01499999999999,921.58299999999997,916.69799999999998,893.65100000000007,763.74699999999996,580.17700000000002,422.83300000000003,374.358,470.87200000000001,476.32650699999999,"-","-","-","-","-","-","-","-","-","-"]
[null,"Solar térmica",0,0,0.43099999999999999,0.34200000000000003,0.55800000000000005,0.88300000000000001,1.256,1.1160000000000001,0.63900000000000001,1.214,0.997,0.191,1.0840000000000001,0.79700000000000004,1.4610000000000001,0.95799999999999996,0.94199999999999995,1.9630000000000001,2.0379999999999998,1.98,0.85899999999999999,0.86599999999999999,1.27,1.1599999999999999,0.69,1.236,2.323,7.2039999999999997,7.6580000000000004,6.7519999999999998,12.414,23.867999999999999,17.539000000000001,23.446000000000002,16.183,10.51,13.151999999999999,11.682,23.731999999999999,36.92,69.084000000000003,72.531999999999996,104.59,121.9,100.917,71.745000000000005,31.619,33.747,34.25,88.656999999999996,98.456999999999994,137.833,154.07300000000001,232.48400000000001,284.20800000000003,235.32900000000001,228.55799999999999,172.91200000000001,80.436999999999998,85.159000000000006,117.342,200.34200000000001,235.113,177.77699999999999,348.38200000000001,414.74900000000002,541.31700000000001,485.12700000000001,368.64299999999997,285.79500000000002,133.96199999999999,135.58500000000001,113.494,204.00899999999999,125.37,300.89400000000001,499.26799999999997,647.33000000000004,758.52300000000002,661.85599999999999,478.95499999999998,294.24200000000002,199.22399999999999,158.36199999999999,79.801000000000002,103.265,385.17500000000001,435.52699999999999,729.93600000000004,687.28800000000001,811.15300000000002,833.178,389.596,289.33699999999999,90.186999999999998,124.47199999999999,176.95099999999999,190.92500000000001,415.82900000000001,393.16,694.83900000000006,734.05399999999997,888.91800000000001,607.62300000000005,483.25,188.16900000000001,226.81800000000001,84.698999999999998,59.914000000000001,133.02699999999999,387.89600000000002,408.32299999999998,498.49200000000002,813.99099999999999,825.32500000000005,805.81899999999996,595.62699999999995,284.70100000000002,139.69999999999999,118.872,149.214,122.50689999999999,"-","-","-","-","-","-","-","-","-","-"]
[null,"Térmica renovable/Otras renovables",216.57900000000001,190.44399999999999,202.655,201.31399999999999,212.92099999999999,208.53500000000003,222.32499999999999,223.34399999999999,210.393,242.72399999999999,222.18800000000002,235.54599999999999,240.54300000000001,235.363,243.89999999999998,241.16800000000001,240.34899999999999,235.23099999999999,223.648,239.89500000000001,225.512,247.172,248.54500000000002,247.38200000000001,267.15800000000002,253.47299999999998,264.57600000000002,300.05200000000002,272.99799999999999,253.04599999999999,260.84899999999999,260.46300000000002,287.976,347.83600000000001,272.58799999999997,276.327,274.84199999999998,245.35900000000001,262.31099999999998,277.04300000000001,300.03700000000003,288.51100000000002,278.10199999999998,284.791,267.96199999999999,284.303,273.09999999999997,295.99899999999997,360.32499999999999,334.40699999999998,355.24599999999998,356.64,335.76299999999998,336.97399999999999,358.63499999999999,356.02099999999996,375.80200000000002,383.84299999999996,376.08700000000005,388.24636300000003,394.35710999999998,373.43272300000001,398.84319799999997,372.66191600000002,361.52463499999999,406.76686599999999,422.10672299999999,401.27762000000001,373.84606100000002,413.891459,401.555475,434.50466799999998,436.52267400000005,415.74157700000001,453.79920099999998,422.25598100000002,438.81170000000003,393.22358099999997,432.786744,418.17954099999997,398.67487700000004,405.47619700000001,414.20800000000003,445.01599999999996,424.45600000000002,332.233,366.40699999999998,339.55800000000005,410.952,407.03699999999998,412.22,446.01172200000002,422.947,388.49400000000003,373.56199999999995,404.851,240.00928999999999,206.32529,234.65600000000001,180.423,226.98099999999999,277.27029800000003,300.35291799999999,312.37200000000001,302.41299999999995,311.08697000000001,304.67399999999998,287.41300000000001,269.97199999999998,261.56191999999999,255.62100000000001,209.99600000000001,277.35399999999998,287.57400000000001,311.36700000000002,327.20399999999995,307.94200000000001,306.8,305.06599999999997,306.70600000000002,327.173,299.38958000000002,"-","-","-","-","-","-","-","-","-","-"]
[null,"Térmica no renovable/Cogeneración y resto/Cogeneración",1995.5450000000001,1768.9959999999999,1879.5849999999998,1844.2359999999999,1838.9460000000001,1904.7730000000001,2000.027,1879.0259999999998,1965.914,2104.393,2108.9319999999998,2160.0570000000002,2263.8589999999999,2239.8829999999998,2285.25,2241.5010000000002,2119.1759999999999,2090.9559999999997,2229.8599999999997,2028.0640000000001,2188.578,2370.777,2326.19,2337.056,2435.4610000000002,2252.732,2408.4,2350.433,2364.2140000000004,2321.6890000000003,2408.567,2045.8420000000001,2349.3010000000004,2475.8960000000002,2583.23,2604.9659999999999,2672.7280000000001,2486.873,2628.8110000000001,2562.366,2593.181,2552.884,2625.9669999999996,2177.1619999999998,2550.5650000000001,2661.3690000000001,2677.2269999999999,2784.1910000000003,2796.9879999999998,2610.8319999999999,2895.174,2706.5819999999999,2734.9050000000002,2601.5860000000002,2665.2939999999999,2230.6089999999999,2664.549,2787.1820000000002,2771.509,2853.5859999999998,2953.8130000000001,2799.4249999999997,2938.2000000000003,2833.3379999999997,2870.8989999999999,2704.0389999999998,2812.6610000000001,2379.1909999999998,2765.1979999999999,2920.4010000000003,2862.3199999999997,2927.7640000000001,3021.6349999999998,2704.5899999999997,2900.9970000000003,2799.471,2837.9189999999999,2677.81,2682.4589999999998,2123.2829999999999,2588.922,2637.34,2631.232,2690.721,2699.431,1996.249,1915.193,1734.681,2072.8940000000002,2222.1299999999997,2283.788,2126.6960000000004,2284.6910000000003,2294.8229999999999,2087.91,2167.3380000000002,2225.9259999999999,1964.058,2120.3530000000001,2034.8821599999999,2124.3719999999998,2074.5451599999997,2170.1669999999999,2044.5060000000001,2156.192,2218.0360000000001,2132.4720000000002,2183.9849999999997,2131.5789999999997,1970.7236399999999,2072.4590000000003,1995.403,2115.7950000000001,2170.761,2242.5800000000004,2113.4169999999999,2124.06,2293.069,2262.9550000000004,2297.1930000000002,2449.107,2127.4550900000004,"-","-","-","-","-","-","-","-","-","-"]
[null,"Residuos","-","-","-","-","-","-","-","-","-","-","-","-","-","-","-","-","-","-","-","-","-","-","-","-","-","-","-","-","-","-","-","-","-","-","-","-","-","-","-","-","-","-","-","-","-","-","-","-","-","-","-","-","-","-","-","-","-","-","-","-","-","-","-","-","-","-","-","-","-","-","-","-","-","-","-","-","-","-","-","-","-","-","-","-","-","-","-","-","-","-","-","-","-","-","-","-",261.846,237.131,279.62,215.535,272.78000000000003,283.40600000000001,296.51599999999996,296.90800000000002,287.73699999999997,306.529,292.20100000000002,267.94900000000001,276.262,246.47200000000001,284.61599999999999,231.23699999999999,191.03900000000002,278.75400000000002,329.91399999999999,329.64500000000004,325.101,318.42200000000003,288.82600000000002,289.983,297.58500000000004,264.45020699999998,"-","-","-","-","-","-","-","-","-","-"]
[null,"Régimen especial",4735.7489999999998,5346.5139999999992,5744.5599999999995,3984.3760000000002,5238.9570000000003,4386.1779999999999,4524.7469999999994,4885.5010000000002,4479.2029999999995,4520.3540000000003,5345.8249999999998,5077.1149999999998,5570.1369999999997,4818.6259999999993,7073.009,6585.2339999999995,4880.1670000000004,5232.1170000000002,5260.8590000000004,4867.4840000000004,5103.3740000000007,5660.1399999999994,6796.8520000000008,7054.8309999999983,7013.6080000000002,6777.5829999999996,6889.4450000000015,6835.5139999999992,6624.9560000000001,6047.2180000000008,6246.7309999999998,5569.3220000000001,5899.2070000000012,6718.8170000000009,8517.9440000000013,8686.8389999999999,8292.6419999999998,8303.4650000000001,8751.2749999999996,6824.2749999999996,8017.9840000000004,6823.5160000000005,7099.8359999999993,6586.4320000000007,6169.2649999999994,7852.1130000000012,8298.3260000000009,8770.5969999999998,8242.1859999999997,8097.7520000000004,9255.2999999999993,7874.4459999999999,7647.8680000000004,7362.2160000000013,7858.9719999999998,6711.3600000000006,6592.3440000000001,7336.9260000000013,7851.7670000000007,8824.5327710000001,7972.0964289999993,9414.6940830000003,8507.1168959999995,9847.8049930000016,8821.7202509999988,8314.8165769999996,8095.3698480000003,7577.6166219999996,8349.9799729999995,7632.4675029999999,8802.9882599999983,9986.243144,11002.250344999999,9910.1991589999998,10652.443883,9556.9129700000012,9399.9331380000003,9184.2269689999994,8269.6630110000006,7956.6509149999983,7768.5502150000011,8303.3399090000003,10739.507163,9211.2919999999995,"-","-","-","-","-","-","-","-","-","-","-","-","-","-","-","-","-","-","-","-","-","-","-","-","-","-","-","-","-","-","-","-","-","-","-","-","-","-","-","-","-","-","-","-","-","-","-","-"]
[null,"Generación",25719.488000000005,22954.533999999996,24452.118999999999,22003.053,23012.906999999999,22966.162000000004,24936.715000000004,23265.954000000005,23435.868000000002,24003.326000000001,25200.691999999999,26257.472999999998,26637.895999999997,24855.868000000002,25193.45,24233.997000000007,23194.431999999997,23723.217999999997,25871.494000000002,24224.238000000001,23625.61,23825.584000000003,24636.264999999999,25891.927,26485.004999999994,22927.397999999997,22648.807000000001,21212.037000000004,21546.824000000004,22838.731999999996,25115.418999999998,23715.411,22693.608541999998,22842.437999999998,23115.955512,24916.352999999996,26092.968900999997,24132.276808999995,25178.200139999997,22122.995989999996,22437.026774999998,22721.261938999996,25770.807038000003,23895.009246000001,23225.248044,23388.545201999998,24104.594372999993,25414.37255,25967.739764000005,23185.983184999994,25073.063481000001,21747.541057999995,21943.915045999998,22550.893018999999,24040.532327000001,23422.597346000002,23097.859514,22287.501794,22661.134217999999,23955.151063999998,25320.038367000001,26018.451339000003,23840.617617,22379.259027999997,22693.875607000005,22995.459568000002,24004.945144000001,23970.503434999999,22607.587142999997,22821.036617999998,22589.146728000003,24140.383062000001,24829.029920999998,22871.111167999996,23871.533203999999,21907.949269000001,21211.648129000001,21085.223138000001,24362.322792000003,22799.329897,22011.603884000004,22011.067464,22861.748028999998,23944.677787000001,24069.783685999999,22572.472389999999,22827.559454000002,21023.228392999998,21339.070671999998,21443.287701000005,23214.252268,22043.961561999997,22170.959093999998,21652.138304,21205.746014000004,23304.616236000002,24652.238493000004,23243.256280000001,23245.698945999997,20656.255055999998,21262.241217999996,21773.570768999994,25326.321174000004,22897.619124999997,21314.521065999998,20908.318851,20983.676213000002,21672.563076000002,22689.526900000001,21727.556112999999,23116.256977999998,21755.148641,20650.414938999998,20632.551536999999,22901.904192000002,22042.122756000004,21177.387639999997,21757.246257999999,21747.926326000001,21906.257973999996,25249.013907999997,20918.783240000001,"-","-","-","-","-","-","-","-","-","-"]
[null,"Consumos en bombeo",-371.77600000000001,-395.87900000000002,-384.16800000000001,-293.39699999999999,-397.62200000000001,-356.25400000000002,-333.52100000000002,-371.38200000000001,-345.92500000000001,-317.00099999999998,-384.15499999999997,-481.20699999999999,-430.83600000000001,-419.30500000000001,-401.79399999999998,-219.05799999999999,-206.07300000000001,-285.255,-253.78200000000001,-190.80199999999999,-226.55600000000001,-297.14499999999998,-411.25599999999997,-460.64,-492.22699999999998,-392.03500000000003,-281.47199999999998,-255.75899999999999,-247.49799999999999,-224.59399999999999,-241.018,-245.006,-254.49299999999999,-284.12299999999999,-397.50099999999998,-478.46300000000002,-756.58548100000007,-554.72222199999999,-544.66441799999996,-303.16059899999999,-279.94919199999998,-230.155124,-199.16812999999999,-231.14395499999998,-233.69566899999998,-346.11598499999997,-322.22366899999997,-456.19813299999998,-430.91918800000002,-280.66478600000005,-347.70577100000003,-297.00992200000002,-158.92510200000001,-139.95152400000001,-173.53430600000002,-181.06439699999999,-176.06341800000001,-301.62591900000001,-325.48060800000002,-402.01487400000002,-448.91067399999997,-444.12264199999998,-429.06647600000002,-565.84194300000001,-360.20398999999998,-322.06323800000001,-285.67122799999999,-365.72605300000004,-454.578665,-397.03421900000001,-403.31192900000002,-546.01673100000005,-697.63724999999999,-562.65698600000007,-1052.4229879999998,-872.86187399999994,-452.79265899999996,-384.57999899999999,-256.57863700000001,-231.78292800000003,-211.57028500000001,-305.59618699999999,-348.25588500000003,-581.10931200000005,-858.01401699999997,-633.18831499999999,-524.05132400000002,-508.09411,-434.99119899999999,-325.47192799999999,-239.80621400000001,-218.068423,-215.90781899999999,-408.39204999999998,-518.48742099999993,-445.117231,-479.60648900000001,-543.86398299999996,-478.82839000000001,-406.19568500000003,-422.73500000000001,-154.35719500000002,-167.860691,-301.47133700000001,-245.09551099999999,-374.45159699999999,-436.89324499999998,-508.73505599999999,-897.23722699999996,-716.42767700000002,-590.25587100000007,-584.07853499999999,-474.71409,-210.517944,-141.61362500000001,-157.40858300000002,-122.319526,-229.38049699999999,-352.86669000000001,-342.59280999999999,-433.831684,-458.08479999999997,"-","-","-","-","-","-","-","-","-","-"]
[null,"Saldo intercambios internacionales",94.564999999999998,-235.49199999999999,-243.36199999999999,-261.05399999999997,-494.78800000000001,-223.46299999999999,-289.77800000000002,-314.01400000000001,-846.57600000000002,-1153.7719999999999,-1052.93,-729.80100000000004,-456.80399999999997,-655.58699999999999,-1199.348,-1291.615,-761.27499999999998,-1052.3420000000001,-907.81299999999999,-796.07299999999998,-935.81,-1102.0160000000001,-948.447,-932.45600000000002,-897.62800000000004,-474.27699999999999,-192.952,-548.93399999999997,-437.37599999999998,-769.16099999999994,-944.90899999999999,-817.41700000000003,-711.16800000000001,-941.36500000000001,-897.21199999999999,-454.01499999999999,-304.71344599999998,-506.196753,-560.11404599999992,-729.095102,-542.81502899999998,-821.22575100000006,-1000.6535670000001,-758.60105700000008,-964.2554520000001,-1295.5098870000002,-593.21057400000007,-256.28839399999998,-611.33580500000005,-358.84235899999999,-762.63600899999994,-1074.8113170000001,-233.62379999999999,-404.76718699999998,-470.93457000000001,-197.10088099999999,-548.75685799999997,-381.58426100000003,-579.51663300000007,-466.21665400000001,-525.29093599999999,-1375.7932209999999,-869.96906999999999,-1211.9197819999999,-939.84038100000009,-625.32935199999997,-629.52545599999996,-646.20974899999999,-1047.302604,-1457.208903,-791.40693099999999,-1080.1572060000001,-364.45221100000003,-642.39397799999995,-430.41725799999995,-411.18220100000002,-132.05559299999999,-358.69515000000001,-1060.4316310000002,-517.67452200000002,-821.87308799999994,-679.119191,-892.91131900000005,-420.92630800000001,28.099829000000003,-490.54062400000004,-225.94670300000001,-652.23227599999996,-256.41148300000003,-285.58111300000002,-481.72024800000003,-236.69277,-336.25484,-303.54976099999999,195.372657,-360.667597,-259.102957,-558.85504600000002,-396.75677899999999,-295.55073599999997,180.77279000000001,0.88915499999999992,-184.17543000000001,-251.793361,-169.941732,436.52791200000001,453.10844900000001,911.71451000000002,847.59026500000004,960.46906000000001,174.95739399999999,-106.684112,762.50236499999994,1083.2692120000002,917.73114199999998,1034.6561139999999,1130.5906419999999,-433.77785799999998,357.21121500000004,938.722174,-531.54929799999991,528.49059999999997,"-","-","-","-","-","-","-","-","-","-"]
[null,"Demanda transporte (b.c.)",25442.277000000002,22323.162999999997,23824.588999999996,21448.601999999999,22120.496999999999,22386.445000000003,24313.416000000005,22580.558000000005,22243.367000000002,22532.553,23763.607,25046.465,25750.255999999998,23780.976000000002,23592.307999999997,22723.324000000004,22227.083999999995,22385.620999999996,24709.899000000005,23237.363000000001,22463.243999999999,22426.423000000003,23276.561999999998,24498.831000000002,25095.149999999994,22061.085999999999,22174.382999999998,20407.344000000005,20861.950000000004,21844.976999999995,23929.491999999998,22652.987999999998,21727.947541999998,21616.949999999997,21821.242512000001,23983.874999999996,25031.669973999997,23071.357833999995,24073.421675999998,21090.740288999998,21614.262553999997,21669.881063999994,24570.985341000003,22905.264234000002,22027.296922999998,21746.919329999997,23189.160129999993,24701.886022999999,24925.484771000007,22546.476039999994,23962.721700999999,20375.719818999994,21551.366143999996,22006.174307999998,23396.063450999998,23044.432068000006,22373.039237999998,21604.291614000002,21756.136976999998,23086.919535999998,24345.836757000001,24198.535476000005,22541.582071000001,20601.497302999996,21393.831236000005,22048.066978000003,23089.748460000003,22958.567632999999,21105.705873999996,20966.793495999998,21394.427868000002,22514.209125000001,23766.940459999998,21666.060203999994,22388.692958,20623.905194000003,20626.799877000001,20341.947989,23045.312524000004,22049.872446999998,20978.160511000002,21026.352085999999,21620.580825000001,22942.642167000002,23239.869497999996,21448.743450999998,22077.561427000001,19862.902007000001,20647.667989999998,20832.234660000006,22492.725805999999,21589.200368999995,21618.796434999997,20940.196493000003,20882.631250000002,22498.831408000002,23913.529047000004,22140.537251000002,22370.113776999999,19954.508634999998,21020.279007999994,21620.102728999995,24974.285053000003,22344.354426999998,20899.483822999999,20970.395166000002,20999.891417000003,22075.542530000002,22639.879937999998,21971.597495999999,22700.958500999997,21064.385994,20938.203213999997,21505.302804999999,23678.021709000001,22919.370287000005,22185.658755999997,21094.087903,21752.270851000001,22502.387337999997,24283.632925999998,20989.189040000001,"-","-","-","-","-","-","-","-","-","-"]
[]
[null,"Balance eléctrico anual peninsular (GWh)",1990,1991,1992,1993,1994,1995,1996,1997,1998,1999,2000,2001,2002,2003,2004,2005,2006,2007,2008,2009,2010,2011,2012,2013,2014,2015,2016,2017,2018,2019,2020,2021]
[null,"Hidráulica",24268.250999999997,25730.847000000002,18510.361000000001,22835.780999999995,25950.437999999995,21696.296000000002,37390.589999999989,32913.885000000002,33666.962999999996,23863.848000000002,27492.65500000001,38996.462000000014,22195.55,38283.057000000001,29343.754000000008,18880.476999999992,24970.245999999992,26081.578999999998,20957.390000000003,23388.235000000001,38129.901991999999,27225.906139999999,19179.774074000001,33577.181747999995,35458.874534000002,31217.790073,39165.285628000005,4501.4136710000002,"-","-","-","-"]
[null,"Nuclear",51905.668000000005,53162.400000000009,53360.06,53665.29,52995.802999999993,53138.097999999998,54112.745999999999,53048.341999999997,56572.047000000013,56378.196999999993,59530.32,60985.213000000003,60288.447,59219.589999999989,60875.742000000006,54901.832999999999,57353.705999999998,52638.926999999996,56460.290999999997,50549.445000000007,59242.321647000004,55103.931311,58666.987000000008,54306.887000000002,54870.239000000009,54754.839048000002,56098.972000000002,10040.949000000001,"-","-","-","-"]
[null,"Carbón",55338.808000000005,55804.307000000001,59825.894999999997,57851.097999999998,57174.709000000003,61234.712,49468.669000000002,58519.805999999997,56925.974999999999,68405.633000000002,72228.170999999988,64448.903999999995,74555.690999999992,68293.165999999997,72120.106,72994.088999999993,62126.065000000002,67686.248000000007,43409.537000000004,31622.562000000002,20599.255834,40501.827407000004,51130.886036999989,37176.883000000002,41132.677000000003,50923.77236699999,35170.287000000004,8508.4290000000001,"-","-","-","-"]
[null,"Fuel + Gas",2865.9459999999999,4041.6849999999999,7463.5830000000014,1777.1469999999999,1412.1849999999999,3661.1629999999996,2043.33,6552.5410000000002,5338.8809999999994,9350.6630000000005,9565.2989999999991,11579.619000000001,15545.682000000004,7431.6419999999998,7089.4679999999998,9294.3179999999993,5396.0580000000009,2090.7650000000003,2074.895,1789.5900000000001,1566.0229999999999,0,0,0,0,0,0,0,"-","-","-","-"]
[null,"Ciclo combinado",0,0,0,0.21299999999999999,0,0,0,0,0,0,0,0,5155.6730000000007,14626.086000000003,28312.845000000001,47846.789000000004,62122.434000000001,66572.867999999988,89100.732000000004,76379.284,62954.940244999991,49411.657004999994,37531.666771000004,24360.581872000002,21336.753903000001,25268.468001999998,25684.360787999998,4345.8277689999995,"-","-","-","-"]
[null,"Régimen ordinario",134378.67300000001,138739.239,139159.899,136129.52899999998,137533.13499999998,139730.269,143015.33499999996,151034.57399999999,152503.86600000001,157998.34100000001,168816.44500000001,176010.19800000003,177741.04300000001,187853.541,197741.91500000001,203917.50599999999,211968.50899999999,215070.38700000002,212002.845,183729.11600000001,182492.44271799998,172243.32186299999,166509.31388199999,149421.53362,"-","-","-","-","-","-","-","-"]
[null,"Hidráulica/Resto hidráulica",982.63199996000014,1704.7810000000002,2081.7730000000001,2234.2280000000001,2475.268,2222.8739999999998,3543.8470000000002,3428.9950000000003,3578.4739169999993,3740.3226119999995,3836.0999330000004,4287.5226330000005,3899.4523389999999,5088.644045,4749.5783850000016,3817.5829390000013,4148.5638790000012,4125.3249999999998,4638.143,5453.6730000000007,6824.32,5294.3149999999996,4644.5460000000003,7099.1549999999997,7069.52,"-","-","-","-","-","-","-"]
[null,"Eólica",2.18699998,2.8650000000000002,17.361000000000001,84.768000000000001,72.859999999999985,159.85699999999997,304.12899999999996,619.88499999999999,1236.6567059999998,2474.0332980000003,4462.4960500000007,6594.1481130000002,9259.2966869999982,11720.246133000002,15754.117769000002,20857.665958999998,22880.856075000003,27249.154999999999,31757.850000000006,37888.576999999997,43208.396000000001,42105.433000000005,48140.064999999995,54344.351999999992,50634.89,47713.149999999994,47290.344000000005,9671.7211299999999,"-","-","-","-"]
[null,"Solar fotovoltaica",0,0,12.055999999999999,12.000000000000002,16.362999999999996,20.207000000000001,20.762999999999998,20.818000000000001,21.686618999999997,21.649230999999997,22.521875000000001,23.172788999999998,4.5614520000000001,8.9301049999999957,17.794010999999976,40.088349000000001,102.37499899999992,462.577,2406.0700000000002,5829.0049999999992,6139.7820000000002,7091.688000000001,7829.9009999999998,7918.0379999999996,7802.4239999999991,7844.7979999999998,7554.0400000000009,897.77479999999991,"-","-","-","-"]
[null,"Solar térmica",0,0,0,0,0,0,0,0,0,0,0,0,0,0,0,0,0,7.6269999999999998,15.378,129.82299999999998,691.62,1832.357,3444.1340000000005,4441.527000000001,4958.9149999999991,5085.2350000000006,5071.6869999999999,271.72089999999997,"-","-","-","-"]
[null,"Térmica renovable/Otras renovables",0,0.85399999999999987,16.548999999999999,58.82200000000001,322.45,671.26900000000001,815.08,648.375,748.74632699999995,908.25367599999993,961.11038600000018,1738.4584279999999,1453.0152859999998,1737.0417380000004,1818.0936319999998,1987.8580699999998,2182.6066820000001,2375.6849999999999,2651.4889999999996,3044.2870000000003,3171.7989999999995,4284.8410000000003,4746.1490000000003,5065.5659999999998,4717.9780000000001,3173.951,3416.5189999999993,625.44010000000003,"-","-","-","-"]
[null,"Térmica no renovable/Cogeneración y resto/Cogeneración",654.85700006000002,1435.9839999999997,1902.8819999999998,3307.5039999999999,5310.924,6521.6080000000002,8971.9479999999985,11442.924999999999,14147.764431,17116.964183,17358.302755999997,17635.155036999997,20831.652236000002,22845.346978999998,23528.704202999998,23263.703683,22318.939364999995,23327.756999999998,26575.975999999999,28465.934000000001,30789.052000000003,32051.011999999995,33492.864000000001,32036.724999999999,25595.536,25417.974999999999,25755.341,4570.5199700000003,"-","-","-","-"]
[null,"Residuos","-","-","-","-","-","-","-","-","-","-","-","-","-","-","-","-","-","-","-","-","-","-","-","-","-",2987.3709999999996,3118.9609999999998,530.56320000000005,"-","-","-","-"]
[null,"Régimen especial",1639.6760000000002,3144.4839999999999,4030.6210000000001,5697.3220000000001,8197.8649999999998,9595.8149999999987,13655.767,16160.998,19733.327999999998,24261.223000000002,26640.530999999999,30278.456999999995,35447.978000000003,41400.209000000003,45868.288,49966.898999999998,51633.341,57548.125999999997,68044.906000000003,80811.298999999999,90824.969000000012,92659.646000000008,102297.659,110905.36299999998,"-","-","-","-","-","-","-","-"]
[null,"Generación",136018.34900000002,141883.723,143190.52000000002,141826.85099999997,145730.99999999997,149326.084,156671.10199999996,167195.57199999999,172237.19400000002,182259.56400000001,195456.976,206288.65500000003,213189.02100000001,229253.75,243610.20300000001,253884.405,263601.84999999998,272618.51300000004,280047.75099999999,264540.41500000004,273317.41171799996,264902.967863,268806.97288199997,260326.89661999998,253577.80743699998,254387.34949000005,248325.79741600004,43964.359539999998,"-","-","-","-"]
[null,"Consumos en bombeo",-1039.2719999999997,-1432.7330000000002,-2790.7050000000004,-1887.5589999999997,-1345.3890000000001,-2081.7260000000001,-1522.6180000000002,-1760.8889999999997,-2587.7539999999999,-3666.38,-4906.8859999999995,-4131.264000000001,-6956.6819999999998,-4678.134,-4604.7070000000003,-6356.9470000000001,-5348.3729999999996,-4432.2870000000003,-3802.502,-3794.1889999999999,-4457.7825769999999,-3214.9598150000002,-5022.5477879999999,-5957.8449899999996,-5329.5900510000001,-4520.0941789999997,-4819.4130750000004,-891.91648399999997,"-","-","-","-"]
[null,"Enlace Península-Baleares","-","-","-","-","-","-","-","-","-","-","-","-","-","-","-","-","-","-","-","-","-",-0.47640899999999997,-570.24920300000008,-1268.5085999999999,-1298.2644039999998,-1335.7828019999999,-1250.5825009999999,-161.209003,"-","-","-","-"]
[null,"Saldo intercambios internacionales",-419.57900000000012,-676.58600000000001,641.12400000000002,1267.0719999999997,1855.105,4489.0450000000001,1059.3659999999998,-3072.8720000000003,3401.864,5719.244999999999,4440.5950000000003,3457.9599999999996,5328.768,1263.9020000000003,-3027.0179999999996,-1343.394,-3272.518,-5750.4650000000001,-11039.585999999999,-8086.4139999999998,-8332.6790579999997,-6090.1263339999996,-11199.953591,-6732.1324500000001,-3406.1249290000001,-133.16322499999978,7667.2376129999993,-3.0586979999999357,"-","-","-","-"]
[null,"Demanda transporte (b.c.)",134559.49800000002,139774.40399999998,141040.93900000004,141206.36399999994,146240.71599999999,151733.40300000002,156207.84999999998,162361.81099999999,173051.30400000003,184312.429,194990.685,205615.35100000002,211561.10700000002,225839.51800000001,235978.478,246184.06399999998,254980.95899999997,262435.761,265205.663,252659.81200000003,260526.95008299997,255597.40530499999,252014.22229999996,246368.41057999997,243543.82805299998,248398.30928400005,249923.03945300006,42908.175354999992,"-","-","-","-"]
[]
[null,"Balance eléctrico anual Islas Baleares (MWh)",2006,2007,2008,2009,2010,2011,2012,2013,2014,2015,2016,2017,2018,2019,2020,2021]
[null,"Carbón",3077310,2943855,3098826,3170463,3101357.5659999996,2764866.8510000007,2682531.568,2350680.7719999999,2187625.804,1865268.2970000003,2303768.3020000001,414283.31900000002,"-","-","-","-"]
[null,"Motores diesel",964902,1005606,1047081,971825,1027620.046,923775.61600000004,934769.9530000001,743951.84400000004,671248.32699999993,729765.87399999995,963404.99399999995,156403.44500000001,"-","-","-","-"]
[null,"Turbina de gas",292054.95199999999,311441,272502,339369,299414.36599999998,350925.136,340944.54099999997,509306.95299999998,581727.70699999994,582137.98199999996,338288.00099999999,21837.701999999997,"-","-","-","-"]
[null,"Fuel + Gas",1256956.952,1317047,1319583,1311194,1327034.412,1274700.7520000001,1275714.4939999999,1253258.797,1252976.034,1311903.8559999999,1301692.9950000001,178241.147,"-","-","-","-"]
[null,"Ciclo combinado",1341915,1583995,1523490,1292183,1135633.7220000001,1326738.3859999999,890560.32,413575.82400000002,426924.70399999997,809239.36800000013,542552.36600000004,72224.51999999999,"-","-","-","-"]
[null,"Generación auxiliar",6350.2199999999721,12612,5931,5566,6694.3319999999994,8724.6810000000005,8809.7250000000004,6900.8020000000006,7695.201,10581.855,10091.754999999999,0,"-","-","-","-"]
[null,"Régimen ordinario",5682532.1719999993,5857509,5947830,5779406,5570720.0320000006,5375030.6700000009,4857616.1069999998,4024416.1950000003,"-","-","-","-","-","-","-","-"]
[null,"Eólica",4877.3560000000007,5656,5497,5543,5571,5829,6505,6160,5839,5317.02,5414,780.3,"-","-","-","-"]
[null,"Solar fotovoltaica",1100.7949999999998,1952,28380,80933,87757,101221,115594,122098,122773,122645.48,120420,12926.4,"-","-","-","-"]
[null,"Térmica renovable/Otras renovables",0,0,0,0,0,0,569,743,1944,1972.55,1309.92,311.48,"-","-","-","-"]
[null,"Térmica no renovable/Cogeneración y resto/Cogeneración",139112.84899999999,113933,140332,127042,176244,260748,272076,251615,281390,31519.32,34653.64,6042.12,"-","-","-","-"]
[null,"Residuos","-","-","-","-","-","-","-","-","-",302196,261611,29840,"-","-","-","-"]
[null,"Régimen especial",145091,121541,174209,213518,269572,367798,394744,380616,"-","-","-","-","-","-","-","-"]
[null,"Generación",5827623.1719999993,5979050,6122039,5992924,5840292.0320000006,5742828.6700000009,5252360.1069999998,4405032.1950000003,4287167.7429999998,4460643.7459999993,4581513.9779999992,714649.28600000008,"-","-","-","-"]
[null,"Enlace Península-Baleares","-","-","-","-","-",476.40899999999993,570249.2030000001,1268508.5999999999,1298257.4659999998,1335791.8019999999,1250582.5009999999,161209.003,"-","-","-","-"]
[null,"Demanda transporte (b.c.)",5827623.1719999993,5979050,6122039,5992924,5840292.0320000006,5743305.0790000008,5822609.3099999996,5673540.7949999999,5585425.2089999998,5796435.5479999995,5832096.4789999994,875858.28900000011,"-","-","-","-"]
[]
[null,"Balance eléctrico anual Islas Canarias (MWh)",2006,2007,2008,2009,2010,2011,2012,2013,2014,2015,2016,2017,2018,2019,2020,2021]
[null,"Hidráulica",0,0,0,0,0,0,0,0,0,3585.2,3472,264,"-","-","-","-"]
[null,"Motores diesel",2007664,2042002,2103766,2140699,2183387.7719999999,2163376.0950000002,2110130.929,2078558.186,2145111.9040000001,2207692.36,2227665.5260000001,359326.76300000004,"-","-","-","-"]
[null,"Turbina de gas",824431.12,699470,473526,342172.054,343281.65700000001,529046.147,590582.6939999999,366528.71100000001,363766.8459999999,330903.78599999991,279139.54399999999,50860.013000000006,"-","-","-","-"]
[null,"Turbina de  vapor",3429991,3306805,3414241,3243628,2972587.1049999995,2637819.2430000002,2685938.8030000003,2465049.5530000003,2074036.0720000002,2225313.5290000001,2536663.6469999999,408488.14299999998,"-","-","-","-"]
[null,"Fuel + Gas",6262086.1200000001,6048277,5991533,5726499.0539999995,5499256.534,5330241.4850000003,5386652.426,4910136.45,4582914.8220000006,4763910.6749999998,5043468.7169999992,818674.91899999999,"-","-","-","-"]
[null,"Ciclo combinado",2007397,2443275,2573317,2552328,2708410.1850000001,2918875.2369999997,2877771.574,3052680.0279999999,3311448.9440000001,3213042.0700000003,3031699.5109999995,520026.84500000003,"-","-","-","-"]
[null,"Generación auxiliar",0,132840,89747,33788,0,0,0,0,0,0,0,0,"-","-","-","-"]
[null,"Régimen ordinario",8269483.1200000001,8624392,8654597,8312615.0540000005,8207666.7189999996,8249116.7220000001,8264423.9999999991,7962816.4780000001,"-","-","-","-","-","-","-","-"]
[null,"Hidroeólica","-","-","-","-","-","-","-","-",1071.8609999999999,8557.1660000000011,18102.738999999998,2489.3929999999996,"-","-","-","-"]
[null,"Hidráulica/Resto hidráulica",0,1176,1673,398,0,1675.4079999999999,1789.3360000000005,3047.306,3479.0210000000002,"-","-","-","-","-","-","-"]
[null,"Eólica",326063.57899999997,356840,396475,358707,331363,354155,361767.78899999999,362734.29800000001,389964,396661.05200000003,394560,39526.879000000001,"-","-","-","-"]
[null,"Solar fotovoltaica",2915.5499999999997,19373,63500,162330,195166,232139,256511,286702,282291,275554.16099999996,277275,36492.307000000001,"-","-","-","-"]
[null,"Térmica renovable/Otras renovables",218199.68400000001,213283,217219,273055,160561,33148.362999999998,8050.4539999999997,8387.0730000000003,8806.7219999999998,8053.2160000000003,9335,811,"-","-","-","-"]
[null,"Térmica no renovable/Cogeneración y resto/Cogeneración",2832.1869999999999,0,0,20,0,0,0,0,0,0,0,0,"-","-","-","-"]
[null,"Régimen especial",550011,590672,678867,794510,687090,621117.77099999995,628118.57900000003,660870.67699999991,"-","-","-","-","-","-","-","-"]
[null,"Generación",8819494.120000001,9215064,9333464,9107125.0540000014,8894756.7190000005,8870234.4930000007,8892542.5789999999,8623687.1550000012,8579976.370000001,8669362.4399999995,8777912.8670000006,1418285.243,"-","-","-","-"]
[null,"Demanda transporte (b.c.)",8819494.120000001,9215064,9333464,9107125.0540000014,8894756.7190000005,8870234.4930000007,8892542.5789999999,8623687.1550000012,8579976.370000001,8669362.4399999995,8777912.8670000006,1418285.243,"-","-","-","-"]
[]
[null,"Balance eléctrico anual Ceuta (MWh)",2007,2008,2009,2010,2011,2012,2013,2014,2015,2016,2017,2018,2019,2020]
[null,"Motores diesel",202644,209671,208316,214666.24400000001,202671.921,211523.35500000001,201711.97,212164.56700000004,204715.61900000001,210611.989,35112.434000000001,"-","-","-"]
[null,"Turbina de gas",0,0,3253,2868.8669999999997,300.97500000000002,548.54099999999994,248.09399999999997,89.154999999999973,723.98099999999999,116.15799999999999,3.2359999999999998,"-","-","-"]
[null,"Fuel + Gas",202644,209671,211569,217535.111,202972.89600000001,212071.89600000001,201960.06400000001,212253.72200000004,205439.6,210728.147,35115.67,"-","-","-"]
[null,"Régimen ordinario",202644,209671,211569,217535.111,202972.89600000001,212071.89600000001,201960.06400000001,212253.72200000004,"-","-","-","-","-","-"]
[null,"Generación",202644,209671,211569,217535.111,202972.89600000001,212071.89600000001,201960.06400000001,212253.72200000004,205439.6,210728.147,35115.67,"-","-","-"]
[null,"Demanda transporte (b.c.)",202644,209671,211569,217535.111,202972.89600000001,212071.89600000001,201960.06400000001,212253.72200000004,205439.6,210728.147,35115.67,"-","-","-"]
[]
[null,"Balance eléctrico anual Melilla (MWh)",2007,2008,2009,2010,2011,2012,2013,2014,2015,2016,2017,2018,2019,2020]
[null,"Motores diesel",181867.74,193125,197553,204717.97099999996,207296.853,214850.84300000002,201463.861,200163.61000000002,204228.133,198326.31299999997,33747.351999999999,"-","-","-"]
[null,"Turbina de gas",2412.2599999999998,3081,545,498.45600000000002,503.041,112.349,84.787000000000006,724.20299999999997,587.85799999999995,241.53300000000002,3.05,"-","-","-"]
[null,"Fuel + gas",184280,196206,198098,205216.42699999997,207799.894,214963.19200000001,201548.64800000002,200887.81300000002,204815.99100000004,198567.84600000002,33750.402000000002,"-","-","-"]
[null,"Régimen ordinario",184280,196206,198098,205216.42699999997,207799.894,214963.19200000001,201548.64800000002,"-","-","-","-","-","-","-"]
[null,"Solar fotovoltaica",0,6,122,67,72,84,81,85,78,81,5,"-","-","-"]
[null,"Térmica no renovable/Cogeneración y resto/Cogeneración",8740,4842,7735,8028,7036,2309,8039,8898,"-","-","-","-","-","-"]
[null,"Residuos","-","-","-","-","-","-","-","-",8591,9699,1632.0070000000001,"-","-","-"]
[null,"Régimen especial",8740,4848,7857,8095,7108,2393,8120,"-","-","-","-","-","-","-"]
[null,"Generación",193020,201054,205955,213311.42699999997,214907.894,217356.19200000001,209668.64800000002,209870.81300000002,213484.99100000004,208347.84600000002,35387.409,"-","-","-"]
[null,"Demanda transporte (b.c.)",193020,201054,205955,213311.42699999997,214907.894,217356.19200000001,209668.64800000002,209870.81300000002,213484.99100000004,208347.84600000002,35387.409,"-","-","-"]
[]
[null,"Balance eléctrico anual nacional (GWh)",2007,2008,2009,2010,2011,2012,2013,2014,2015,2016,2017,2018,2019,2020]
[null,"Hidráulica",26081.578999999998,20957.390000000003,23388.235000000001,38129.901991999999,27225.906139999999,19179.774074000001,33577.181747999995,35458.874534000002,31221.375273000001,39168.757628000007,4501.6776710000004,"-","-","-"]
[null,"Nuclear",52638.926999999996,56460.290999999997,50549.445000000007,59242.321647000004,55103.931311,58666.987000000008,54306.887000000002,54870.239000000009,54754.839048000002,56098.972000000002,10040.949000000001,"-","-","-"]
[null,"Carbón",70630.103000000003,46508.363000000005,34793.025000000001,23700.613399999998,43266.694258000003,53813.417604999988,39527.563772000001,43320.302804000006,52789.040663999993,37474.055302000001,8922.7123190000002,"-","-","-"]
[null,"Fuel + Gas",9988.4650000000001,9887.5660000000007,9276.3040540000002,8821.7598159999998,7024.4397080000008,7098.2117329999992,6573.8047610000012,6256.7275920000002,6496.6519769999995,6764.5494599999993,1065.782138,"-","-","-"]
[null,"Ciclo combinado",70600.137999999992,93197.539000000004,80223.794999999998,66798.98415199999,53657.270627999991,41299.998665000006,27826.837724000001,25075.127551000001,29290.74944,29258.612664999997,4938.0791339999996,"-","-","-"]
[null,"Régimen ordinario",229939.212,227011.14899999998,198230.80405400001,196693.581007,186278.24204499999,180058.38907700003,161812.275005,"-","-","-","-","-","-","-"]
[null,"Hidroeólica","-","-","-","-","-","-","-",1.071861,8.5571660000000005,18.102738999999996,2.4893929999999997,"-","-","-"]
[null,"Hidráulica/Resto hidráulica",4126.5010000000002,4639.8159999999998,5454.0710000000008,6824.32,5295.9904079999997,4646.3353360000001,7102.2023060000001,7072.9990210000005,"-","-","-","-","-","-"]
[null,"Eólica",27611.650999999998,32159.822000000007,38252.826999999997,43545.33,42465.417000000001,48508.337788999997,54713.246297999991,51030.692999999999,48115.128071999992,47690.318000000007,9712.0283089999994,"-","-","-"]
[null,"Solar fotovoltaica",483.90199999999999,2497.9560000000001,6072.3899999999994,6422.7719999999999,7425.1200000000008,8202.09,8326.9189999999999,8207.5729999999985,8243.0756409999995,7951.8160000000007,947.19850699999995,"-","-","-"]
[null,"Solar térmica",7.6269999999999998,15.378,129.82299999999998,691.62,1832.357,3444.1340000000005,4441.527000000001,4958.9149999999991,5085.2350000000006,5071.6869999999999,271.72089999999997,"-","-","-"]
[null,"Térmica renovable/Otras renovables",2588.9679999999998,2868.7079999999996,3317.3420000000001,3332.3599999999997,4317.9893630000006,4754.768454,5074.6960730000001,4728.7287219999998,3183.9767660000002,3427.1639199999995,626.56258000000003,"-","-","-"]
[null,"Térmica no renovable/Cogeneración y resto/Cogeneración",23450.429999999997,26721.149999999998,28600.731,30973.324000000004,32318.795999999995,33767.249000000003,32296.378999999997,25885.824000000001,25449.494319999998,25789.994640000001,4576.5620900000004,"-","-","-"]
[null,"Residuos","-","-","-","-","-","-","-","-",3298.1579999999994,3390.2709999999997,562.03520700000001,"-","-","-"]
[null,"Régimen especial",58269.078999999998,68902.83,81827.183999999994,91789.72600000001,93655.669770999986,103322.914579,111954.96967699999,"-","-","-","-","-","-","-"]
[null,"Generación",288208.29099999997,295913.97899999999,280057.98805400002,288483.30700700002,279933.91181600001,283381.30365600006,273767.24468200002,266867.07608500007,267936.28136700002,262104.30035399998,46167.797248000003,"-","-","-"]
[null,"Consumos en bombeo",-4432.2870000000003,-3802.502,-3794.1889999999999,-4457.7825769999999,-3214.9598150000002,-5022.5477879999999,-5957.8449899999996,-5329.5900510000001,-4520.0941789999997,-4819.4130750000004,-891.91648399999997,"-","-","-"]
[null,"Saldo intercambios internacionales",-5750.4650000000001,-11039.585999999999,-8086.4139999999998,-8332.6790579999997,-6090.1263339999996,-11199.953591,-6732.1324500000001,-3406.1249290000001,-133.16322499999978,7667.2376129999993,-3.0586979999999357,"-","-","-"]
[null,"Demanda transporte (b.c.)",278025.53899999993,281071.891,268177.38505400001,275692.84537200007,270628.82566700003,267158.80227700004,261077.267242,258131.36110500005,263283.02396299999,264952.12489199999,45272.822066000001,"-","-","-"]

{"sheet":"Año","index":14,"n_rows":29,"n_cols":26,"rows_kept":29,"cut":false,"hidden":true,"merged":[]}
[null,null,null,null,null,null,null,null,null,null,null,null,null,null,null,null,null,null,null,null,null,null,null,null,1,1]
["Mensual","1990-1991",1990,"1990-1997","2006-2013","2007-2013",null,null,null,null,null,null,null,null,"Nacional","Mensual"]
["Trimestral","1992-1993",1991,"1998-2005","2014-2021","2014-2020",null,null,null,null,null,null,null,null,"Peninsular","Anual"]
["Anual","1994-1995",1992,"2006-2013",null,null,null,null,null,null,null,null,null,null,"Canarias"]
[null,"1996-1997",1993,"2014-2021",null,null,null,null,null,null,null,null,null,null,"Baleares"]
[null,"1998-1999",1994,null,null,null,null,null,null,null,null,null,null,null,"Ceuta"]
[null,"2000-2001",1995,null,null,null,null,null,null,null,null,null,null,null,"Melilla"]
[null,"2002-2003",1996]
[null,"2004-2005",1997]
[null,"2006-2007",1998]
[null,"2008-2009",1999]
[null,"2010-2011",2000]
[null,"2012-2013",2001]
[null,"2014-2015",2002]
[null,"2016-2017",2003]
[null,null,2004]
[null,null,2005]
[null,null,2006]
[null,null,2007]
[null,null,2008]
[null,null,2009]
[null,null,2010]
[null,null,2011]
[null,null,2012]
[null,null,2013]
[null,null,2014]
[null,null,2015]
[null,null,2016]
[null,null,2017]