{"text_format":"1","workbook":"xlsx","n_sheets":13,"sheets":["AVISO LEGAL","Indisp.Peninsular P mes","Indisp.Peninsular P año","Indisp.Peninsular Pr mes","Indisp.Peninsular Pr año","Indisp.Peninsular NP mes","Indisp.Peninsular NP año","Disponibilidad Peninsular mes","Disponibilidad Peninsular año","Horas funcionamiento mes","Horas funcionamiento año","Datos","Año"],"not_rendered":{"charts":0,"images":1,"macros":1,"external_links":0,"defined_names":11,"comments":0,"pivot_tables":0},"unopened":[],"bounds":{"document_bytes":16777216,"sheet_cells":100000,"rows_first":2000,"rows_last":500,"rows_between":2000,"halvings":0,"cell_chars":16384,"cell_head_chars":4096},"cells_cut":0,"cells_raw":0,"read":"whole","date_system":"1900"}

{"sheet":"AVISO LEGAL","index":0,"n_rows":23,"n_cols":10,"rows_kept":23,"cut":false,"hidden":false,"merged":[]}
[]
[null,null,null,null,null,null,null,"Fecha de actualización:",null,"2017-03-10"]
[]
[]
[]
[]
[]
[]
[]
[]
[]
[]
[]
[]
[]
[]
[]
[]
[]
[]
[]
[]
[null,null,null,null,null,null,null,null,null,"www.ree.es"]

{"sheet":"Indisp.Peninsular P mes","index":1,"n_rows":16,"n_cols":15,"rows_kept":16,"cut":false,"hidden":false,"merged":[[15,1,15,13]]}
[null,null,null,null,null,null,null,null,null,null,null,null,null,null,1]
[null,null,null,null,null,null,null,null,null,null,null,null,null,null,17]
[]
[null,null,null,null,null,null,null,null,null,null,null,"Concepto"]
[null,null,null,null,null,null,null,null,null,null,null,"Horizonte temporal"]
[null,null,null,null,null,null,null,null,null,null,null,"Periodo"]
[]
[null,null,"Ene.","Feb.","Mar.","Abr.","May.","Jun.","Jul.","Ago.","Sep.","Oct.","Nov.","Dic.",{"$f":"OFFSET(Año!B13,($O$2-1),0)","v":2017}]
[]
[null,"Nuclear",{"$f":"OFFSET(Datos!C3,0,($O$2-1)*13)","v":6.0123498200084686},{"$f":"OFFSET(Datos!D3,0,($O$2-1)*13)","v":6.0123498200084935},{"$f":"OFFSET(Datos!E3,0,($O$2-1)*13)","v":"-"},{"$f":"OFFSET(Datos!F3,0,($O$2-1)*13)","v":"-"},{"$f":"OFFSET(Datos!G3,0,($O$2-1)*13)","v":"-"},{"$f":"OFFSET(Datos!H3,0,($O$2-1)*13)","v":"-"},{"$f":"OFFSET(Datos!I3,0,($O$2-1)*13)","v":"-"},{"$f":"OFFSET(Datos!J3,0,($O$2-1)*13)","v":"-"},{"$f":"OFFSET(Datos!K3,0,($O$2-1)*13)","v":"-"},{"$f":"OFFSET(Datos!L3,0,($O$2-1)*13)","v":"-"},{"$f":"OFFSET(Datos!M3,0,($O$2-1)*13)","v":"-"},{"$f":"OFFSET(Datos!N3,0,($O$2-1)*13)","v":"-"},{"$f":"OFFSET(Datos!O3,0,($O$2-1)*13)","v":6.0123498200084802}]
[null,"Carbón",{"$f":"OFFSET(Datos!C4,0,($O$2-1)*13)","v":0},{"$f":"OFFSET(Datos!D4,0,($O$2-1)*13)","v":0},{"$f":"OFFSET(Datos!E4,0,($O$2-1)*13)","v":"-"},{"$f":"OFFSET(Datos!F4,0,($O$2-1)*13)","v":"-"},{"$f":"OFFSET(Datos!G4,0,($O$2-1)*13)","v":"-"},{"$f":"OFFSET(Datos!H4,0,($O$2-1)*13)","v":"-"},{"$f":"OFFSET(Datos!I4,0,($O$2-1)*13)","v":"-"},{"$f":"OFFSET(Datos!J4,0,($O$2-1)*13)","v":"-"},{"$f":"OFFSET(Datos!K4,0,($O$2-1)*13)","v":"-"},{"$f":"OFFSET(Datos!L4,0,($O$2-1)*13)","v":"-"},{"$f":"OFFSET(Datos!M4,0,($O$2-1)*13)","v":"-"},{"$f":"OFFSET(Datos!N4,0,($O$2-1)*13)","v":"-"},{"$f":"OFFSET(Datos!O4,0,($O$2-1)*13)","v":0}]
[null,"Fuel + Gas",{"$f":"OFFSET(Datos!C5,0,($O$2-1)*13)","v":"-"},{"$f":"OFFSET(Datos!D5,0,($O$2-1)*13)","v":"-"},{"$f":"OFFSET(Datos!E5,0,($O$2-1)*13)","v":"-"},{"$f":"OFFSET(Datos!F5,0,($O$2-1)*13)","v":"-"},{"$f":"OFFSET(Datos!G5,0,($O$2-1)*13)","v":"-"},{"$f":"OFFSET(Datos!H5,0,($O$2-1)*13)","v":"-"},{"$f":"OFFSET(Datos!I5,0,($O$2-1)*13)","v":"-"},{"$f":"OFFSET(Datos!J5,0,($O$2-1)*13)","v":"-"},{"$f":"OFFSET(Datos!K5,0,($O$2-1)*13)","v":"-"},{"$f":"OFFSET(Datos!L5,0,($O$2-1)*13)","v":"-"},{"$f":"OFFSET(Datos!M5,0,($O$2-1)*13)","v":"-"},{"$f":"OFFSET(Datos!N5,0,($O$2-1)*13)","v":"-"},{"$f":"OFFSET(Datos!O5,0,($O$2-1)*13)","v":"-"}]
[null,"Ciclo combinado",{"$f":"OFFSET(Datos!C6,0,($O$2-1)*13)","v":0},{"$f":"OFFSET(Datos!D6,0,($O$2-1)*13)","v":0},{"$f":"OFFSET(Datos!E6,0,($O$2-1)*13)","v":"-"},{"$f":"OFFSET(Datos!F6,0,($O$2-1)*13)","v":"-"},{"$f":"OFFSET(Datos!G6,0,($O$2-1)*13)","v":"-"},{"$f":"OFFSET(Datos!H6,0,($O$2-1)*13)","v":"-"},{"$f":"OFFSET(Datos!I6,0,($O$2-1)*13)","v":"-"},{"$f":"OFFSET(Datos!J6,0,($O$2-1)*13)","v":"-"},{"$f":"OFFSET(Datos!K6,0,($O$2-1)*13)","v":"-"},{"$f":"OFFSET(Datos!L6,0,($O$2-1)*13)","v":"-"},{"$f":"OFFSET(Datos!M6,0,($O$2-1)*13)","v":"-"},{"$f":"OFFSET(Datos!N6,0,($O$2-1)*13)","v":"-"},{"$f":"OFFSET(Datos!O6,0,($O$2-1)*13)","v":0}]
[null,"Indisponibilidad permanente",{"$f":"OFFSET(Datos!C7,0,($O$2-1)*13)","v":1.0825762504232372},{"$f":"OFFSET(Datos!D7,0,($O$2-1)*13)","v":1.0825762504232415},{"$f":"OFFSET(Datos!E7,0,($O$2-1)*13)","v":"-"},{"$f":"OFFSET(Datos!F7,0,($O$2-1)*13)","v":"-"},{"$f":"OFFSET(Datos!G7,0,($O$2-1)*13)","v":"-"},{"$f":"OFFSET(Datos!H7,0,($O$2-1)*13)","v":"-"},{"$f":"OFFSET(Datos!I7,0,($O$2-1)*13)","v":"-"},{"$f":"OFFSET(Datos!J7,0,($O$2-1)*13)","v":"-"},{"$f":"OFFSET(Datos!K7,0,($O$2-1)*13)","v":"-"},{"$f":"OFFSET(Datos!L7,0,($O$2-1)*13)","v":"-"},{"$f":"OFFSET(Datos!M7,0,($O$2-1)*13)","v":"-"},{"$f":"OFFSET(Datos!N7,0,($O$2-1)*13)","v":"-"},{"$f":"OFFSET(Datos!O7,0,($O$2-1)*13)","v":1.0825762504232392}]
[]
[null,"Datos a último día de cada mes."]

{"sheet":"Indisp.Peninsular P año","index":2,"n_rows":16,"n_cols":10,"rows_kept":16,"cut":false,"hidden":false,"merged":[[15,1,15,9]]}
[null,null,null,null,null,null,null,null,null,1]
[null,null,null,null,null,null,null,null,null,3]
[]
[null,null,null,null,null,null,null,"Concepto"]
[null,null,null,null,null,null,null,"Horizonte temporal"]
[null,null,null,null,null,null,null,"Periodo"]
[]
[null,null,{"$f":"OFFSET(Datos!C37,0,($J$2-1)*8)","v":2017},{"$f":"OFFSET(Datos!D37,0,($J$2-1)*8)","v":2018},{"$f":"OFFSET(Datos!E37,0,($J$2-1)*8)","v":2019},{"$f":"OFFSET(Datos!F37,0,($J$2-1)*8)","v":2020},{"$f":"OFFSET(Datos!G37,0,($J$2-1)*8)","v":2021},{"$f":"OFFSET(Datos!H37,0,($J$2-1)*8)","v":2022},{"$f":"OFFSET(Datos!I37,0,($J$2-1)*8)","v":2023},{"$f":"OFFSET(Datos!J37,0,($J$2-1)*8)","v":2024}]
[]
[null,"Nuclear",{"$f":"OFFSET(Datos!C38,0,($J$2-1)*8)","v":6.0123498200084802},{"$f":"OFFSET(Datos!D38,0,($J$2-1)*8)","v":"-"},{"$f":"OFFSET(Datos!E38,0,($J$2-1)*8)","v":"-"},{"$f":"OFFSET(Datos!F38,0,($J$2-1)*8)","v":"-"},{"$f":"OFFSET(Datos!G38,0,($J$2-1)*8)","v":"-"},{"$f":"OFFSET(Datos!H38,0,($J$2-1)*8)","v":"-"},{"$f":"OFFSET(Datos!I38,0,($J$2-1)*8)","v":"-"},{"$f":"OFFSET(Datos!J38,0,($J$2-1)*8)","v":"-"}]
[null,"Carbón",{"$f":"OFFSET(Datos!C39,0,($J$2-1)*8)","v":0},{"$f":"OFFSET(Datos!D39,0,($J$2-1)*8)","v":"-"},{"$f":"OFFSET(Datos!E39,0,($J$2-1)*8)","v":"-"},{"$f":"OFFSET(Datos!F39,0,($J$2-1)*8)","v":"-"},{"$f":"OFFSET(Datos!G39,0,($J$2-1)*8)","v":"-"},{"$f":"OFFSET(Datos!H39,0,($J$2-1)*8)","v":"-"},{"$f":"OFFSET(Datos!I39,0,($J$2-1)*8)","v":"-"},{"$f":"OFFSET(Datos!J39,0,($J$2-1)*8)","v":"-"}]
[null,"Fuel + Gas",{"$f":"OFFSET(Datos!C40,0,($J$2-1)*8)","v":"-"},{"$f":"OFFSET(Datos!D40,0,($J$2-1)*8)","v":"-"},{"$f":"OFFSET(Datos!E40,0,($J$2-1)*8)","v":"-"},{"$f":"OFFSET(Datos!F40,0,($J$2-1)*8)","v":"-"},{"$f":"OFFSET(Datos!G40,0,($J$2-1)*8)","v":"-"},{"$f":"OFFSET(Datos!H40,0,($J$2-1)*8)","v":"-"},{"$f":"OFFSET(Datos!I40,0,($J$2-1)*8)","v":"-"},{"$f":"OFFSET(Datos!J40,0,($J$2-1)*8)","v":"-"}]
[null,"Ciclo combinado",{"$f":"OFFSET(Datos!C41,0,($J$2-1)*8)","v":0},{"$f":"OFFSET(Datos!D41,0,($J$2-1)*8)","v":"-"},{"$f":"OFFSET(Datos!E41,0,($J$2-1)*8)","v":"-"},{"$f":"OFFSET(Datos!F41,0,($J$2-1)*8)","v":"-"},{"$f":"OFFSET(Datos!G41,0,($J$2-1)*8)","v":"-"},{"$f":"OFFSET(Datos!H41,0,($J$2-1)*8)","v":"-"},{"$f":"OFFSET(Datos!I41,0,($J$2-1)*8)","v":"-"},{"$f":"OFFSET(Datos!J41,0,($J$2-1)*8)","v":"-"}]
[null,"Indisponibilidad permanente",{"$f":"OFFSET(Datos!C42,0,($J$2-1)*8)","v":1.0825762504232392},{"$f":"OFFSET(Datos!D42,0,($J$2-1)*8)","v":"-"},{"$f":"OFFSET(Datos!E42,0,($J$2-1)*8)","v":"-"},{"$f":"OFFSET(Datos!F42,0,($J$2-1)*8)","v":"-"},{"$f":"OFFSET(Datos!G42,0,($J$2-1)*8)","v":"-"},{"$f":"OFFSET(Datos!H42,0,($J$2-1)*8)","v":"-"},{"$f":"OFFSET(Datos!I42,0,($J$2-1)*8)","v":"-"},{"$f":"OFFSET(Datos!J42,0,($J$2-1)*8)","v":"-"}]
[]
[null,{"$f":"IF(MONTH(FACT)=1,\"Datos acumulados a 31 de diciembre.\",CONCATENATE(\"Datos acumulados a 31 de diciembre. Para el año \",YEAR(FACT), \" datos acumulados a \",TEXT(FACT-30,\"mmmm\"),\" de \",YEAR(FACT),\".\"))","v":"Datos acumulados a 31 de diciembre. Para el año 2017 datos acumulados a febrero de 2017."}]

{"sheet":"Indisp.Peninsular Pr mes","index":3,"n_rows":16,"n_cols":15,"rows_kept":16,"cut":false,"hidden":false,"merged":[[15,1,15,13]]}
[null,null,null,null,null,null,null,null,null,null,null,null,null,null,2]
[null,null,null,null,null,null,null,null,null,null,null,null,null,null,17]
[]
[null,null,null,null,null,null,null,null,null,null,null,"Concepto"]
[null,null,null,null,null,null,null,null,null,null,null,"Horizonte temporal"]
[null,null,null,null,null,null,null,null,null,null,null,"Periodo"]
[]
[null,null,"Ene.","Feb.","Mar.","Abr.","May.","Jun.","Jul.","Ago.","Sep.","Oct.","Nov.","Dic.",{"$f":"OFFSET(Año!B13,($O$2-1),0)","v":2017}]
[]
[null,"Nuclear",{"$f":"OFFSET(Datos!C10,0,($O$2-1)*13)","v":0},{"$f":"OFFSET(Datos!D10,0,($O$2-1)*13)","v":0},{"$f":"OFFSET(Datos!E10,0,($O$2-1)*13)","v":"-"},{"$f":"OFFSET(Datos!F10,0,($O$2-1)*13)","v":"-"},{"$f":"OFFSET(Datos!G10,0,($O$2-1)*13)","v":"-"},{"$f":"OFFSET(Datos!H10,0,($O$2-1)*13)","v":"-"},{"$f":"OFFSET(Datos!I10,0,($O$2-1)*13)","v":"-"},{"$f":"OFFSET(Datos!J10,0,($O$2-1)*13)","v":"-"},{"$f":"OFFSET(Datos!K10,0,($O$2-1)*13)","v":"-"},{"$f":"OFFSET(Datos!L10,0,($O$2-1)*13)","v":"-"},{"$f":"OFFSET(Datos!M10,0,($O$2-1)*13)","v":"-"},{"$f":"OFFSET(Datos!N10,0,($O$2-1)*13)","v":"-"},{"$f":"OFFSET(Datos!O10,0,($O$2-1)*13)","v":0}]
[null,"Carbón",{"$f":"OFFSET(Datos!C11,0,($O$2-1)*13)","v":5.8464513463376244},{"$f":"OFFSET(Datos!D11,0,($O$2-1)*13)","v":5.84645134633762},{"$f":"OFFSET(Datos!E11,0,($O$2-1)*13)","v":"-"},{"$f":"OFFSET(Datos!F11,0,($O$2-1)*13)","v":"-"},{"$f":"OFFSET(Datos!G11,0,($O$2-1)*13)","v":"-"},{"$f":"OFFSET(Datos!H11,0,($O$2-1)*13)","v":"-"},{"$f":"OFFSET(Datos!I11,0,($O$2-1)*13)","v":"-"},{"$f":"OFFSET(Datos!J11,0,($O$2-1)*13)","v":"-"},{"$f":"OFFSET(Datos!K11,0,($O$2-1)*13)","v":"-"},{"$f":"OFFSET(Datos!L11,0,($O$2-1)*13)","v":"-"},{"$f":"OFFSET(Datos!M11,0,($O$2-1)*13)","v":"-"},{"$f":"OFFSET(Datos!N11,0,($O$2-1)*13)","v":"-"},{"$f":"OFFSET(Datos!O11,0,($O$2-1)*13)","v":5.8464513463376218}]
[null,"Fuel + Gas",{"$f":"OFFSET(Datos!C12,0,($O$2-1)*13)","v":"-"},{"$f":"OFFSET(Datos!D12,0,($O$2-1)*13)","v":"-"},{"$f":"OFFSET(Datos!E12,0,($O$2-1)*13)","v":"-"},{"$f":"OFFSET(Datos!F12,0,($O$2-1)*13)","v":"-"},{"$f":"OFFSET(Datos!G12,0,($O$2-1)*13)","v":"-"},{"$f":"OFFSET(Datos!H12,0,($O$2-1)*13)","v":"-"},{"$f":"OFFSET(Datos!I12,0,($O$2-1)*13)","v":"-"},{"$f":"OFFSET(Datos!J12,0,($O$2-1)*13)","v":"-"},{"$f":"OFFSET(Datos!K12,0,($O$2-1)*13)","v":"-"},{"$f":"OFFSET(Datos!L12,0,($O$2-1)*13)","v":"-"},{"$f":"OFFSET(Datos!M12,0,($O$2-1)*13)","v":"-"},{"$f":"OFFSET(Datos!N12,0,($O$2-1)*13)","v":"-"},{"$f":"OFFSET(Datos!O12,0,($O$2-1)*13)","v":"-"}]
[null,"Ciclo combinado",{"$f":"OFFSET(Datos!C13,0,($O$2-1)*13)","v":4.6167017189425508},{"$f":"OFFSET(Datos!D13,0,($O$2-1)*13)","v":3.0701014241386799},{"$f":"OFFSET(Datos!E13,0,($O$2-1)*13)","v":"-"},{"$f":"OFFSET(Datos!F13,0,($O$2-1)*13)","v":"-"},{"$f":"OFFSET(Datos!G13,0,($O$2-1)*13)","v":"-"},{"$f":"OFFSET(Datos!H13,0,($O$2-1)*13)","v":"-"},{"$f":"OFFSET(Datos!I13,0,($O$2-1)*13)","v":"-"},{"$f":"OFFSET(Datos!J13,0,($O$2-1)*13)","v":"-"},{"$f":"OFFSET(Datos!K13,0,($O$2-1)*13)","v":"-"},{"$f":"OFFSET(Datos!L13,0,($O$2-1)*13)","v":"-"},{"$f":"OFFSET(Datos!M13,0,($O$2-1)*13)","v":"-"},{"$f":"OFFSET(Datos!N13,0,($O$2-1)*13)","v":"-"},{"$f":"OFFSET(Datos!O13,0,($O$2-1)*13)","v":3.8827219180186798}]
[null,"Indisponibilidad prevista",{"$f":"OFFSET(Datos!C14,0,($O$2-1)*13)","v":4.0642592105575215},{"$f":"OFFSET(Datos!D14,0,($O$2-1)*13)","v":3.1468160668971983},{"$f":"OFFSET(Datos!E14,0,($O$2-1)*13)","v":"-"},{"$f":"OFFSET(Datos!F14,0,($O$2-1)*13)","v":"-"},{"$f":"OFFSET(Datos!G14,0,($O$2-1)*13)","v":"-"},{"$f":"OFFSET(Datos!H14,0,($O$2-1)*13)","v":"-"},{"$f":"OFFSET(Datos!I14,0,($O$2-1)*13)","v":"-"},{"$f":"OFFSET(Datos!J14,0,($O$2-1)*13)","v":"-"},{"$f":"OFFSET(Datos!K14,0,($O$2-1)*13)","v":"-"},{"$f":"OFFSET(Datos!L14,0,($O$2-1)*13)","v":"-"},{"$f":"OFFSET(Datos!M14,0,($O$2-1)*13)","v":"-"},{"$f":"OFFSET(Datos!N14,0,($O$2-1)*13)","v":"-"},{"$f":"OFFSET(Datos!O14,0,($O$2-1)*13)","v":3.6288624644136394}]
[]
[null,"Datos a último día de cada mes."]

{"sheet":"Indisp.Peninsular Pr año","index":4,"n_rows":16,"n_cols":10,"rows_kept":16,"cut":false,"hidden":false,"merged":[[15,1,15,9]]}
[null,null,null,null,null,null,null,null,null,1]
[null,null,null,null,null,null,null,null,null,3]
[]
[null,null,null,null,null,null,null,"Concepto"]
[null,null,null,null,null,null,null,"Horizonte temporal"]
[null,null,null,null,null,null,null,"Periodo"]
[]
[null,null,{"$f":"OFFSET(Datos!C44,0,($J$2-1)*8)","v":2017},{"$f":"OFFSET(Datos!D44,0,($J$2-1)*8)","v":2018},{"$f":"OFFSET(Datos!E44,0,($J$2-1)*8)","v":2019},{"$f":"OFFSET(Datos!F44,0,($J$2-1)*8)","v":2020},{"$f":"OFFSET(Datos!G44,0,($J$2-1)*8)","v":2021},{"$f":"OFFSET(Datos!H44,0,($J$2-1)*8)","v":2022},{"$f":"OFFSET(Datos!I44,0,($J$2-1)*8)","v":2023},{"$f":"OFFSET(Datos!J44,0,($J$2-1)*8)","v":2024}]
[]
[null,"Nuclear",{"$f":"OFFSET(Datos!C45,0,($J$2-1)*8)","v":0},{"$f":"OFFSET(Datos!D45,0,($J$2-1)*8)","v":"-"},{"$f":"OFFSET(Datos!E45,0,($J$2-1)*8)","v":"-"},{"$f":"OFFSET(Datos!F45,0,($J$2-1)*8)","v":"-"},{"$f":"OFFSET(Datos!G45,0,($J$2-1)*8)","v":"-"},{"$f":"OFFSET(Datos!H45,0,($J$2-1)*8)","v":"-"},{"$f":"OFFSET(Datos!I45,0,($J$2-1)*8)","v":"-"},{"$f":"OFFSET(Datos!J45,0,($J$2-1)*8)","v":"-"}]
[null,"Carbón",{"$f":"OFFSET(Datos!C46,0,($J$2-1)*8)","v":5.8464513463376218},{"$f":"OFFSET(Datos!D46,0,($J$2-1)*8)","v":"-"},{"$f":"OFFSET(Datos!E46,0,($J$2-1)*8)","v":"-"},{"$f":"OFFSET(Datos!F46,0,($J$2-1)*8)","v":"-"},{"$f":"OFFSET(Datos!G46,0,($J$2-1)*8)","v":"-"},{"$f":"OFFSET(Datos!H46,0,($J$2-1)*8)","v":"-"},{"$f":"OFFSET(Datos!I46,0,($J$2-1)*8)","v":"-"},{"$f":"OFFSET(Datos!J46,0,($J$2-1)*8)","v":"-"}]
[null,"Fuel + Gas",{"$f":"OFFSET(Datos!C47,0,($J$2-1)*8)","v":"-"},{"$f":"OFFSET(Datos!D47,0,($J$2-1)*8)","v":"-"},{"$f":"OFFSET(Datos!E47,0,($J$2-1)*8)","v":"-"},{"$f":"OFFSET(Datos!F47,0,($J$2-1)*8)","v":"-"},{"$f":"OFFSET(Datos!G47,0,($J$2-1)*8)","v":"-"},{"$f":"OFFSET(Datos!H47,0,($J$2-1)*8)","v":"-"},{"$f":"OFFSET(Datos!I47,0,($J$2-1)*8)","v":"-"},{"$f":"OFFSET(Datos!J47,0,($J$2-1)*8)","v":"-"}]
[null,"Ciclo combinado",{"$f":"OFFSET(Datos!C48,0,($J$2-1)*8)","v":3.8827219180186798},{"$f":"OFFSET(Datos!D48,0,($J$2-1)*8)","v":"-"},{"$f":"OFFSET(Datos!E48,0,($J$2-1)*8)","v":"-"},{"$f":"OFFSET(Datos!F48,0,($J$2-1)*8)","v":"-"},{"$f":"OFFSET(Datos!G48,0,($J$2-1)*8)","v":"-"},{"$f":"OFFSET(Datos!H48,0,($J$2-1)*8)","v":"-"},{"$f":"OFFSET(Datos!I48,0,($J$2-1)*8)","v":"-"},{"$f":"OFFSET(Datos!J48,0,($J$2-1)*8)","v":"-"}]
[null,"Indisponibilidad prevista",{"$f":"OFFSET(Datos!C49,0,($J$2-1)*8)","v":3.6288624644136394},{"$f":"OFFSET(Datos!D49,0,($J$2-1)*8)","v":"-"},{"$f":"OFFSET(Datos!E49,0,($J$2-1)*8)","v":"-"},{"$f":"OFFSET(Datos!F49,0,($J$2-1)*8)","v":"-"},{"$f":"OFFSET(Datos!G49,0,($J$2-1)*8)","v":"-"},{"$f":"OFFSET(Datos!H49,0,($J$2-1)*8)","v":"-"},{"$f":"OFFSET(Datos!I49,0,($J$2-1)*8)","v":"-"},{"$f":"OFFSET(Datos!J49,0,($J$2-1)*8)","v":"-"}]
[]
[null,{"$f":"IF(MONTH(FACT)=1,\"Datos acumulados a 31 de diciembre.\",CONCATENATE(\"Datos acumulados a 31 de diciembre. Para el año \",YEAR(FACT), \" datos acumulados a \",TEXT(FACT-30,\"mmmm\"),\" de \",YEAR(FACT),\".\"))","v":"Datos acumulados a 31 de diciembre. Para el año 2017 datos acumulados a febrero de 2017."}]

{"sheet":"Indisp.Peninsular NP mes","index":5,"n_rows":16,"n_cols":15,"rows_kept":16,"cut":false,"hidden":false,"merged":[[15,1,15,13]]}
[null,null,null,null,null,null,null,null,null,null,null,null,null,null,3]
[null,null,null,null,null,null,null,null,null,null,null,null,null,null,17]
[]
[null,null,null,null,null,null,null,null,null,null,null,"Concepto"]
[null,null,null,null,null,null,null,null,null,null,null,"Horizonte temporal"]
[null,null,null,null,null,null,null,null,null,null,null,"Periodo"]
[]
[null,null,"Ene.","Feb.","Mar.","Abr.","May.","Jun.","Jul.","Ago.","Sep.","Oct.","Nov.","Dic.",{"$f":"OFFSET(Año!B13,($O$2-1),0)","v":2017}]
[]
[null,"Nuclear",{"$f":"OFFSET(Datos!C17,0,($O$2-1)*13)","v":1.0045232189393819E-2},{"$f":"OFFSET(Datos!D17,0,($O$2-1)*13)","v":6.1643131487928431E-2},{"$f":"OFFSET(Datos!E17,0,($O$2-1)*13)","v":"-"},{"$f":"OFFSET(Datos!F17,0,($O$2-1)*13)","v":"-"},{"$f":"OFFSET(Datos!G17,0,($O$2-1)*13)","v":"-"},{"$f":"OFFSET(Datos!H17,0,($O$2-1)*13)","v":"-"},{"$f":"OFFSET(Datos!I17,0,($O$2-1)*13)","v":"-"},{"$f":"OFFSET(Datos!J17,0,($O$2-1)*13)","v":"-"},{"$f":"OFFSET(Datos!K17,0,($O$2-1)*13)","v":"-"},{"$f":"OFFSET(Datos!L17,0,($O$2-1)*13)","v":"-"},{"$f":"OFFSET(Datos!M17,0,($O$2-1)*13)","v":"-"},{"$f":"OFFSET(Datos!N17,0,($O$2-1)*13)","v":"-"},{"$f":"OFFSET(Datos!O17,0,($O$2-1)*13)","v":3.4532370839545835E-2}]
[null,"Carbón",{"$f":"OFFSET(Datos!C18,0,($O$2-1)*13)","v":7.9743645515550101},{"$f":"OFFSET(Datos!D18,0,($O$2-1)*13)","v":5.6341057007666624},{"$f":"OFFSET(Datos!E18,0,($O$2-1)*13)","v":"-"},{"$f":"OFFSET(Datos!F18,0,($O$2-1)*13)","v":"-"},{"$f":"OFFSET(Datos!G18,0,($O$2-1)*13)","v":"-"},{"$f":"OFFSET(Datos!H18,0,($O$2-1)*13)","v":"-"},{"$f":"OFFSET(Datos!I18,0,($O$2-1)*13)","v":"-"},{"$f":"OFFSET(Datos!J18,0,($O$2-1)*13)","v":"-"},{"$f":"OFFSET(Datos!K18,0,($O$2-1)*13)","v":"-"},{"$f":"OFFSET(Datos!L18,0,($O$2-1)*13)","v":"-"},{"$f":"OFFSET(Datos!M18,0,($O$2-1)*13)","v":"-"},{"$f":"OFFSET(Datos!N18,0,($O$2-1)*13)","v":"-"},{"$f":"OFFSET(Datos!O18,0,($O$2-1)*13)","v":6.8637332325368101}]
[null,"Fuel + Gas",{"$f":"OFFSET(Datos!C19,0,($O$2-1)*13)","v":"-"},{"$f":"OFFSET(Datos!D19,0,($O$2-1)*13)","v":"-"},{"$f":"OFFSET(Datos!E19,0,($O$2-1)*13)","v":"-"},{"$f":"OFFSET(Datos!F19,0,($O$2-1)*13)","v":"-"},{"$f":"OFFSET(Datos!G19,0,($O$2-1)*13)","v":"-"},{"$f":"OFFSET(Datos!H19,0,($O$2-1)*13)","v":"-"},{"$f":"OFFSET(Datos!I19,0,($O$2-1)*13)","v":"-"},{"$f":"OFFSET(Datos!J19,0,($O$2-1)*13)","v":"-"},{"$f":"OFFSET(Datos!K19,0,($O$2-1)*13)","v":"-"},{"$f":"OFFSET(Datos!L19,0,($O$2-1)*13)","v":"-"},{"$f":"OFFSET(Datos!M19,0,($O$2-1)*13)","v":"-"},{"$f":"OFFSET(Datos!N19,0,($O$2-1)*13)","v":"-"},{"$f":"OFFSET(Datos!O19,0,($O$2-1)*13)","v":"-"}]
[null,"Ciclo combinado",{"$f":"OFFSET(Datos!C20,0,($O$2-1)*13)","v":2.5317712206061391},{"$f":"OFFSET(Datos!D20,0,($O$2-1)*13)","v":2.6542690719686726},{"$f":"OFFSET(Datos!E20,0,($O$2-1)*13)","v":"-"},{"$f":"OFFSET(Datos!F20,0,($O$2-1)*13)","v":"-"},{"$f":"OFFSET(Datos!G20,0,($O$2-1)*13)","v":"-"},{"$f":"OFFSET(Datos!H20,0,($O$2-1)*13)","v":"-"},{"$f":"OFFSET(Datos!I20,0,($O$2-1)*13)","v":"-"},{"$f":"OFFSET(Datos!J20,0,($O$2-1)*13)","v":"-"},{"$f":"OFFSET(Datos!K20,0,($O$2-1)*13)","v":"-"},{"$f":"OFFSET(Datos!L20,0,($O$2-1)*13)","v":"-"},{"$f":"OFFSET(Datos!M20,0,($O$2-1)*13)","v":"-"},{"$f":"OFFSET(Datos!N20,0,($O$2-1)*13)","v":"-"},{"$f":"OFFSET(Datos!O20,0,($O$2-1)*13)","v":2.589905794134121}]
[null,"Indisponibilidad no prevista",{"$f":"OFFSET(Datos!C21,0,($O$2-1)*13)","v":3.3117732626715712},{"$f":"OFFSET(Datos!D21,0,($O$2-1)*13)","v":2.8630962061884926},{"$f":"OFFSET(Datos!E21,0,($O$2-1)*13)","v":"-"},{"$f":"OFFSET(Datos!F21,0,($O$2-1)*13)","v":"-"},{"$f":"OFFSET(Datos!G21,0,($O$2-1)*13)","v":"-"},{"$f":"OFFSET(Datos!H21,0,($O$2-1)*13)","v":"-"},{"$f":"OFFSET(Datos!I21,0,($O$2-1)*13)","v":"-"},{"$f":"OFFSET(Datos!J21,0,($O$2-1)*13)","v":"-"},{"$f":"OFFSET(Datos!K21,0,($O$2-1)*13)","v":"-"},{"$f":"OFFSET(Datos!L21,0,($O$2-1)*13)","v":"-"},{"$f":"OFFSET(Datos!M21,0,($O$2-1)*13)","v":"-"},{"$f":"OFFSET(Datos!N21,0,($O$2-1)*13)","v":"-"},{"$f":"OFFSET(Datos!O21,0,($O$2-1)*13)","v":3.0988417782389233}]
[]
[null,"Datos a último día de cada mes."]

{"sheet":"Indisp.Peninsular NP año","index":6,"n_rows":16,"n_cols":10,"rows_kept":16,"cut":false,"hidden":false,"merged":[[15,1,15,9]]}
[null,null,null,null,null,null,null,null,null,1]
[null,null,null,null,null,null,null,null,null,3]
[]
[null,null,null,null,null,null,null,"Concepto"]
[null,null,null,null,null,null,null,"Horizonte temporal"]
[null,null,null,null,null,null,null,"Periodo"]
[]
[null,null,{"$f":"OFFSET(Datos!C51,0,($J$2-1)*8)","v":2017},{"$f":"OFFSET(Datos!D51,0,($J$2-1)*8)","v":2018},{"$f":"OFFSET(Datos!E51,0,($J$2-1)*8)","v":2019},{"$f":"OFFSET(Datos!F51,0,($J$2-1)*8)","v":2020},{"$f":"OFFSET(Datos!G51,0,($J$2-1)*8)","v":2021},{"$f":"OFFSET(Datos!H51,0,($J$2-1)*8)","v":2022},{"$f":"OFFSET(Datos!I51,0,($J$2-1)*8)","v":2023},{"$f":"OFFSET(Datos!J51,0,($J$2-1)*8)","v":2024}]
[]
[null,"Nuclear",{"$f":"OFFSET(Datos!C52,0,($J$2-1)*8)","v":3.4532370839545835E-2},{"$f":"OFFSET(Datos!D52,0,($J$2-1)*8)","v":"-"},{"$f":"OFFSET(Datos!E52,0,($J$2-1)*8)","v":"-"},{"$f":"OFFSET(Datos!F52,0,($J$2-1)*8)","v":"-"},{"$f":"OFFSET(Datos!G52,0,($J$2-1)*8)","v":"-"},{"$f":"OFFSET(Datos!H52,0,($J$2-1)*8)","v":"-"},{"$f":"OFFSET(Datos!I52,0,($J$2-1)*8)","v":"-"},{"$f":"OFFSET(Datos!J52,0,($J$2-1)*8)","v":"-"}]
[null,"Carbón",{"$f":"OFFSET(Datos!C53,0,($J$2-1)*8)","v":6.8637332325368101},{"$f":"OFFSET(Datos!D53,0,($J$2-1)*8)","v":"-"},{"$f":"OFFSET(Datos!E53,0,($J$2-1)*8)","v":"-"},{"$f":"OFFSET(Datos!F53,0,($J$2-1)*8)","v":"-"},{"$f":"OFFSET(Datos!G53,0,($J$2-1)*8)","v":"-"},{"$f":"OFFSET(Datos!H53,0,($J$2-1)*8)","v":"-"},{"$f":"OFFSET(Datos!I53,0,($J$2-1)*8)","v":"-"},{"$f":"OFFSET(Datos!J53,0,($J$2-1)*8)","v":"-"}]
[null,"Fuel + Gas",{"$f":"OFFSET(Datos!C54,0,($J$2-1)*8)","v":"-"},{"$f":"OFFSET(Datos!D54,0,($J$2-1)*8)","v":"-"},{"$f":"OFFSET(Datos!E54,0,($J$2-1)*8)","v":"-"},{"$f":"OFFSET(Datos!F54,0,($J$2-1)*8)","v":"-"},{"$f":"OFFSET(Datos!G54,0,($J$2-1)*8)","v":"-"},{"$f":"OFFSET(Datos!H54,0,($J$2-1)*8)","v":"-"},{"$f":"OFFSET(Datos!I54,0,($J$2-1)*8)","v":"-"},{"$f":"OFFSET(Datos!J54,0,($J$2-1)*8)","v":"-"}]
[null,"Ciclo combinado",{"$f":"OFFSET(Datos!C55,0,($J$2-1)*8)","v":2.589905794134121},{"$f":"OFFSET(Datos!D55,0,($J$2-1)*8)","v":"-"},{"$f":"OFFSET(Datos!E55,0,($J$2-1)*8)","v":"-"},{"$f":"OFFSET(Datos!F55,0,($J$2-1)*8)","v":"-"},{"$f":"OFFSET(Datos!G55,0,($J$2-1)*8)","v":"-"},{"$f":"OFFSET(Datos!H55,0,($J$2-1)*8)","v":"-"},{"$f":"OFFSET(Datos!I55,0,($J$2-1)*8)","v":"-"},{"$f":"OFFSET(Datos!J55,0,($J$2-1)*8)","v":"-"}]
[null,"Indisponibilidad no prevista",{"$f":"OFFSET(Datos!C56,0,($J$2-1)*8)","v":3.0988417782389233},{"$f":"OFFSET(Datos!D56,0,($J$2-1)*8)","v":"-"},{"$f":"OFFSET(Datos!E56,0,($J$2-1)*8)","v":"-"},{"$f":"OFFSET(Datos!F56,0,($J$2-1)*8)","v":"-"},{"$f":"OFFSET(Datos!G56,0,($J$2-1)*8)","v":"-"},{"$f":"OFFSET(Datos!H56,0,($J$2-1)*8)","v":"-"},{"$f":"OFFSET(Datos!I56,0,($J$2-1)*8)","v":"-"},{"$f":"OFFSET(Datos!J56,0,($J$2-1)*8)","v":"-"}]
[]
[null,{"$f":"IF(MONTH(FACT)=1,\"Datos acumulados a 31 de diciembre.\",CONCATENATE(\"Datos acumulados a 31 de diciembre. Para el año \",YEAR(FACT), \" datos acumulados a \",TEXT(FACT-30,\"mmmm\"),\" de \",YEAR(FACT),\".\"))","v":"Datos acumulados a 31 de diciembre. Para el año 2017 datos acumulados a febrero de 2017."}]

{"sheet":"Disponibilidad Peninsular mes","index":7,"n_rows":16,"n_cols":15,"rows_kept":16,"cut":false,"hidden":false,"merged":[[15,1,15,13]]}
[null,null,null,null,null,null,null,null,null,null,null,null,null,null,17]
[]
[]
[null,null,null,null,null,null,null,null,null,null,null,"Concepto"]
[null,null,null,null,null,null,null,null,null,null,null,"Horizonte temporal"]
[null,null,null,null,null,null,null,null,null,null,null,"Periodo"]
[]
[null,null,"Ene.","Feb.","Mar.","Abr.","May.","Jun.","Jul.","Ago.","Sep.","Oct.","Nov.","Dic.",{"$f":"OFFSET(Año!B13,($O$1-1),0)","v":2017}]
[]
[null,"Nuclear",{"$f":"OFFSET(Datos!C24,0,($O$1-1)*13)","v":93.977604947802135},{"$f":"OFFSET(Datos!D24,0,($O$1-1)*13)","v":93.926007048503578},{"$f":"OFFSET(Datos!E24,0,($O$1-1)*13)","v":"-"},{"$f":"OFFSET(Datos!F24,0,($O$1-1)*13)","v":"-"},{"$f":"OFFSET(Datos!G24,0,($O$1-1)*13)","v":"-"},{"$f":"OFFSET(Datos!H24,0,($O$1-1)*13)","v":"-"},{"$f":"OFFSET(Datos!I24,0,($O$1-1)*13)","v":"-"},{"$f":"OFFSET(Datos!J24,0,($O$1-1)*13)","v":"-"},{"$f":"OFFSET(Datos!K24,0,($O$1-1)*13)","v":"-"},{"$f":"OFFSET(Datos!L24,0,($O$1-1)*13)","v":"-"},{"$f":"OFFSET(Datos!M24,0,($O$1-1)*13)","v":"-"},{"$f":"OFFSET(Datos!N24,0,($O$1-1)*13)","v":"-"},{"$f":"OFFSET(Datos!O24,0,($O$1-1)*13)","v":93.953117809151976}]
[null,"Carbón",{"$f":"OFFSET(Datos!C25,0,($O$1-1)*13)","v":86.179184102107371},{"$f":"OFFSET(Datos!D25,0,($O$1-1)*13)","v":88.519442952895716},{"$f":"OFFSET(Datos!E25,0,($O$1-1)*13)","v":"-"},{"$f":"OFFSET(Datos!F25,0,($O$1-1)*13)","v":"-"},{"$f":"OFFSET(Datos!G25,0,($O$1-1)*13)","v":"-"},{"$f":"OFFSET(Datos!H25,0,($O$1-1)*13)","v":"-"},{"$f":"OFFSET(Datos!I25,0,($O$1-1)*13)","v":"-"},{"$f":"OFFSET(Datos!J25,0,($O$1-1)*13)","v":"-"},{"$f":"OFFSET(Datos!K25,0,($O$1-1)*13)","v":"-"},{"$f":"OFFSET(Datos!L25,0,($O$1-1)*13)","v":"-"},{"$f":"OFFSET(Datos!M25,0,($O$1-1)*13)","v":"-"},{"$f":"OFFSET(Datos!N25,0,($O$1-1)*13)","v":"-"},{"$f":"OFFSET(Datos!O25,0,($O$1-1)*13)","v":87.289815421125567}]
[null,"Fuel + Gas",{"$f":"OFFSET(Datos!C26,0,($O$1-1)*13)","v":"-"},{"$f":"OFFSET(Datos!D26,0,($O$1-1)*13)","v":"-"},{"$f":"OFFSET(Datos!E26,0,($O$1-1)*13)","v":"-"},{"$f":"OFFSET(Datos!F26,0,($O$1-1)*13)","v":"-"},{"$f":"OFFSET(Datos!G26,0,($O$1-1)*13)","v":"-"},{"$f":"OFFSET(Datos!H26,0,($O$1-1)*13)","v":"-"},{"$f":"OFFSET(Datos!I26,0,($O$1-1)*13)","v":"-"},{"$f":"OFFSET(Datos!J26,0,($O$1-1)*13)","v":"-"},{"$f":"OFFSET(Datos!K26,0,($O$1-1)*13)","v":"-"},{"$f":"OFFSET(Datos!L26,0,($O$1-1)*13)","v":"-"},{"$f":"OFFSET(Datos!M26,0,($O$1-1)*13)","v":"-"},{"$f":"OFFSET(Datos!N26,0,($O$1-1)*13)","v":"-"},{"$f":"OFFSET(Datos!O26,0,($O$1-1)*13)","v":"-"}]
[null,"Ciclo combinado",{"$f":"OFFSET(Datos!C27,0,($O$1-1)*13)","v":92.851527060451303},{"$f":"OFFSET(Datos!D27,0,($O$1-1)*13)","v":94.275629503892645},{"$f":"OFFSET(Datos!E27,0,($O$1-1)*13)","v":"-"},{"$f":"OFFSET(Datos!F27,0,($O$1-1)*13)","v":"-"},{"$f":"OFFSET(Datos!G27,0,($O$1-1)*13)","v":"-"},{"$f":"OFFSET(Datos!H27,0,($O$1-1)*13)","v":"-"},{"$f":"OFFSET(Datos!I27,0,($O$1-1)*13)","v":"-"},{"$f":"OFFSET(Datos!J27,0,($O$1-1)*13)","v":"-"},{"$f":"OFFSET(Datos!K27,0,($O$1-1)*13)","v":"-"},{"$f":"OFFSET(Datos!L27,0,($O$1-1)*13)","v":"-"},{"$f":"OFFSET(Datos!M27,0,($O$1-1)*13)","v":"-"},{"$f":"OFFSET(Datos!N27,0,($O$1-1)*13)","v":"-"},{"$f":"OFFSET(Datos!O27,0,($O$1-1)*13)","v":93.5273722878472}]
[null,"Disponibilidad",{"$f":"OFFSET(Datos!C28,0,($O$1-1)*13)","v":91.541391276347667},{"$f":"OFFSET(Datos!D28,0,($O$1-1)*13)","v":92.907511476491067},{"$f":"OFFSET(Datos!E28,0,($O$1-1)*13)","v":"-"},{"$f":"OFFSET(Datos!F28,0,($O$1-1)*13)","v":"-"},{"$f":"OFFSET(Datos!G28,0,($O$1-1)*13)","v":"-"},{"$f":"OFFSET(Datos!H28,0,($O$1-1)*13)","v":"-"},{"$f":"OFFSET(Datos!I28,0,($O$1-1)*13)","v":"-"},{"$f":"OFFSET(Datos!J28,0,($O$1-1)*13)","v":"-"},{"$f":"OFFSET(Datos!K28,0,($O$1-1)*13)","v":"-"},{"$f":"OFFSET(Datos!L28,0,($O$1-1)*13)","v":"-"},{"$f":"OFFSET(Datos!M28,0,($O$1-1)*13)","v":"-"},{"$f":"OFFSET(Datos!N28,0,($O$1-1)*13)","v":"-"},{"$f":"OFFSET(Datos!O28,0,($O$1-1)*13)","v":92.189719506924192}]
[]
[null,"Datos a último día de cada mes."]

{"sheet":"Disponibilidad Peninsular año","index":8,"n_rows":16,"n_cols":10,"rows_kept":16,"cut":false,"hidden":false,"merged":[[15,1,15,9]]}
[null,null,null,null,null,null,null,null,null,3]
[]
[]
[null,null,null,null,null,null,null,"Concepto"]
[null,null,null,null,null,null,null,"Horizonte temporal"]
[null,null,null,null,null,null,null,"Periodo"]
[]
[null,null,{"$f":"OFFSET(Datos!C58,0,($J$1-1)*8)","v":2017},{"$f":"OFFSET(Datos!D58,0,($J$1-1)*8)","v":2018},{"$f":"OFFSET(Datos!E58,0,($J$1-1)*8)","v":2019},{"$f":"OFFSET(Datos!F58,0,($J$1-1)*8)","v":2020},{"$f":"OFFSET(Datos!G58,0,($J$1-1)*8)","v":2021},{"$f":"OFFSET(Datos!H58,0,($J$1-1)*8)","v":2022},{"$f":"OFFSET(Datos!I58,0,($J$1-1)*8)","v":2023},{"$f":"OFFSET(Datos!J58,0,($J$1-1)*8)","v":2024}]
[]
[null,"Nuclear",{"$f":"OFFSET(Datos!C59,0,($J$1-1)*8)","v":93.953117809151976},{"$f":"OFFSET(Datos!D59,0,($J$1-1)*8)","v":"-"},{"$f":"OFFSET(Datos!E59,0,($J$1-1)*8)","v":"-"},{"$f":"OFFSET(Datos!F59,0,($J$1-1)*8)","v":"-"},{"$f":"OFFSET(Datos!G59,0,($J$1-1)*8)","v":"-"},{"$f":"OFFSET(Datos!H59,0,($J$1-1)*8)","v":"-"},{"$f":"OFFSET(Datos!I59,0,($J$1-1)*8)","v":"-"},{"$f":"OFFSET(Datos!J59,0,($J$1-1)*8)","v":"-"}]
[null,"Carbón",{"$f":"OFFSET(Datos!C60,0,($J$1-1)*8)","v":87.289815421125567},{"$f":"OFFSET(Datos!D60,0,($J$1-1)*8)","v":"-"},{"$f":"OFFSET(Datos!E60,0,($J$1-1)*8)","v":"-"},{"$f":"OFFSET(Datos!F60,0,($J$1-1)*8)","v":"-"},{"$f":"OFFSET(Datos!G60,0,($J$1-1)*8)","v":"-"},{"$f":"OFFSET(Datos!H60,0,($J$1-1)*8)","v":"-"},{"$f":"OFFSET(Datos!I60,0,($J$1-1)*8)","v":"-"},{"$f":"OFFSET(Datos!J60,0,($J$1-1)*8)","v":"-"}]
[null,"Fuel + Gas",{"$f":"OFFSET(Datos!C61,0,($J$1-1)*8)","v":"-"},{"$f":"OFFSET(Datos!D61,0,($J$1-1)*8)","v":"-"},{"$f":"OFFSET(Datos!E61,0,($J$1-1)*8)","v":"-"},{"$f":"OFFSET(Datos!F61,0,($J$1-1)*8)","v":"-"},{"$f":"OFFSET(Datos!G61,0,($J$1-1)*8)","v":"-"},{"$f":"OFFSET(Datos!H61,0,($J$1-1)*8)","v":"-"},{"$f":"OFFSET(Datos!I61,0,($J$1-1)*8)","v":"-"},{"$f":"OFFSET(Datos!J61,0,($J$1-1)*8)","v":"-"}]
[null,"Ciclo combinado",{"$f":"OFFSET(Datos!C62,0,($J$1-1)*8)","v":93.5273722878472},{"$f":"OFFSET(Datos!D62,0,($J$1-1)*8)","v":"-"},{"$f":"OFFSET(Datos!E62,0,($J$1-1)*8)","v":"-"},{"$f":"OFFSET(Datos!F62,0,($J$1-1)*8)","v":"-"},{"$f":"OFFSET(Datos!G62,0,($J$1-1)*8)","v":"-"},{"$f":"OFFSET(Datos!H62,0,($J$1-1)*8)","v":"-"},{"$f":"OFFSET(Datos!I62,0,($J$1-1)*8)","v":"-"},{"$f":"OFFSET(Datos!J62,0,($J$1-1)*8)","v":"-"}]
[null,"Disponibilidad",{"$f":"OFFSET(Datos!C63,0,($J$1-1)*8)","v":92.189719506924192},{"$f":"OFFSET(Datos!D63,0,($J$1-1)*8)","v":"-"},{"$f":"OFFSET(Datos!E63,0,($J$1-1)*8)","v":"-"},{"$f":"OFFSET(Datos!F63,0,($J$1-1)*8)","v":"-"},{"$f":"OFFSET(Datos!G63,0,($J$1-1)*8)","v":"-"},{"$f":"OFFSET(Datos!H63,0,($J$1-1)*8)","v":"-"},{"$f":"OFFSET(Datos!I63,0,($J$1-1)*8)","v":"-"},{"$f":"OFFSET(Datos!J63,0,($J$1-1)*8)","v":"-"}]
[]
[null,{"$f":"IF(MONTH(FACT)=1,\"Datos acumulados a 31 de diciembre.\",CONCATENATE(\"Datos acumulados a 31 de diciembre. Para el año \",YEAR(FACT), \" datos acumulados a \",TEXT(FACT-30,\"mmmm\"),\" de \",YEAR(FACT),\".\"))","v":"Datos acumulados a 31 de diciembre. Para el año 2017 datos acumulados a febrero de 2017."}]

{"sheet":"Horas funcionamiento mes","index":9,"n_rows":16,"n_cols":15,"rows_kept":16,"cut":false,"hidden":false,"merged":[[15,1,15,13]]}
[null,null,null,null,null,null,null,null,null,null,null,null,null,null,17]
[]
[]
[null,null,null,null,null,null,null,null,null,null,null,"Concepto"]
[null,null,null,null,null,null,null,null,null,null,null,"Horizonte temporal"]
[null,null,null,null,null,null,null,null,null,null,null,"Periodo"]
[]
[null,null,"Ene.","Feb.","Mar.","Abr.","May.","Jun.","Jul.","Ago.","Sep.","Oct.","Nov.","Dic.",{"$f":"OFFSET(Año!B13,($O$1-1),0)","v":2017}]
[]
[null,"Nuclear",{"$f":"OFFSET(Datos!C31,0,($O$1-1)*13)","v":699.26811733913655},{"$f":"OFFSET(Datos!D31,0,($O$1-1)*13)","v":631.59700920954288},{"$f":"OFFSET(Datos!E31,0,($O$1-1)*13)","v":"-"},{"$f":"OFFSET(Datos!F31,0,($O$1-1)*13)","v":"-"},{"$f":"OFFSET(Datos!G31,0,($O$1-1)*13)","v":"-"},{"$f":"OFFSET(Datos!H31,0,($O$1-1)*13)","v":"-"},{"$f":"OFFSET(Datos!I31,0,($O$1-1)*13)","v":"-"},{"$f":"OFFSET(Datos!J31,0,($O$1-1)*13)","v":"-"},{"$f":"OFFSET(Datos!K31,0,($O$1-1)*13)","v":"-"},{"$f":"OFFSET(Datos!L31,0,($O$1-1)*13)","v":"-"},{"$f":"OFFSET(Datos!M31,0,($O$1-1)*13)","v":"-"},{"$f":"OFFSET(Datos!N31,0,($O$1-1)*13)","v":"-"},{"$f":"OFFSET(Datos!O31,0,($O$1-1)*13)","v":1330.8651265486797}]
[null,"Carbón",{"$f":"OFFSET(Datos!C32,0,($O$1-1)*13)","v":611.06947137492421},{"$f":"OFFSET(Datos!D32,0,($O$1-1)*13)","v":457.41981591611454},{"$f":"OFFSET(Datos!E32,0,($O$1-1)*13)","v":"-"},{"$f":"OFFSET(Datos!F32,0,($O$1-1)*13)","v":"-"},{"$f":"OFFSET(Datos!G32,0,($O$1-1)*13)","v":"-"},{"$f":"OFFSET(Datos!H32,0,($O$1-1)*13)","v":"-"},{"$f":"OFFSET(Datos!I32,0,($O$1-1)*13)","v":"-"},{"$f":"OFFSET(Datos!J32,0,($O$1-1)*13)","v":"-"},{"$f":"OFFSET(Datos!K32,0,($O$1-1)*13)","v":"-"},{"$f":"OFFSET(Datos!L32,0,($O$1-1)*13)","v":"-"},{"$f":"OFFSET(Datos!M32,0,($O$1-1)*13)","v":"-"},{"$f":"OFFSET(Datos!N32,0,($O$1-1)*13)","v":"-"},{"$f":"OFFSET(Datos!O32,0,($O$1-1)*13)","v":1068.4892872910391}]
[null,"Fuel + Gas",{"$f":"OFFSET(Datos!C33,0,($O$1-1)*13)","v":"-"},{"$f":"OFFSET(Datos!D33,0,($O$1-1)*13)","v":"-"},{"$f":"OFFSET(Datos!E33,0,($O$1-1)*13)","v":"-"},{"$f":"OFFSET(Datos!F33,0,($O$1-1)*13)","v":"-"},{"$f":"OFFSET(Datos!G33,0,($O$1-1)*13)","v":"-"},{"$f":"OFFSET(Datos!H33,0,($O$1-1)*13)","v":"-"},{"$f":"OFFSET(Datos!I33,0,($O$1-1)*13)","v":"-"},{"$f":"OFFSET(Datos!J33,0,($O$1-1)*13)","v":"-"},{"$f":"OFFSET(Datos!K33,0,($O$1-1)*13)","v":"-"},{"$f":"OFFSET(Datos!L33,0,($O$1-1)*13)","v":"-"},{"$f":"OFFSET(Datos!M33,0,($O$1-1)*13)","v":"-"},{"$f":"OFFSET(Datos!N33,0,($O$1-1)*13)","v":"-"},{"$f":"OFFSET(Datos!O33,0,($O$1-1)*13)","v":"-"}]
[null,"Ciclo combinado",{"$f":"OFFSET(Datos!C34,0,($O$1-1)*13)","v":214.92861909970892},{"$f":"OFFSET(Datos!D34,0,($O$1-1)*13)","v":132.17757742093366},{"$f":"OFFSET(Datos!E34,0,($O$1-1)*13)","v":"-"},{"$f":"OFFSET(Datos!F34,0,($O$1-1)*13)","v":"-"},{"$f":"OFFSET(Datos!G34,0,($O$1-1)*13)","v":"-"},{"$f":"OFFSET(Datos!H34,0,($O$1-1)*13)","v":"-"},{"$f":"OFFSET(Datos!I34,0,($O$1-1)*13)","v":"-"},{"$f":"OFFSET(Datos!J34,0,($O$1-1)*13)","v":"-"},{"$f":"OFFSET(Datos!K34,0,($O$1-1)*13)","v":"-"},{"$f":"OFFSET(Datos!L34,0,($O$1-1)*13)","v":"-"},{"$f":"OFFSET(Datos!M34,0,($O$1-1)*13)","v":"-"},{"$f":"OFFSET(Datos!N34,0,($O$1-1)*13)","v":"-"},{"$f":"OFFSET(Datos!O34,0,($O$1-1)*13)","v":347.10619652064253}]
[null,"Horas de funcionamiento",{"$f":"OFFSET(Datos!C35,0,($O$1-1)*13)","v":391.95969532168408},{"$f":"OFFSET(Datos!D35,0,($O$1-1)*13)","v":295.84828120303899},{"$f":"OFFSET(Datos!E35,0,($O$1-1)*13)","v":"-"},{"$f":"OFFSET(Datos!F35,0,($O$1-1)*13)","v":"-"},{"$f":"OFFSET(Datos!G35,0,($O$1-1)*13)","v":"-"},{"$f":"OFFSET(Datos!H35,0,($O$1-1)*13)","v":"-"},{"$f":"OFFSET(Datos!I35,0,($O$1-1)*13)","v":"-"},{"$f":"OFFSET(Datos!J35,0,($O$1-1)*13)","v":"-"},{"$f":"OFFSET(Datos!K35,0,($O$1-1)*13)","v":"-"},{"$f":"OFFSET(Datos!L35,0,($O$1-1)*13)","v":"-"},{"$f":"OFFSET(Datos!M35,0,($O$1-1)*13)","v":"-"},{"$f":"OFFSET(Datos!N35,0,($O$1-1)*13)","v":"-"},{"$f":"OFFSET(Datos!O35,0,($O$1-1)*13)","v":687.80797652472324}]
[]
[null,"Datos a último día de cada mes."]

{"sheet":"Horas funcionamiento año","index":10,"n_rows":16,"n_cols":10,"rows_kept":16,"cut":false,"hidden":false,"merged":[[15,1,15,9]]}
[null,null,null,null,null,null,null,null,null,3]
[]
[]
[null,null,null,null,null,null,null,"Concepto"]
[null,null,null,null,null,null,null,"Horizonte temporal"]
[null,null,null,null,null,null,null,"Periodo"]
[]
[null,null,{"$f":"OFFSET(Datos!C58,0,($J$1-1)*8)","v":2017},{"$f":"OFFSET(Datos!D58,0,($J$1-1)*8)","v":2018},{"$f":"OFFSET(Datos!E58,0,($J$1-1)*8)","v":2019},{"$f":"OFFSET(Datos!F58,0,($J$1-1)*8)","v":2020},{"$f":"OFFSET(Datos!G58,0,($J$1-1)*8)","v":2021},{"$f":"OFFSET(Datos!H58,0,($J$1-1)*8)","v":2022},{"$f":"OFFSET(Datos!I58,0,($J$1-1)*8)","v":2023},{"$f":"OFFSET(Datos!J58,0,($J$1-1)*8)","v":2024}]
[]
[null,"Nuclear",{"$f":"OFFSET(Datos!C66,0,($J$1-1)*8)","v":1330.8651265486797},{"$f":"OFFSET(Datos!D66,0,($J$1-1)*8)","v":"-"},{"$f":"OFFSET(Datos!E66,0,($J$1-1)*8)","v":"-"},{"$f":"OFFSET(Datos!F66,0,($J$1-1)*8)","v":"-"},{"$f":"OFFSET(Datos!G66,0,($J$1-1)*8)","v":"-"},{"$f":"OFFSET(Datos!H66,0,($J$1-1)*8)","v":"-"},{"$f":"OFFSET(Datos!I66,0,($J$1-1)*8)","v":"-"},{"$f":"OFFSET(Datos!J66,0,($J$1-1)*8)","v":"-"}]
[null,"Carbón",{"$f":"OFFSET(Datos!C67,0,($J$1-1)*8)","v":1068.4892872910391},{"$f":"OFFSET(Datos!D67,0,($J$1-1)*8)","v":"-"},{"$f":"OFFSET(Datos!E67,0,($J$1-1)*8)","v":"-"},{"$f":"OFFSET(Datos!F67,0,($J$1-1)*8)","v":"-"},{"$f":"OFFSET(Datos!G67,0,($J$1-1)*8)","v":"-"},{"$f":"OFFSET(Datos!H67,0,($J$1-1)*8)","v":"-"},{"$f":"OFFSET(Datos!I67,0,($J$1-1)*8)","v":"-"},{"$f":"OFFSET(Datos!J67,0,($J$1-1)*8)","v":"-"}]
[null,"Fuel + Gas",{"$f":"OFFSET(Datos!C68,0,($J$1-1)*8)","v":"-"},{"$f":"OFFSET(Datos!D68,0,($J$1-1)*8)","v":"-"},{"$f":"OFFSET(Datos!E68,0,($J$1-1)*8)","v":"-"},{"$f":"OFFSET(Datos!F68,0,($J$1-1)*8)","v":"-"},{"$f":"OFFSET(Datos!G68,0,($J$1-1)*8)","v":"-"},{"$f":"OFFSET(Datos!H68,0,($J$1-1)*8)","v":"-"},{"$f":"OFFSET(Datos!I68,0,($J$1-1)*8)","v":"-"},{"$f":"OFFSET(Datos!J68,0,($J$1-1)*8)","v":"-"}]
[null,"Ciclo combinado",{"$f":"OFFSET(Datos!C69,0,($J$1-1)*8)","v":347.10619652064253},{"$f":"OFFSET(Datos!D69,0,($J$1-1)*8)","v":"-"},{"$f":"OFFSET(Datos!E69,0,($J$1-1)*8)","v":"-"},{"$f":"OFFSET(Datos!F69,0,($J$1-1)*8)","v":"-"},{"$f":"OFFSET(Datos!G69,0,($J$1-1)*8)","v":"-"},{"$f":"OFFSET(Datos!H69,0,($J$1-1)*8)","v":"-"},{"$f":"OFFSET(Datos!I69,0,($J$1-1)*8)","v":"-"},{"$f":"OFFSET(Datos!J69,0,($J$1-1)*8)","v":"-"}]
[null,"Horas de funcionamiento",{"$f":"OFFSET(Datos!C70,0,($J$1-1)*8)","v":687.80797652472324},{"$f":"OFFSET(Datos!D70,0,($J$1-1)*8)","v":"-"},{"$f":"OFFSET(Datos!E70,0,($J$1-1)*8)","v":"-"},{"$f":"OFFSET(Datos!F70,0,($J$1-1)*8)","v":"-"},{"$f":"OFFSET(Datos!G70,0,($J$1-1)*8)","v":"-"},{"$f":"OFFSET(Datos!H70,0,($J$1-1)*8)","v":"-"},{"$f":"OFFSET(Datos!I70,0,($J$1-1)*8)","v":"-"},{"$f":"OFFSET(Datos!J70,0,($J$1-1)*8)","v":"-"}]
[]
[null,{"$f":"IF(MONTH(FACT)=1,\"Datos acumulados a 31 de diciembre.\",CONCATENATE(\"Datos acumulados a 31 de diciembre. Para el año \",YEAR(FACT), \" datos acumulados a \",TEXT(FACT-30,\"mmmm\"),\" de \",YEAR(FACT),\".\"))","v":"Datos acumulados a 31 de diciembre. Para el año 2017 datos acumulados a febrero de 2017."}]

{"sheet":"Datos","index":11,"n_rows":70,"n_cols":223,"rows_kept":70,"cut":false,"hidden":true,"merged":[]}
[]
[null,"Indisponibilidad equipo térmico mensual peninsular (%)\nTipo permanente","2001-01-01","2001-02-01","2001-03-01","2001-04-01","2001-05-01","2001-06-01","2001-07-01","2001-08-01","2001-09-01","2001-10-01","2001-11-01","2001-12-01","2001","2002-01-01","2002-02-01","2002-03-01","2002-04-01","2002-05-01","2002-06-01","2002-07-01","2002-08-01","2002-09-01","2002-10-01","2002-11-01","2002-12-01","2002","2003-01-01","2003-02-01","2003-03-01","2003-04-01","2003-05-01","2003-06-01","2003-07-01","2003-08-01","2003-09-01","2003-10-01","2003-11-01","2003-12-01","2003","2004-01-01","2004-02-01","2004-03-01","2004-04-01","2004-05-01","2004-06-01","2004-07-01","2004-08-01","2004-09-01","2004-10-01","2004-11-01","2004-12-01","2004","2005-01-01","2005-02-01","2005-03-01","2005-04-01","2005-05-01","2005-06-01","2005-07-01","2005-08-01","2005-09-01","2005-10-01","2005-11-01","2005-12-01","2005","2006-01-01","2006-02-01","2006-03-01","2006-04-01","2006-05-01","2006-06-01","2006-07-01","2006-08-01","2006-09-01","2006-10-01","2006-11-01","2006-12-01","2006","2007-01-01","2007-02-01","2007-03-01","2007-04-01","2007-05-01","2007-06-01","2007-07-01","2007-08-01","2007-09-01","2007-10-01","2007-11-01","2007-12-01","2007","2008-01-01","2008-02-01","2008-03-01","2008-04-01","2008-05-01","2008-06-01","2008-07-01","2008-08-01","2008-09-01","2008-10-01","2008-11-01","2008-12-01","2008","2009-01-01","2009-02-01","2009-03-01","2009-04-01","2009-05-01","2009-06-01","2009-07-01","2009-08-01","2009-09-01","2009-10-01","2009-11-01","2009-12-01","2009","2010-01-31","2010-02-28","2010-03-31","2010-04-30","2010-05-31","2010-06-30","2010-07-31","2010-08-31","2010-09-30","2010-10-31","2010-11-30","2010-12-31","2010","2011-01-31","2011-02-28","2011-03-31","2011-04-30","2011-05-31","2011-06-30","2011-07-31","2011-08-31","2011-09-30","2011-10-31","2011-11-30","2011-12-31","2011","2012-01-31","2012-02-29","2012-03-31","2012-04-30","2012-05-31","2012-06-30","2012-07-31","2012-08-31","2012-09-30","2012-10-31","2012-11-30","2012-12-31","2012","2013-01-31","2013-02-28","2013-03-31","2013-04-30","2013-05-31","2013-06-30","2013-07-31","2013-08-31","2013-09-30","2013-10-31","2013-11-30","2013-12-31","2013","2014-01-31","2014-02-28","2014-03-31","2014-04-30","2014-05-31","2014-06-30","2014-07-31","2014-08-31","2014-09-30","2014-10-31","2014-11-30","2014-12-31","2014","2015-01-31","2015-02-28","2015-03-31","2015-04-30","2015-05-31","2015-06-30","2015-07-31","2015-08-31","2015-09-30","2015-10-31","2015-11-30","2015-12-31","2015","2016-01-31","2016-02-29","2016-03-31","2016-04-30","2016-05-31","2016-06-30","2016-07-31","2016-08-31","2016-09-30","2016-10-31","2016-11-30","2016-12-31","2016","2017-01-31","2017-02-28","2017-03-31","2017-04-30","2017-05-31","2017-06-30","2017-07-31","2017-08-31","2017-09-30","2017-10-31","2017-11-30","2017-12-31","2017"]
[null,"Nuclear",0,0,0,0,0,0,0,0,0,0,0,0,0,0,0,0,0,0,0,0,0,0,0,0,0,0,0,0,0,0,0,0,0,0,0,0,0,0,0,0,0,0,0,0,0,0,0,0,0,0,0,0,0,0,0,0,0,0,0,0,0,0,0,0,0,0,0,0,0,0,0,0,0,0,0,0,0,0,0,0,0,0,0,0,0,0,0,0,0,0,0,0,0,0,0,0,0,0,0,0,0,0,0,0,0,0,0,0,0,0,0,0,0,0,0,0,0,0,0,0,0,0,0,0,0,0,0,0,0,0,0,0,0,0,0,0,0,0,0,0,0,0,0,0,0,0,0,0,0,0,0,0,0,0,2.9092015258105666,0.24640777950854525,6.0123498200084686,6.012349820008505,6.0123498200084686,6.0123498200084864,6.0123498200084686,6.0123498200084864,6.0123498200084686,6.0123498200084686,6.0123498200084864,6.0123498200084695,6.0123498200084864,6.0123498200084686,6.0123498200084766,6.0123498200084686,6.012349820008505,6.0123498200084686,6.0123498200084864,6.0123498200084686,6.0123498200084864,6.0123498200084686,6.0123498200084686,6.0123498200084864,6.0123498200084695,6.0123498200084864,6.0123498200084686,6.0123498200084766,6.0123498200084686,6.012349820008505,6.0123498200084686,6.0123498200084864,6.0123498200084686,6.0123498200084864,6.0123498200084686,6.0123498200084686,6.0123498200084864,6.0123498200084695,6.0123498200084864,6.0123498200084686,6.0123498200084766,6.0123498200084686,6.0123498200084846,6.0123498200084722,6.0123498200084757,6.0123498200084686,6.0123498200084766,6.0123498200084686,6.0123498200084686,6.0123498200084766,6.0123498200084695,6.0123498200084766,6.0123498200084686,6.0123498200084722,6.0123498200084686,6.0123498200084935,"-","-","-","-","-","-","-","-","-","-",6.0123498200084802]
[null,"Carbón",0,0,0,0,0,0,0,0,0,0,0,0,0,0,0,0.76197455217479348,1.2017981792305781,1.2017981792305781,1.2017981792305781,1.2017981792305781,1.2017981792305781,1.2017981792305781,1.2020322952965294,1.2026023229213292,1.2031488124990466,0.97044966997218762,1.2034913918694654,1.2034913918694654,1.2034913918694652,1.2034913918694654,1.2034913918694659,1.2044952123579398,1.2044952123579393,1.2044952123579398,1.2044952123579395,1.2044952123579398,1.2032692735691499,1.2032692735691499,1.2038749294335811,1.2032692735691499,1.2032692735691499,1.2041878607103584,1.2050714480519069,1.2050714480519069,1.2050714480519069,1.2050714480519069,1.2050714480519069,1.2050714480519069,1.2050714480519069,1.2050714480519069,1.2050714480519069,1.2047008874924376,1.2050714480519069,1.2050714480519067,1.2043872295109281,1.2043872295109281,0.15705225435521841,0,0,0,0,0,0,0,0.4123416590261158,0,0,0,0,0,0,0,0,0,0,0,0,0,0.61331160806642082,0.61331160806642071,0.61340425629311568,0.61340425629311568,0.61340425629311568,0.61340425629311568,0.61340425629311568,0.61340425629311568,0.61340425629311568,0.61340425629311579,0.61340425629311568,0.61694347480692491,0.61368827006285709,0.61707643919264299,0.61707643919264299,0.61714748903872363,0.61714748903872363,0.61714748903872374,0.61714748903872363,0.61714748903872374,0.61714748903872374,0.61714748903872363,0.61714748903872374,0.61714748903872363,0.61713366405016967,0.61713466945488205,0.61714748903872374,0.61714748903872374,0.61714748903872363,0.61714748903872363,0.61714748903872374,0.61714748903872363,0.61714748903872374,0.61714748903872374,0.61714748903872363,0.61714748903872374,0.61714748903872363,0.61714748903872374,0.61714748903872363,0.61714748903872374,0.61714748903872374,0.61714748903872363,0.61714748903872363,0.61714748903872374,0.61714748903872363,0.61714748903872374,0.61615144450728565,0.61615144450728576,0.61615144450728587,0.61615144450728576,0.61530948128786456,0.61665788722278814,0,0,0,0,0,0,0,0,0,0,0,0.41283002074270481,3.5011364646797737E-2,1.2742645186720898,1.3149137335534462,1.3149137335534462,1.3149137335534462,1.3149137335534462,0.79311259573258341,0,0,0,0,9.1919630707179845E-2,0.76330038044309267,0.68304513813294931,1.3434986838715162,1.3424199448482348,1.3416120267248111,1.3416120267248117,1.3416120267248111,1.3416120267248117,1.3416120267248111,1.3416120267248111,1.3416120267248117,1.3416120267248111,1.4711708137102482,3.2894091457960184,1.517921031450213,3.2849938315063594,3.2849938315063443,3.2849938315063594,3.2849938315063594,2.8646131760755615,1.9698089992185723,1.9698089992185721,1.9698089992185721,1.9698089992185723,1.9698089992185723,1.9698089992185723,1.9698089992185721,2.4819339078292271,1.9698089992185721,1.9698089992185581,1.9698089992185723,1.9698089992185723,1.9698089992185721,1.9698089992185723,1.9698089992185721,1.9698089992185721,1.9698089992185723,1.9698089992185723,1.9698089992185723,1.9698089992185721,1.9698089992185717,1.9697648726728907,0,0,0,0,0,0,0,0,0,0,0,0.18033252516578877,0,0,"-","-","-","-","-","-","-","-","-","-",0]
[null,"Fuel + Gas",3.9621231661884644,3.9621231661884644,3.9621231661884644,3.9621231661884639,3.9621231661884644,3.9621231661884639,3.9621231661884644,3.9621231661884644,3.9621231661884639,3.9621231661884639,3.9621231661884639,10.86719585233933,4.5485813943273046,7.082704395960997,7.0786388378481568,7.0786388378481835,7.0786388378481755,7.0786388378481835,7.0786388378481755,7.2079720754627026,7.3518141333241989,7.3559110492950763,7.3641185949527994,7.3641185949527923,7.3704327501154552,7.2059786926034768,7.3739101529768512,7.4331069242099952,7.7558960052498929,7.9379160733855354,7.9510155316607696,7.9742977180987591,7.9742977180987662,7.9996634251301995,7.9996634251301906,7.9996634251301977,7.9996634251301906,7.9996634251301995,7.8627663261707257,7.972781128888383,7.9727811288883679,7.9727811288883856,7.9727811288883652,7.972781128888383,7.9727811288883652,7.972781128888383,7.972781128888383,7.9727811288883652,7.972781128888383,7.9892915881343747,7.9892915881343907,7.9755281315633306,7.9892915881343907,7.989291588134356,8.3455906776357232,8.3580327539436006,8.3580327539436183,9.7369093070767025,10.791344318296138,10.791344318296138,10.791344318296121,10.791344318296138,10.791344318296142,10.802391001371472,9.626202476451013,10.791344318296138,10.791344318296108,10.79134431829614,10.791344318296121,10.791344318296138,10.791344318296121,10.791344318296138,10.791344318296138,10.791344318296121,10.791344318296138,10.791344318296121,10.791344318296138,10.791344318296133,15.893449211293287,15.893449211293262,15.88467138625316,15.884671386253165,15.88467138625316,15.884671386253165,16.014451603106295,16.548983052536826,17.897497756330988,18.121318324118381,18.121318324118391,13.904876258251541,16.318838591625205,8.4932859588602163,3.6931229285750025,3.6931229285750025,3.6931229285750029,7.1241532622188757,7.1241532622188766,7.152188840625481,11.699610293866334,13.931851511606489,13.931851511606455,13.931851511606489,8.8432526540232033,8.6191733875491785,7.4486740553245649,7.8041021505823345,7.1531271605912927,7.1531271605912936,7.1531271605912936,7.1531271605912936,7.1555642066026435,7.6333055227035453,7.7099809442276994,5.7197192543565061,9.0347913478976984,24.294387811681162,8.4876646658826367,16.741872647418322,0,0,0,0,0,0.1406968668144247,0,0,0.5939161891633703,9.8169414151398424,20.794576625217388,4.2454325358351124,24.129629128682339,24.129629128682339,27.591594278131225,52.423332521798727,55.377783905494326,42.056382676661599,35.623003194888184,35.623003194888184,35.623003194888184,35.623003194888184,35.623003194888184,22.209911048310293,35.968444701683573,0,0,0,0,0,0,0,0,0,0,0,15.453049257857046,1.2363815062455383,0,0,0,0,0,0,0,0,0,0,0,0,0,0,0,0,0,0,0,0,0,0,0,0,0,0,0,0,0,0,0,"-","-","-","-","-","-","-",0,"-","-","-","-","-","-","-","-","-","-","-","-","-","-","-","-","-","-","-","-","-","-","-","-","-","-"]
[null,"Ciclo combinado","-","-","-","-","-","-","-","-","-","-","-","-","-","-","-",0,0,0,0,0,0,0,0,0,0,0,0,0,0,0,0,0,0,0,0,0,0,0,0,0,0,0,0,0,0,0,0,0,0,0,0,0,0,0,0,0,0,0,0,0,0,0,0,0,0,0,0,0,0,0,0,0,0,0,0,0,0,0,0,0,0,0,0,0,0,0,0,0,0,0,0,0,0,0,0,0,0,0,0,0,0,0,0,0,0,0,0,0,0,0,0,0,0,0,0,0,0,0,0,0,0,0,0,0,0,0,0,0,0,0,0,0,0,0,0,0,0,0,0,0,0,0,0,0,0,0,0,0,0,0,0,0,0,0,0,0,0,0,0,0,0,0,0,0,0,0,0,0,0,0,0,0,0,0,0,0,0,0,0,0,0,0,0,0,0,0,0,0,0,0,0,0,0,0,0,0,0,0,0,0,0,0,0,0,0,0,0,0,0,0,"-","-","-","-","-","-","-","-","-","-",0]
[null,"Indisponibilidad permanente",1.1353557397185536,1.1353557397185541,1.135139067867984,1.1351390678679842,1.1345983978556851,1.1340932011493159,1.1340932011493159,1.1340932011493159,1.1341064370308331,1.1341924777919021,1.1341924777919021,3.1108300457685329,1.3024711057541853,2.0273532848749087,2.025854927304501,2.3134718876864153,2.4900019473955886,2.3897617349368696,2.3751864054905734,2.3468889454048991,2.3487145782320864,2.3397724703135521,2.3214585420520946,2.3239123032192319,2.3270709699229801,2.3061077844546243,2.3279188723083282,2.3349538348075169,2.3319642499863331,2.3448997197679367,2.3469144459038875,2.3489823900454709,2.3163471432162313,2.2657652053711139,2.2610634609902145,2.2610634609902163,2.2609904728508003,2.2597342791570085,2.3041931008141519,2.2291920301192363,2.2315802689012383,2.2248387771065152,2.1935547817835093,2.1663548231347596,2.1559906195291347,2.0880292286436113,2.0393920809431023,2.0393920809430988,2.0385848622834772,1.9950325069769299,1.9950325069769337,2.1122146490656402,1.9500946912526074,1.94160448800015,1.9399011603038891,1.9201845039321486,1.5912210001271163,1.7955949588625897,1.9888739946768819,1.9888632283153456,1.9472607898899046,1.8976924673173043,1.8742125798762728,1.8663206850604332,1.8912860340650088,1.854851026374313,1.8274455138829544,1.8087455838053705,1.7968676889521351,1.8033385110888256,1.7845888576232691,1.7162054333356542,1.7162054333356542,1.7162054333356509,1.716205433335654,1.7174620232019318,1.7161523036486326,1.7626655021621247,2.6900854128287062,2.6900854128287013,2.6697273130156343,2.6302118107573422,2.6007250698443776,2.5760115113078506,2.5727750797746358,2.5072088229198348,2.5085502737660517,2.4671719210761842,2.4612799887265764,1.7185645848906326,2.500400735949706,1.0177977760936672,0.51260938264512446,0.51216779170551185,0.50964694322793236,0.83525449474177638,0.83413587257460853,0.83441019388917437,1.2678232167699734,1.4805719816544511,1.4805719816544483,1.4805719816544511,0.99540573531136967,0.98286789295277677,0.86187719130691987,0.895719627979223,0.83373463456682018,0.83356317053723161,0.83063097630971061,0.82365871903515819,0.82388796684024246,0.82856165508673996,0.82929298467983181,0.64462180626460241,0.91719592676875283,1.8882621866106457,0.91758392902724784,1.1991426561963587,0.15443801849107139,0.15443801849107142,0.15279964992003789,0.15010012263548586,0.14897356104695655,0.15544212875603514,0.14762967338807678,0.14762967338807675,0.17573490295964067,0.61190327412436263,1.1305502166635175,0.3636880139089036,0.98284451509955473,0.98157206909952954,1.1223063065539269,2.1349499286709772,2.2532634186236349,1.3007595533144856,0.9946542907289746,0.9946542907289746,0.9946542907289746,0.9946542907289746,0.9946542907289746,0.61857022611760126,1.1991518341542617,0.31870491054868161,0.3287170354226378,0.32871703542263775,0.3287170354226378,0.32871703542263775,0.19748944919381017,0,0,0,0,2.2752134879374154E-2,0.95305661030784061,0.23412384155597443,1.3700652525556305,1.369797886477055,1.3695974303891831,1.3695974303891865,1.3695974303891831,1.3695974303891865,1.3695974303891831,1.3695974303891831,1.3695974303891865,1.3695974303891834,1.401100340741712,1.8432146929057363,1.4124636639092127,1.8421410856770661,1.8421410856770681,1.8421410856770652,1.8421410856770695,1.7387385024627511,1.5208823872259554,1.520882387225952,1.520882387225952,1.5208823872259554,1.5208823872259523,1.5208823872259554,1.520882387225952,1.6451973149779076,1.520882387225952,1.5208823872259545,1.520882387225952,1.5208823872259554,1.5277559869230422,1.5387671671670711,1.5387671671670677,1.5387671671670677,1.5387671671670711,1.538767167167068,1.5387671671670711,1.5387671671670677,1.5319089276306996,1.5387564219769749,1.0646457104484008,1.0804247504317332,1.0812437259531928,1.0818451047666178,1.0825762504232388,1.0825762504232372,1.0825762504232372,1.0825762504232388,1.0825762504232368,1.0825762504232388,1.0825762504232372,1.1201396088563746,1.0825762504232372,1.0825762504232415,"-","-","-","-","-","-","-","-","-","-",1.0825762504232392]
[]
[null,"Indisponibilidad equipo térmico mensual peninsular (%)\nTipo prevista","2001-01-01","2001-02-01","2001-03-01","2001-04-01","2001-05-01","2001-06-01","2001-07-01","2001-08-01","2001-09-01","2001-10-01","2001-11-01","2001-12-01","2001","2002-01-01","2002-02-01","2002-03-01","2002-04-01","2002-05-01","2002-06-01","2002-07-01","2002-08-01","2002-09-01","2002-10-01","2002-11-01","2002-12-01","2002","2003-01-01","2003-02-01","2003-03-01","2003-04-01","2003-05-01","2003-06-01","2003-07-01","2003-08-01","2003-09-01","2003-10-01","2003-11-01","2003-12-01","2003","2004-01-01","2004-02-01","2004-03-01","2004-04-01","2004-05-01","2004-06-01","2004-07-01","2004-08-01","2004-09-01","2004-10-01","2004-11-01","2004-12-01","2004","2005-01-01","2005-02-01","2005-03-01","2005-04-01","2005-05-01","2005-06-01","2005-07-01","2005-08-01","2005-09-01","2005-10-01","2005-11-01","2005-12-01","2005","2006-01-01","2006-02-01","2006-03-01","2006-04-01","2006-05-01","2006-06-01","2006-07-01","2006-08-01","2006-09-01","2006-10-01","2006-11-01","2006-12-01","2006","2007-01-01","2007-02-01","2007-03-01","2007-04-01","2007-05-01","2007-06-01","2007-07-01","2007-08-01","2007-09-01","2007-10-01","2007-11-01","2007-12-01","2007","2008-01-01","2008-02-01","2008-03-01","2008-04-01","2008-05-01","2008-06-01","2008-07-01","2008-08-01","2008-09-01","2008-10-01","2008-11-01","2008-12-01","2008","2009-01-01","2009-02-01","2009-03-01","2009-04-01","2009-05-01","2009-06-01","2009-07-01","2009-08-01","2009-09-01","2009-10-01","2009-11-01","2009-12-01","2009","2010-01-31","2010-02-28","2010-03-31","2010-04-30","2010-05-31","2010-06-30","2010-07-31","2010-08-31","2010-09-30","2010-10-31","2010-11-30","2010-12-31","2010","2011-01-31","2011-02-28","2011-03-31","2011-04-30","2011-05-31","2011-06-30","2011-07-31","2011-08-31","2011-09-30","2011-10-31","2011-11-30","2011-12-31","2011","2012-01-31","2012-02-29","2012-03-31","2012-04-30","2012-05-31","2012-06-30","2012-07-31","2012-08-31","2012-09-30","2012-10-31","2012-11-30","2012-12-31","2012","2013-01-31","2013-02-28","2013-03-31","2013-04-30","2013-05-31","2013-06-30","2013-07-31","2013-08-31","2013-09-30","2013-10-31","2013-11-30","2013-12-31","2013","2014-01-31","2014-02-28","2014-03-31","2014-04-30","2014-05-31","2014-06-30","2014-07-31","2014-08-31","2014-09-30","2014-10-31","2014-11-30","2014-12-31","2014","2015-01-31","2015-02-28","2015-03-31","2015-04-30","2015-05-31","2015-06-30","2015-07-31","2015-08-31","2015-09-30","2015-10-31","2015-11-30","2015-12-31","2015","2016-01-31","2016-02-29","2016-03-31","2016-04-30","2016-05-31","2016-06-30","2016-07-31","2016-08-31","2016-09-30","2016-10-31","2016-11-30","2016-12-31","2016","2017-01-31","2017-02-28","2017-03-31","2017-04-30","2017-05-31","2017-06-30","2017-07-31","2017-08-31","2017-09-30","2017-10-31","2017-11-30","2017-12-31","2017"]
[null,"Nuclear",0,2.2794204801371296,14.251016592457669,13.897516714491228,0,0,0.25490834829033221,1.9755396992500747,10.411395070874413,9.8454668787004831,0.85853692848825491,0,4.4782331224372633,0,2.3392614996896199,17.13300722421133,17.401331022279219,12.549620248517938,3.6942851111987194,0,0.61868380366299391,11.771232117731383,1.4513808439233211,0,0,5.5758488333101184,0,0,14.402869653116007,9.4674943461749752,2.2791691546696953,7.8957948340458746,0,0,18.782436431395073,15.20537462015831,0.99251846306729308,1.8609696742055173,5.9159421281085631,0.70849416696064493,0,8.0035727398305383,4.7810490740801672,7.3906624452928851,2.4792503368766683,0,0,11.81004327977708,12.9702054533441,0,0,4.0263634299632729,0,2.023701637453184,13.19860431596274,14.388215377862338,15.339890709895265,8.3997654911192452,0,0,0,13.057304719583851,1.5233522172847827,0,5.6866657177374602,0,0,5.6735613162282439,18.160166582035995,5.2006944527973813,0,0,1.8090974770228387,12.611639378753287,12.253765122833723,1.6882209924199951,0,4.7942137796150233,0,2.3975331228422205,7.8625129082292089,10.669115540902848,29.108745482599787,37.930631971102336,27.002363272863079,14.016347487385289,3.9420977308271121,9.2436868734378503,23.545079285880139,0,13.84668369582505,0,0,0,7.2276961237981041,10.964076354501834,0,0,0,0,3.0361476385121287,13.305470533479625,8.6050388508413196,3.5980455028127052,0,8.7638897245259191,27.839428292820443,20.697898481803229,30.735368676883624,32.059283859277961,20.345948507586741,0,11.864908937705422,9.4247322995104206,11.835132582277675,12.661657443149965,15.533039838184715,6.9264712088199403,0,0,0,11.880207190513413,11.131627685671766,0,0,0,0,4.098859330205225,12.72059792132656,3.9249746357337036,10.931483648207996,13.894085848925798,19.023952232996024,15.834780236836753,29.357212268395632,9.7770508862237175,8.6134192641890746,0,2.7906238325936767,14.050693422849282,13.24471536341203,13.099894619799329,12.556441442285751,5.1765712610497356,0,0,0,18.710367231270194,28.047736592636419,5.4401584329563457,0,0,2.1538677135757958,22.220135013430035,17.937161627589209,8.3062508386058429,4.2008363536388797,0,0,10.931466260875148,9.2924210673936667,0,0,0,4.2084657433158332,14.006211241484515,16.628212504119652,19.52797391552955,6.606036700752405,10.660239758652537,0,0,0,16.022334742762137,26.221582719545207,13.354761521172549,8.1492765196401198,0,1.7578433500832154E-2,13.095932958119864,5.4742407929775974,7.79056873313578,0,0,0,3.2266799291850412,26.567053967374321,16.042984068959989,4.2668333418672182,0,0,0.42362659869223335,13.150075667738168,3.8174693229887424,5.6436556746393771,12.062365244929998,8.7688592172065505,0,0.43653109860399858,13.095932958119855,2.981143627549808,0,0,0,1.3525951392166011,24.429903678799462,9.9272645897089937,6.0638347635782175,0,0,"-","-","-","-","-","-","-","-","-","-",0]
[null,"Carbón",0,1.1596418392439993,2.5749279267769722,7.5787632927428943,11.675860514236943,7.3357700668597881,0,0,0.57236288153256121,1.7718903761055005,0,0,2.7226692200686196,0,0,0,4.9233816010421609,5.1214232905520456,3.4805711804378983,4.5876887262718986,3.3436033687076296,1.8267173356291657,7.055946355056288,0.98282222734609181,0,2.6307514813683452,0,2.9492648878090066,7.550711820805331,6.4615112661339387,7.6545735290234287,4.1299966048731447,0,1.1881353452970509,1.7301788841423522,3.0956181365352649,1.5052256516904374,0,3.0177077144102782,0,0,3.9433225566527899,12.89148588329774,13.199641126299841,1.6658640407585972,0,0,0.2281279783864345,1.7636135812312321,3.8516982899764329,1.1227945592266313,3.2231194239932552,0,1.687563174026167,4.9156120400004717,13.357426611866543,10.982858002286665,4.0548218732648378,2.6522080622630826,0,0,6.082736885138218E-2,0.9494238224453555,0,3.2271609695247601,0,3.8719109386108639,0.45057723746222766,4.8772847044017995,8.0911362741778632,1.1237943544819042,2.5859780489367743E-2,3.2066127806815512,6.54468580239564,12.21386240690223,6.8586647301072556,1.646281532207456,4.0708668934638972,0,0,0,0,0,1.3552114184744546,0.36040945595492135,1.3000508118451108,2.3753901805473538,8.3614715561759141,11.428786868469547,5.9221511894563994,2.5993979442983406,10.574400703750376,17.337661866777442,17.474692130419264,14.752806673517041,17.14961911867654,18.039810661265513,16.576651753507075,15.042006216639269,7.755793817471722,9.8866001534615791,12.850868305024379,10.269951348585957,13.963511314587704,9.3750243484873064,8.1979293320069271,8.87724530928981,15.363846227587889,15.276492672871655,3.6928089524254379,1.2514470429810269,1.2465765201478698,1.8064116813840352,3.2434324453778167,2.421312415820251,0,5.8773025367777523,0,0,0.65814519391108584,5.0937695737076742,5.0937695737076751,0.36010121014127866,0,0,1.7550449315412702,5.7085386412839068,5.2602780038532453,1.2303746346143321,2.1037528236366398,0,0.8123091068270244,2.6508899069407446,2.9014662288824504,5.4929218701172218,0,0,0.79555416123180123,3.5145241178094406,5.0689666329669025,2.7406291194250763,0,2.0036693200746569,0,0,1.0791752216879304E-2,4.121254307534981,7.6330501743080577,3.7045554312502835,0,1.663667764795743,3.140616957666067,9.4735654267786895,2.7322746875611315,0,2.7187238615189653,0,0,2.2646001946908445,8.7531126519517368,14.636654634716786,6.4627633765974677,1.5071657276329893,1.9433818047815483,5.981436085640758,7.9962262826921,1.8138230177960988,0,4.3001002899460881,0,0,0,0.33645412721495832,4.2031863586818963,1.1165209742519504,0,0,0.97304430276425102,5.4423284140232981,7.1741659800958191,0,1.6041260474363706,0,0,2.5357227451749642,12.054711529868047,10.660395721280636,2.8136453468649165,0,0,0,0,0.94994650638590072,0,2.4206112844912528,0.71388901437775965,0.11655072071936215,8.3501018195050829,17.528312932484198,12.70697166580295,4.1626278447704159,0,0.57042345071480105,5.8943756573862904,9.5357139788041856,4.7033078494382163,6.6314039143950172,5.8501483767524354,5.8464513463376244,5.84645134633762,"-","-","-","-","-","-","-","-","-","-",5.8464513463376218]
[null,"Fuel + Gas",0,0,0,1.4043863992908163,4.4778170234888774,1.7424496587285336,0,1.4632435089102596,0.99102322544795951,5.5812379003413497,7.2062777049468032,1.1910375651231524,2.0127947319599366,0,0,0,3.4701816992456012,1.4774327534886029,0,0,1.2904187845444692,3.605308495850057,5.5927859284297297,12.189467127526024,0,2.2614763582200728,0,0,2.1940908597131479,15.525123232684679,8.3557949859328637,2.3564537097365181,0,0,0,0.67238333005659567,0,0,2.4015887873658786,0,0,0,2.5557625456992223,2.518501240266199,0,0,0,0,4.0249842941610856,6.0386573712814045,0,1.2585591039957218,0,0.16774768347416277,1.1341911347720746,4.6284631409115677,4.4926823071122657,3.826997449354566,0,2.8682846452700379,6.8139142860332873,6.1533839217701329,0,0,2.4943934552373608,0,0,0,0,2.0894406668330316,0,1.3826766506545733,6.99349442379199,3.4190417182982236,8.7009768057521573,5.4725871172055314,0.29398674441920031,2.3846280542474849,0,0,3.2266898882042634,8.3534166792188227,7.3567862282032621,0,0,0,0,0,20.644398885585314,1.2177739144404589,3.329844952705483,0,0,0,1.9951467864138612E-2,7.6029302054592334,14.048111243393116,7.221557896270248,7.2225053169982694,7.2225053169982667,7.2225053169982703,7.2225053169982667,7.2225053169982694,5.4011252964452705,7.2225053169982694,7.222505316998296,7.2225053169982694,7.2225053169982667,7.2225053169982694,8.462284000679329,4.4168273442817316,0,0,0,0,0,4.2702944421240865,0,0,0,0,0,0,0,0,0,0,0,0,0,0,0,0,0,11.939993850952797,13.688281903000199,0,0,0,0,0,0,2.3056556009887745,0,0,0,0,0,0,0,0,0,0,0,0,0,0,0,0,0,0,0,0,0,0,0,0,0,0,0,0,0,0,0,0,0,0,0,0,0,0,0,0,0,0,0,0,"-","-","-","-","-","-","-",0,"-","-","-","-","-","-","-","-","-","-","-","-","-","-","-","-","-","-","-","-","-","-","-","-","-","-"]
[null,"Ciclo combinado","-","-","-","-","-","-","-","-","-","-","-","-","-","-","-",0,0,0,0,0,0,0,8.7797571364445819,4.0285142482130762,0,1.8002816870491989,0,0,6.0420490600756835,23.103307204262595,13.41257747980104,0,0,0,0,0,0,0,3.0918776423015744,0,0,1.5415711044106881,0,4.2784758063241011,0,0,2.5404258140734921,0,0.33836412090940132,6.5436655993931545,0.47092892487629334,1.451048106104323,0,0.52487046837670692,3.9650643353237669,6.583120777008217,10.527061347090335,5.8044192609852621,2.7960606095225016,2.3280632122764331,2.1872022124631276,0.6203826406931936,1.0358372042194413,0,2.9370043615998975,0,0,0,1.4078079318472139,9.3142202637907831E-2,0,0,0.84829785078141995,1.0621113982364319,9.3361790818758728,5.2593851596266834,1.6913766559120957,1.7632784020925805,0,0.61744746652117699,0.54483277223649484,2.1038189295863434,1.2602452671136213,0,0,0.69988543852359986,0.97061608213843531,3.6062243618099927,5.0316647262927621,1.3894153817014347,1.4389145272773824,0,1.402473815418015,4.3070556936856761,4.7491143076774955,2.9300752461260657,2.186509770576635,0.41984606269110841,0.15770902551679947,3.6647673772148623,7.0235097053874442,2.9585568140751151,0.18658275122883825,2.4974593594691119,0,0.6118399439753095,3.6801148517068847,4.9453009248018081,5.9669714105638372,0.46191378129259764,0,0,1.7780992117664551,7.2823080845257158,2.3441513942693999,0,2.2603399410375968,0,0.77279633779671308,4.5125318276418538,3.5378120164921736,13.440767244430626,4.7845484429045841,1.5004034115816165,3.3791358694235858,4.4845026124744791,10.199007049230385,9.3024129420415296,2.1251788268181344,4.9141917693290997,1.2356702950764478,4.1472327154493556,3.3878154561429117,5.1802404299470952,9.4496662076107771,5.8969306605540615,1.103881455611214,7.8181324879950633,7.6949070481760877,10.743423169354113,15.813198254285284,6.0398445692264762,6.5414549218692679,3.5860974200106912,1.0398206608799796,17.719311488745372,8.9645029177688045,9.4411610632961462,5.3691519749525716,4.9399510783633955,4.8854353982976457,1.1455786700110318,2.1696713849772911,0.87772107752918227,0,5.0414661490887909,0,0.55868640562887051,2.5074640921819173,10.025558536011534,7.6476836558871817,0.73180622367522252,0.40672360632078702,4.0054396611076406,2.4675313654558262,5.912470869484574,3.0943711311022857,3.7477031582914688,3.4421265873922984,4.9831218652561065,5.8038524329869192,5.8543141630009909,9.038986218574717,7.5006851193755786,6.0262676404709206,5.1093247011794878,4.6480900095802316,5.0939086582384441,7.1895032912584398,7.7118350640346014,3.1291850033529807,5.9987243210593331,3.1853495200668926,4.8030850016370135,10.68636321146969,7.9095563688416251,10.175152052333306,4.169635895624455,4.8892343970376722,5.0392296360401456,5.8959268687869768,11.511099186871505,9.0216855417383783,2.773095367561119,6.6862194761845055,1.763759603780827,1.3485779960814401,4.1948814172923319,6.4881456331841685,6.2591490968244345,1.2356610642375143,1.3709138550320707,3.2266896160438865,8.1954282614555432,11.023419454825291,5.9516407378785416,5.922959501519923,4.759930339104228,4.6167017189425508,3.0701014241386799,"-","-","-","-","-","-","-","-","-","-",3.8827219180186798]
[null,"Indisponibilidad prevista",0,1.1548815724905592,5.2540764560592512,7.6589217973407706,6.1994548504565952,3.586764613642242,7.4640470480491897E-2,0.99729325991231788,3.5732288410568289,5.2266043447458106,2.314272898184587,0.34094494049506946,3.0332762191380467,0,0.68486803205128499,4.9449684019214093,8.0258373820361957,5.9024902915133026,2.3895649638891889,1.7907039247552363,1.8039966222626487,4.8131328854798001,5.3433002484956038,3.8301982448872813,0,3.3013709497901194,0,1.1437153106860158,7.9367806441860811,11.163821283996073,6.9813676851240709,4.2905226388083966,0,0.44672945161504835,5.5154843480022064,5.2530994902853578,0.82212942254395283,0.48122084063201287,3.6478260907179307,0.1807305284206944,0,3.7242876672065619,6.4492910384011486,7.8704927247880851,1.2054465281906934,0,0.57016718036285219,2.8245542861032864,4.5119124092296383,4.0628229915409051,0.48537402363749654,2.6517754851913047,0,1.1621357976595303,5.7897296909357596,10.093787834848058,10.617006581201291,5.4579857874975355,1.6207164182462617,1.1810134761042783,1.8753886366812829,4.0333256526480072,0.93121560964623673,0,3.5424965899939096,0,1.124485569669686,1.2636978325624069,5.4910509651578083,3.71788179688448,0.31871985077230242,0.22694756237254746,2.647658825669807,5.0821160262664122,10.563108287530513,5.0646026068008281,1.1420259533434967,3.0941872284997136,0,0.68207777025844107,2.1697995598988338,4.0705422071209734,6.8673796358385619,7.1022255693630871,4.8922985634330631,3.0588016573740231,1.7144784661593737,5.2935933936679254,11.761234644457822,2.2570068817994371,4.2107836420461702,2.6428491808092938,5.0202092281255366,6.4471986495717326,7.210917991140783,8.2675595877815073,6.8720538040529942,4.9956368188913132,4.4886095014766081,4.3935312437046905,7.0733650438827675,7.5725420587723411,4.7833827334745145,5.8125156369423188,3.0062093787261479,4.5018817863873819,9.4057983415745952,10.412913650135062,12.570686776207301,7.305349272054726,4.1349321895377562,0.30637161381167249,3.3327915277441438,6.0224260516866321,3.7737201069945456,2.1635801443199041,5.5800041474848392,1.1781080395377044,0.40582856435976655,2.5344218535793006,3.1368463123281809,10.460802189272238,4.5323669581483861,0.81700529444686754,1.8502312430910453,2.8759781863406526,6.9514949456296575,7.0313645250515338,3.5654081198453578,3.8175784575029801,2.4869405445360639,4.7720486224264134,5.6573786920951274,6.1777133663838848,11.898202321270968,5.335456195354638,2.0679309456978179,4.5405422820277765,5.6166477680699494,9.5968521353513143,11.700815705105661,5.5947957377816397,6.289931584675414,2.8953294073193074,0.5837078607874977,9.949510591016459,6.0625406440226977,10.398068954059102,8.7287146398531252,3.7127698645259199,3.163284030874324,1.4225647361821159,3.9353147381507907,4.9715414778446538,3.0885769400291041,4.9312973474316335,0.72925804457913002,0.31945936616838766,1.9842188975962065,9.7572219568969469,9.5439178494060926,1.9898442093829725,0.59900771795675989,2.7625366631041417,3.5954900369329938,7.7552316270919599,5.0958006954066883,5.5315051929935306,4.1599270691075496,4.6989218025190436,3.3181829248332932,3.347032943475837,5.2495866882201065,8.0949202505794613,8.2907017900266631,5.2558248133324508,4.0849529691912903,3.1560155358689745,5.4367518319928365,8.4302057948984643,2.7479788821560556,5.1787725186432851,1.8270907867913224,2.7550108078821687,6.7399051029849746,7.9999524485553763,13.086498783464773,5.930983171807477,3.5890254510418664,2.9244517773165564,3.4216249418436213,6.7549412992516098,7.7833823575353493,2.2817940709494349,5.4395030704972713,3.3222518724643435,2.3674047037623507,4.389603232457004,7.9136108910420671,8.9546957446543107,2.2136148541880876,0.8132259647652601,2.0434105413343016,6.1980258680915545,8.9447784944162247,8.995765171499384,6.8046033427104176,5.2440519036513935,4.0642592105575215,3.1468160668971983,"-","-","-","-","-","-","-","-","-","-",3.6288624644136394]
[]
[null,"Indisponibilidad equipo térmico mensual peninsular (%)\nTipo no prevista","2001-01-01","2001-02-01","2001-03-01","2001-04-01","2001-05-01","2001-06-01","2001-07-01","2001-08-01","2001-09-01","2001-10-01","2001-11-01","2001-12-01","2001","2002-01-01","2002-02-01","2002-03-01","2002-04-01","2002-05-01","2002-06-01","2002-07-01","2002-08-01","2002-09-01","2002-10-01","2002-11-01","2002-12-01","2002","2003-01-01","2003-02-01","2003-03-01","2003-04-01","2003-05-01","2003-06-01","2003-07-01","2003-08-01","2003-09-01","2003-10-01","2003-11-01","2003-12-01","2003","2004-01-01","2004-02-01","2004-03-01","2004-04-01","2004-05-01","2004-06-01","2004-07-01","2004-08-01","2004-09-01","2004-10-01","2004-11-01","2004-12-01","2004","2005-01-01","2005-02-01","2005-03-01","2005-04-01","2005-05-01","2005-06-01","2005-07-01","2005-08-01","2005-09-01","2005-10-01","2005-11-01","2005-12-01","2005","2006-01-01","2006-02-01","2006-03-01","2006-04-01","2006-05-01","2006-06-01","2006-07-01","2006-08-01","2006-09-01","2006-10-01","2006-11-01","2006-12-01","2006","2007-01-01","2007-02-01","2007-03-01","2007-04-01","2007-05-01","2007-06-01","2007-07-01","2007-08-01","2007-09-01","2007-10-01","2007-11-01","2007-12-01","2007","2008-01-01","2008-02-01","2008-03-01","2008-04-01","2008-05-01","2008-06-01","2008-07-01","2008-08-01","2008-09-01","2008-10-01","2008-11-01","2008-12-01","2008","2009-01-01","2009-02-01","2009-03-01","2009-04-01","2009-05-01","2009-06-01","2009-07-01","2009-08-01","2009-09-01","2009-10-01","2009-11-01","2009-12-01","2009","2010-01-31","2010-02-28","2010-03-31","2010-04-30","2010-05-31","2010-06-30","2010-07-31","2010-08-31","2010-09-30","2010-10-31","2010-11-30","2010-12-31","2010","2011-01-31","2011-02-28","2011-03-31","2011-04-30","2011-05-31","2011-06-30","2011-07-31","2011-08-31","2011-09-30","2011-10-31","2011-11-30","2011-12-31","2011","2012-01-31","2012-02-29","2012-03-31","2012-04-30","2012-05-31","2012-06-30","2012-07-31","2012-08-31","2012-09-30","2012-10-31","2012-11-30","2012-12-31","2012","2013-01-31","2013-02-28","2013-03-31","2013-04-30","2013-05-31","2013-06-30","2013-07-31","2013-08-31","2013-09-30","2013-10-31","2013-11-30","2013-12-31","2013","2014-01-31","2014-02-28","2014-03-31","2014-04-30","2014-05-31","2014-06-30","2014-07-31","2014-08-31","2014-09-30","2014-10-31","2014-11-30","2014-12-31","2014","2015-01-31","2015-02-28","2015-03-31","2015-04-30","2015-05-31","2015-06-30","2015-07-31","2015-08-31","2015-09-30","2015-10-31","2015-11-30","2015-12-31","2015","2016-01-31","2016-02-29","2016-03-31","2016-04-30","2016-05-31","2016-06-30","2016-07-31","2016-08-31","2016-09-30","2016-10-31","2016-11-30","2016-12-31","2016","2017-01-31","2017-02-28","2017-03-31","2017-04-30","2017-05-31","2017-06-30","2017-07-31","2017-08-31","2017-09-30","2017-10-31","2017-11-30","2017-12-31","2017"]
[null,"Nuclear",0.44831958297730362,0.53831053788803096,0.16590390405794658,0.15786865890674598,0.25777978021354586,2.6429438237187028,2.3825743404654109E-2,6.9398704653786999E-3,0,1.6677865287812996,1.811866909084257,0.91654271794815145,0.7170349601035485,0,2.5299288797456215E-2,2.0232655239512241,1.1796325298797972,0.63613596490798996,0.97838164355853252,0.52573886037241513,0.64174323816242596,0.75410355313137967,0.67398980601278302,0.10819918773740535,0.22499202130348084,0.65140683712323644,1.4551140498242405,0.91973810889284369,0.50296150629652625,1.4148468178497973,11.542016245201776,6.0676994682659728,0.21354225574510433,0.8433446112032944,3.2348084319663163E-2,0,0.27171401665774103,0,1.9462399054783344,1.1632685634282194,0.16348421199515745,1.9907474530895566,3.8879885992591276E-2,4.4522025657805901,1.1327839980715741,0.20206540914645571,1.2604777905301097,0,4.4455638747976396,5.7387956027805229,7.0168941780964138,2.3189182032555062,0.1355101170194713,0.12500361971653012,3.627805420706069,12.769534299946331,17.421969585587199,20.630272720412218,29.045438715587853,17.005086219501166,2.7170573376748544,1.6229148135955971,1.3858989664722112,2.0578950942884142,9.1155505260456309,3.0511155586564516,2.8644630678598753,3.4584347521245049,11.273147660644247,13.619253397284659,2.8750402507373862,9.2098700488852856,0.41992418867700326,3.0591451333294253,2.2111540941966608,0.41277581380011319,1.3345659064518614,4.5005857372031652,1.8212574294622104,0.93649895207922884,0.45853519180182478,1.6015447366143754,4.1862753952222578,1.4616628057752026,0.41111680745318652,11.272416288698105,1.1168182459014293,0.37981611634720297,0,5.4014852227637107,2.4478833982182864,1.5773258461793807,1.0897877831101001E-2,1.964420611164849,15.529291794174952,2.3532204947051714,12.035212651563084,14.535251127151245,6.5928068540249294,14.66346409395776,16.652857512010598,8.9531474958899722,0,7.8970324959868803,0.13849048386851595,2.375976880978504,0,2.1236874608359524,1.0688922216023495,0,2.3412475518925575,0,3.0654271078892701,14.678659701890901,10.86910991747369,14.983293021461275,4.3244212889766054,10.549993052760628,5.7998382733639691,10.945133935778278,7.9072207214819858,6.9933241457282467,0.16572225843670857,0.48974902916161445,0.32000280972580619,3.1056638546023572,0.66567235534870628,0.27113786665046286,0,3.9170897170236372,2.1302565567148442,0,0.6620499670701574,8.474632599751411E-3,3.5542925361513995,0.42747827370934754,8.6071182341882782E-2,0.8044640372990306,1.6454859604090113,3.3212890546354448,0.78655491259253785,0,1.1333354823510995,0.78147444830926616,0.74185182324828414,0.91885283297277287,2.3947132162892122,0,3.0630568518992942,0,0.10154420460440508,0,0,2.1683739472128574,0.28045405300283022,0.86014161067514072,6.3422280873747754,5.7356784515411441,0,5.8225422071033484E-2,11.930903613803149,11.791291999238354,0.69621172065701575,1.4069825479857374,0,0.6740845044474979,0,1.9326038121494198,3.3656049739045248,1.6326051444179055,0.7313296238974476,0,0,5.184203494571828E-3,1.7101601117795115,1.5571481595251078,7.8818525529445376,2.9624001380027791,7.2472086282474354E-2,8.3308074683289546E-2,3.4649439290923829,1.6882101019776004,0.56473277205154437,0.77489020000501463,1.0998373507716817,3.5724898618143062,3.0948904246031428,6.6939600701673747,0.28854899216131458,0,1.8538063938871856,18.629663606236992,6.5656106686277447,1.9052564633516333,3.7700661993063433,0,5.3141063481919488,0.21015722990975161,0.56744338345275536,11.362719817910065,0.46264761958422546,2.2018549976731278E-2,5.4492549903518636E-2,0.17506509597052056,0.4547151257123288,6.165794514184364E-3,4.794104813247591,1.9516485833388026,1.0045232189393819E-2,6.1643131487928431E-2,"-","-","-","-","-","-","-","-","-","-",3.4532370839545835E-2]
[null,"Carbón",1.5642168406698349,0.61437986265703071,2.8217172312423133,2.9314939079813498,4.5774483632612748,5.8260262048928801,7.7380423680192143,7.6188859350990175,6.5612596209166778,7.1563798378585854,5.9059259098503558,6.8869195961537262,5.05144411284593,6.8985442606113612,4.275862354635275,5.393164240531803,4.7677494061708039,5.8978665871880569,9.9544539908919685,7.7189250663920888,3.1032445425457924,5.3345914814898494,4.8002438202137947,5.5926232353418399,1.9980817344044381,5.4778095736523102,1.8333348106565579,2.5167808159364262,3.8517458698878051,2.4468484360946072,3.4941197686922449,6.6897740821811897,5.3773726639728796,3.8778285475739573,3.9664558145974955,1.9957752853648851,2.8619821242638399,1.1097544215192578,3.3340683516690666,4.6718154882180025,3.4880843931673504,5.7671124886494525,5.5886039940249121,6.625970409788362,7.5497003672565235,3.6861908465420257,4.3136381841289655,5.9557144254837784,5.0206202986040607,3.5044125359747089,4.7791930774749076,5.0814327856026669,5.3229085592389227,5.7173884694437769,7.4821581344470465,3.1479588789130375,4.5996021739784432,10.291377905720658,5.3638991097293518,6.5584451367321703,4.776649361887868,3.1999563676818616,2.045894089912812,5.427263634941526,5.3272662080019719,4.5506957087030528,5.3194943822632785,3.2864462044225746,2.5833035789054661,6.7312969693324813,6.6268533054579946,6.9717710848298822,3.4383321379121368,7.3298804169501839,2.4161477662189434,2.4355092122183595,1.8005843619746549,4.4471925070627183,2.3152248184204782,3.1951761370166669,3.0761070519418574,10.299342328233603,12.478268551225009,11.842676261746925,12.744219629635136,12.56494192783145,14.405781263060064,13.127420207650731,6.9024444574992101,4.4441080231726877,8.9791891234074832,6.5310486823397715,4.3660366819778291,3.4639579056178862,3.6275713625825121,5.7987694588158698,5.7719374780808588,6.0003255557826982,6.9057066820766924,10.040212632299502,7.9070048517036682,8.8707665140685119,8.226276323768646,6.4643000974331288,7.1977404785364172,8.5454906216536415,7.9195377829244515,11.485247036395666,5.4132079227765608,7.9495284058421891,7.5829618785886383,6.3672577340370005,5.8039068651432002,5.5269345757308468,6.8528013472510532,4.4904517283233059,7.0722175626668466,5.9818076604203831,7.8388221363318422,10.28882013208889,10.209147629423551,6.9228049904725326,4.5241399253145662,5.5242551418062478,5.8848785008550522,6.0343736125735816,5.0116592809860947,2.3841888714499984,2.677783366419376,6.0944000710246895,0.26184837563437918,1.5292026003142067,3.560210088979527,4.6438363956613449,3.5864787319740783,5.3671217712521688,5.1801533074849795,7.5007046630574559,7.8690908583207682,10.377760293547441,7.3194764291706296,3.4737885404954989,5.0671145721585642,4.8157478543129901,3.9594358279050965,6.2407967801536017,5.6102072830409879,2.838957626331954,5.7670552174800775,4.5267956705848986,5.0920284053231084,7.3061240135750989,2.9886032057377268,5.0252449432541955,1.7508530993049836,4.6563978011395406,1.58104309797127,1.0222954615771038,1.01212946394503,2.1800809783433737,1.2221191745758251,3.0469868484532028,3.3339476685895866,3.2255038802355571,4.1115200969184738,1.9572775727306071,4.1145115274892499,2.7713281696590744,2.4670212380569554,4.0992618786956756,4.6203800213809672,4.3275617811468425,7.3665962804241927,7.9826866115128823,6.9953033187074549,1.5845590356651382,6.5723309706602713,4.9665151553829654,8.2677458256401835,13.769530365748118,4.6644181957494988,6.2562480483741894,3.8688352656257781,2.3819485911444027,3.4526319945554462,6.5968132871283958,5.1043455696355613,6.6708040961370312,6.9220379539618557,7.0814158038049166,4.153667261582652,6.2671475423772538,8.6699500155748872,6.9085857518122129,5.6912434744680969,9.6335134461659706,6.6793779065966579,1.6895973183424704,4.3593797043782194,5.0700191838278776,8.2542564626062749,7.7971343603274494,7.5511984064973436,7.5623052213106989,15.108293076820562,10.034851233154749,4.3431633207470304,7.3518918511095848,7.9743645515550101,5.6341057007666624,"-","-","-","-","-","-","-","-","-","-",6.8637332325368101]
[null,"Fuel + Gas",2.70266925733918,1.8946262433023893,2.9455926957832768,3.5840675030361009,1.304753757204741,6.1899329989510159,5.6940744518502999,2.4901418942566691,9.0313788545632789,18.946139515290064,14.106940159038423,22.32672005168001,7.6432839727574668,23.52572799902946,24.384784861661078,19.443437324330212,17.308884802672381,24.783105274406502,21.666998314743509,21.463560831621901,14.664879130163316,13.223989059881017,10.112200610117998,9.2158238027505579,5.6483897528479439,17.179844791939963,7.1878110907749706,6.8935633139988601,4.9688326718693308,5.0650673130843247,5.8525980310290642,9.7323957751721792,9.5944358575833082,12.034149805017528,6.8737567654442682,9.772418892138953,5.223931068014168,6.3730010703712034,7.4644965199580966,6.3919547767489666,6.0097501302610459,5.9112911553075635,5.2538578536785998,12.32453113235567,8.3633508039503912,7.1202891607059646,7.4195038725255884,8.4875899785932631,6.4906728101183919,9.8179289971635235,17.412330466173636,8.433102184566188,16.886655117768761,13.082244862561945,11.779344408285827,6.9290818939583252,8.5165577342654668,12.654614866231242,11.429637791403232,9.5846363042950458,9.035016697982833,15.980507223435803,11.782160024365835,15.860579600353852,11.994724308845306,12.580431282938262,9.2745200440893871,10.146529395877103,7.4247627041539674,10.240311363047894,8.6923722339904899,16.899623789325645,8.718286067866881,9.1769802882575728,9.4400566295537995,16.965223544292638,12.960355440845412,11.062988222036122,7.6637431169553283,7.2031704937687051,6.3850918813074893,7.5290926674403273,2.1914355895289859,5.3541807514495474,2.2300658901557324,1.1861607764395901,4.8744446112423221,4.1290590151433104,15.358358304606501,8.7086289067139937,5.932397734545555,4.4523904126940961,4.7697224084302832,7.6255287053224121,5.4008471282726127,7.630373019891076,1.5409941498638244,7.7231784859286448,9.4723534606387787,7.3863673517560917,1.6034883367012773,0.63021321909949746,0.36316428352142155,4.8944512751921874,3.1597715832027551,8.2827027594184024,4.3330608898283849,7.0604136214041588,6.9360106596265512,4.225372836706196,4.9237354334703669,4.194820319842604,4.4234618931827701,7.0502801162601605,23.715766687428381,16.389309301635542,7.5718598265712451,7.2173827355065878,9.6615304530839978,11.537155468828528,7.6616821471088752,7.1092172616727236,7.2682553186380785,7.2818295421423942,22.217713505333361,22.698423552819555,17.83295837028232,1.7239838554512721,1.9111912787043606,10.247356993471412,1.6230692239023996,1.6230692239023996,5.0347913152762453,3.9512718550779522,0,0,0,0,0,0,0,0,1.2565743058508427,0,0,0,0,0,0,0,0,0,0,0,0,0,0,0,0,0,0,0,0,0,0,0,0,0,0,0,0,0,21.770833333333304,100.00000000000054,100.00000000000027,100.00000000000054,100.00000000000054,100.00000000000027,100.00000000000054,100.00000000000027,100.00000000000054,68.924086757991176,100.00000000000054,100,100.00000000000054,100.00000000000027,94.733187134502202,"-","-","-","-","-","-","-",99.27986006996521,"-","-","-","-","-","-","-","-","-","-","-","-","-","-","-","-","-","-","-","-","-","-","-","-","-","-"]
[null,"Ciclo combinado","-","-","-","-","-","-","-","-","-","-","-","-","-","-","-",0,0,0,0,1.518143232624557,3.3832709801308156,4.9138426050389752,4.6001878138404901,10.22050518901518,3.7478560037151767,3.7863851697109077,2.4462603178827513,3.380552785974301,2.9415766153573912,7.825461223794357,7.8969238821542413,3.0687372799756933,4.0520229077914252,8.6307358099038858,1.2503854285767368,4.5489156889714968,0.36374695106718746,0.65827713081564931,3.8339960005801692,0.84644288670246171,0.49873410367683707,2.1742458626659076,4.3183300686925685,4.1744330556726998,4.9351013280206963,1.2716944931999505,7.9859524492916218,3.3414114026355093,4.1965394180980651,0.20886589050449936,4.1540784751368864,3.3145691101467589,5.8387362567760155,6.2971332232211044,16.334747888229536,10.595857909438259,12.1951935774393,6.3591728879958414,3.4913601383202995,8.5441510262595894,6.9661315582633376,7.4117901671101452,3.2165399731626296,6.0615393139322897,7.6658724880270714,3.0530479613084114,3.3025688865151475,2.1221640909964954,2.4606733541388768,6.7427010208141391,5.5471103477899772,4.064717401866881,5.8959291544541808,5.8065070575133539,3.6810903121288123,4.3196579574588165,6.741229226571388,4.5488579799424746,3.1156122244113655,5.4910866753827552,4.3251845308278494,7.7819054545140283,6.9228807043893132,4.4605952098282202,4.33552846820404,5.4476647596266119,8.8927071124889618,8.2658705425692833,7.4935163291853817,6.8714610280872845,6.2219067824784968,5.6250476785488042,3.5208549816034829,4.4772708723462671,3.2774484477971448,5.1426347999994757,4.8320903444485941,5.8009522405978817,3.8716599715337474,3.7201409291598528,5.2358845824344193,6.8424988801044568,7.0702762194500046,4.9668540106653172,3.9627632685306104,3.5307909892962952,5.8047079805647943,6.21242010140812,5.5332495335636418,2.2450543605644269,1.0347813264587302,5.97401737210786,11.424320097787383,9.4212374366378064,10.643444805752802,3.2696125535754255,5.7575593114761299,4.071172395920553,3.2960332399840455,5.0961866425519995,5.505781162948117,6.8523639088943771,4.2942564334905935,1.1707719026194139,3.40416337570122,2.9642868842817562,2.2183497160579146,2.5699397391475607,0.75078831014470748,3.481404864392379,1.0729853017017319,0.50448160620928728,2.9756500228786149,1.5241705785156621,1.5069135539245837,1.0122082688445251,0.89096674833408795,1.9623511425323328,5.9144392762707128,4.822101634841566,3.3117997135396768,1.9997151911711808,2.2996100199774485,1.6859997837713085,3.3517487670799722,3.6913609934836118,4.3653785681720647,1.656840925919624,2.7161933170016264,1.4031879711293795,1.5851417575841094,1.7462318119166413,4.997549500025106,3.8789229654865047,1.3537412645753211,2.6941359011846262,0.70076694995898592,0.28445184439837878,2.4556428614979966,0.99720232894678051,2.2282655057231739,1.6631796844056808,0.4451476990635625,0.74370113371421753,1.333475429615985,4.1434605892377219,2.6889277269744456,1.5264293786130332,1.6112316546094623,0.42204954018024859,0.25100395025918776,0.60327663620276895,1.267649470261627,3.094782003924716,1.0724427323300527,1.52728112248612,2.1241192980672032,5.1673801849875813,6.0006166956973113,4.4815355009499704,1.7569028266619453,2.3241728993208488,1.4347205811015074,0.69980702291675179,2.6758233460990395,2.169061960923373,2.3588319793838699,1.8516435198082641,0.45158326542893951,1.38443291644717,1.1355168813683312,3.1490599859471495,11.925406170286884,9.0231336465502867,3.1968995291953384,5.7348986345933906,5.854313731259273,5.7417490124452621,6.3014265888532455,7.4607633564714071,5.6300081667482651,1.8451567267630951,3.6657209091294836,3.1472675108367389,6.2561402180477055,4.9719927812122675,2.8486837675416248,4.9493548469335682,2.5317712206061391,2.6542690719686726,"-","-","-","-","-","-","-","-","-","-",2.589905794134121]
[null,"Indisponibilidad no prevista",1.5640405419472914,0.95898702994252538,2.080017147807824,2.3067884427098235,2.3767813851243615,4.9981407904965067,4.8941671752844558,3.9219899835544072,5.3470549200274498,8.9240298710363675,7.0546395922263683,9.5583409617333377,4.5248688937377892,9.6378816620129975,8.7864478650542246,8.3085829341648445,7.1857411705385799,9.2144060839919604,10.018099378701919,8.8652743441177648,5.4131058903764862,6.0671092080524085,5.0137835922878544,5.4619697820774391,2.603585667143828,7.158446120685162,3.1401825332735922,3.2695488638532022,3.129568431233491,3.3542658538573731,6.6777393280034252,6.8579928777815322,4.8307957915739586,5.5931486435052875,3.2256330352826859,3.5936729234547924,2.3773218222832142,1.949152532302419,3.9952201548024244,3.5844049322616875,2.7560392299880188,4.2888997142383474,3.9156556282357209,6.8958631681534506,5.676745585448165,3.0787052427138448,5.063248578326272,4.501669733961938,5.0024403172736074,4.477736263460856,7.6614357885292694,4.77850298577959,6.560894806459558,6.0615256531549591,9.8229944011970929,8.0249376872296949,10.263319740867829,11.900934658064305,11.162644719973738,9.968931959593796,5.748316333070334,6.4359278194041885,3.9767690843035752,6.7418402089397516,8.0418184564285813,5.1311412797502935,4.8111535438963555,4.0689351845749462,5.0723616254651898,8.6689100868418478,5.8562764835215306,7.8565215251653209,4.6551847187478845,6.2466250152481315,3.9783507699646363,5.0901963355635838,5.3764072741097939,5.5751181090443156,3.3792224534559239,4.2915271058171829,3.5994398206262099,7.2898706778682767,7.1667377291492391,5.9872130642987944,5.5100365968392895,7.6565419061771278,8.4166005035649771,7.6074642877173941,7.0742878551138064,6.2266745646108488,6.227099061405478,5.037590293364179,3.2495277229309525,4.0960869849644341,5.6663049865390827,5.0688670225480399,5.9737651214127396,7.5180973159925601,5.6190563049326601,7.4942904306346652,7.4916968025942801,7.111286535007066,5.5155748256229202,5.8315987672046949,4.0368321938632663,5.0272927770727813,5.2017425144408627,6.9026069783054176,4.8813615978571621,3.448351809893762,3.219635549778503,4.9045891220492228,8.0145254721678949,9.1471326839415692,10.852616403757423,6.5117675159563362,6.0026388337032737,5.8429761379882326,5.1989617644889323,7.7405948502673034,7.1911420776368171,6.9062108776512492,3.8122512871369141,2.39738843893491,4.3769256706636677,4.6559036739149882,3.3686830280776978,2.1045277464902954,1.1431441986784439,4.5304702266679913,1.0708216440263443,0.71839773584776334,2.8200490202277955,2.1350043329843604,2.2947602077192206,1.9575027371610505,1.7922636953470004,3.0834434498061407,5.5123712507286111,5.8097164096738974,3.7852597512174855,1.9807033511239012,2.7523857485249534,2.283857577388392,2.9978259034536108,3.7889670667507689,4.2613155929952722,1.6397896741565554,3.4857040098699748,1.9107607351968796,2.1705149722046304,2.7919089273328397,3.5543777053681809,3.799393569223481,1.2422599115107096,2.8192217350122468,1.8858102038343538,1.4066238923707823,1.6500466831097638,1.1103239786512187,3.6415877914598078,3.7380147450867436,1.1859872468073702,1.4536542318675536,1.7621136359994363,2.9618048888054478,2.5377812361082883,1.8819367717437721,2.1050932018754462,1.5213725825318021,1.3938884524427653,1.3971755150333782,2.7681812479536889,4.8664925909200107,3.758792674347907,2.6907952511571986,5.3347604316854209,5.8373542713691977,6.6066698305086948,7.0613837491857723,3.89592018632939,3.93682136413541,3.0146924752455742,2.271880544562662,3.7195733727533686,4.6161413579087283,3.8123525932337343,3.878145579534257,1.9984749439246841,2.5278228703692744,1.9969920903216758,6.6353173490627499,10.188523274527496,7.2543778137896471,4.3303411389530684,5.6740169464667538,5.9562987626664485,3.8226994146862725,4.8280527836482738,7.6195412146786223,5.2946052071052563,2.8664441020681268,3.8964859778927261,3.6131679898488436,7.2186917980224168,5.225811434726868,3.5378341616650286,4.9627997631122103,3.3117732626715712,2.8630962061884926,"-","-","-","-","-","-","-","-","-","-",3.0988417782389233]
[]
[null,"Disponibilidad equipo térmico mensual peninsular (%)","2001-01-01","2001-02-01","2001-03-01","2001-04-01","2001-05-01","2001-06-01","2001-07-01","2001-08-01","2001-09-01","2001-10-01","2001-11-01","2001-12-01","2001","2002-01-01","2002-02-01","2002-03-01","2002-04-01","2002-05-01","2002-06-01","2002-07-01","2002-08-01","2002-09-01","2002-10-01","2002-11-01","2002-12-01","2002","2003-01-01","2003-02-01","2003-03-01","2003-04-01","2003-05-01","2003-06-01","2003-07-01","2003-08-01","2003-09-01","2003-10-01","2003-11-01","2003-12-01","2003","2004-01-01","2004-02-01","2004-03-01","2004-04-01","2004-05-01","2004-06-01","2004-07-01","2004-08-01","2004-09-01","2004-10-01","2004-11-01","2004-12-01","2004","2005-01-01","2005-02-01","2005-03-01","2005-04-01","2005-05-01","2005-06-01","2005-07-01","2005-08-01","2005-09-01","2005-10-01","2005-11-01","2005-12-01","2005","2006-01-01","2006-02-01","2006-03-01","2006-04-01","2006-05-01","2006-06-01","2006-07-01","2006-08-01","2006-09-01","2006-10-01","2006-11-01","2006-12-01","2006","2007-01-01","2007-02-01","2007-03-01","2007-04-01","2007-05-01","2007-06-01","2007-07-01","2007-08-01","2007-09-01","2007-10-01","2007-11-01","2007-12-01","2007","2008-01-01","2008-02-01","2008-03-01","2008-04-01","2008-05-01","2008-06-01","2008-07-01","2008-08-01","2008-09-01","2008-10-01","2008-11-01","2008-12-01","2008","2009-01-01","2009-02-01","2009-03-01","2009-04-01","2009-05-01","2009-06-01","2009-07-01","2009-08-01","2009-09-01","2009-10-01","2009-11-01","2009-12-01","2009","2010-01-31","2010-02-28","2010-03-31","2010-04-30","2010-05-31","2010-06-30","2010-07-31","2010-08-31","2010-09-30","2010-10-31","2010-11-30","2010-12-31","2010","2011-01-31","2011-02-28","2011-03-31","2011-04-30","2011-05-31","2011-06-30","2011-07-31","2011-08-31","2011-09-30","2011-10-31","2011-11-30","2011-12-31","2011","2012-01-31","2012-02-29","2012-03-31","2012-04-30","2012-05-31","2012-06-30","2012-07-31","2012-08-31","2012-09-30","2012-10-31","2012-11-30","2012-12-31","2012","2013-01-31","2013-02-28","2013-03-31","2013-04-30","2013-05-31","2013-06-30","2013-07-31","2013-08-31","2013-09-30","2013-10-31","2013-11-30","2013-12-31","2013","2014-01-31","2014-02-28","2014-03-31","2014-04-30","2014-05-31","2014-06-30","2014-07-31","2014-08-31","2014-09-30","2014-10-31","2014-11-30","2014-12-31","2014","2015-01-31","2015-02-28","2015-03-31","2015-04-30","2015-05-31","2015-06-30","2015-07-31","2015-08-31","2015-09-30","2015-10-31","2015-11-30","2015-12-31","2015","2016-01-31","2016-02-29","2016-03-31","2016-04-30","2016-05-31","2016-06-30","2016-07-31","2016-08-31","2016-09-30","2016-10-31","2016-11-30","2016-12-31","2016","2017-01-31","2017-02-28","2017-03-31","2017-04-30","2017-05-31","2017-06-30","2017-07-31","2017-08-31","2017-09-30","2017-10-31","2017-11-30","2017-12-31","2017"]
[null,"Nuclear",99.551680417022695,97.182268981974843,85.583079503484385,85.944614626602032,99.742220219786461,97.357056176281304,99.721265908305014,98.017520430284549,89.58860492912558,88.486746592518216,97.329596162427492,99.083457282051853,94.804731917459193,100,97.635439211512931,80.843727251837436,81.419036447840995,86.814243786574082,95.327333245242741,99.474261139627586,98.739572958174577,87.474664329137241,97.874629350063898,99.891800812262588,99.775007978696522,93.772744329566649,98.544885950175754,99.080261891107156,85.094168840587471,89.117658835975234,86.178814600128533,86.036505697688156,99.786457744254889,99.156655388796707,81.18521548428528,84.79462537984169,98.735767520274962,98.139030325794479,92.137817966413095,98.128237269611134,99.836515788004846,90.0056798070799,95.180071039927242,88.157134988926529,96.387965665051766,99.797934590853544,98.739522209469897,88.189956720222924,82.584230671858279,94.261204397219473,92.983105821903592,93.654718366781225,99.864489882980536,97.851294742830291,83.173590263331192,72.842250322191333,67.238139704517579,70.969961788468481,70.954561284412151,82.994913780498834,97.282942662325141,85.319780466820546,97.090748816243007,97.942104905711588,85.197783756216907,96.948884441343552,97.135536932140127,90.868003931647252,70.566685757319831,81.180052149918012,97.124959749262615,90.790129951114722,97.770978334300153,84.329215487917281,85.535080782969615,97.89900319377989,98.665434093548143,90.705200483181827,98.178742570537793,96.665967925078547,91.678951899968951,87.729339722482777,66.704979122177903,60.607705223122402,72.586519919683738,74.711236223916558,94.941084023271458,90.376497010214948,76.454920714119865,94.598514777236289,83.705432905956656,98.422674153820623,99.989102122168902,98.035579388835146,77.243012082026894,86.682703150792989,87.964787348436914,85.464748872848759,93.407193145975072,85.336535906042243,80.310994849477268,77.741381970630457,91.394961149158675,88.504922001200413,99.861509516131477,88.860133394495577,72.160571707179557,77.178414057360769,68.195739101514079,67.940716140722031,77.312803940520638,100,85.069663954405314,75.896607998598625,77.295757500248698,72.355049535388758,80.142538872838671,82.52353573841944,94.200161726636026,89.054866064221727,92.092779278518009,81.126468663758402,88.702650055891525,99.510250970838385,99.679997190274193,96.894336145397645,99.334327644651296,95.630002803144308,87.279402078673442,92.157935647242667,86.938259795077158,86.105914151074202,80.313997799933759,84.156745130563493,67.088495195452964,89.795470840066926,91.300509553469041,99.195535962700973,95.563890206997314,82.628017522515279,85.968729723995438,86.900105380200671,86.31022307536314,94.041954290640987,99.258148176751718,99.081147167027225,97.605286783710781,81.289632768729803,68.889206555464284,94.559841567043648,99.898455795395591,100,97.846132286424208,75.611491039357162,78.873182793597394,90.587199771210479,83.444585738977878,88.251971728450357,93.987650179991533,82.997958497045332,72.764325498794676,82.196358180753151,93.291438459334515,92.580667632005799,89.779184436675706,79.307354434059619,77.359437675871916,72.527072452312524,84.016008505334597,81.694805276921102,93.256320556094053,93.987650179991533,93.987650179991519,77.960131233734828,66.055907348666906,79.075740499293829,77.956521107406843,91.025250041988755,93.897599660208229,80.808409147188314,85.048465457921552,84.508871344878145,93.422917407939977,93.212759979986501,92.887812829219854,87.188480388992161,64.325705788013977,71.250706040864245,89.432267845962997,93.987650179991533,92.133843786104336,74.934359975062279,74.271963843625628,88.264924393651157,84.573928306045801,81.925284935061541,79.904684614593023,93.777492950081779,92.983675697934771,69.528997403961611,90.543858932857489,93.965631630014798,93.933157630088019,93.812585084021009,92.180339915062603,69.551580706677882,79.26628077703495,85.97216683307451,93.977604947802135,93.926007048503578,"-","-","-","-","-","-","-","-","-","-",93.953117809151976]
[null,"Carbón",98.435783159330171,98.225978298098966,94.603354841980718,89.48974279927576,83.746691122501787,86.838203728247336,92.261957631980792,92.381114064900984,92.866377497550758,91.071729786035917,94.094074090149647,93.113080403846268,92.225886667085447,93.101455739388641,95.724137645364721,93.844861207293405,89.107070813556462,87.778911943029314,85.363176649439552,86.49158802810544,92.351353909516007,91.636893003650414,86.941777529433381,92.22195221439074,96.798769453096511,90.920989275007159,96.963173797473971,93.330462904385101,87.394050917437397,89.888148905901986,87.647815310414856,87.975734100587729,93.418132123669182,93.729540894771048,93.098870088902217,93.704111365741909,94.429522950476567,97.686976304911596,92.44434900448708,94.12491523821285,95.308646333263496,89.085377093987404,80.314838674625449,78.969317015859872,89.579364143932978,95.108737705406071,94.481290367819128,92.611086148077874,92.010694672112791,91.438817725996955,92.892940915246555,90.490746902911638,93.472019992709164,91.389976908478147,86.397842596041556,82.290227279709498,84.260487569379663,85.653800221014507,91.983892828007569,93.441554863267825,95.223350638112137,96.739216263466759,97.004682087641839,94.572736365058475,91.033231163447155,95.449304291296954,90.808594679125861,96.262976558115199,92.53941171669274,85.177566756489654,92.249352340060099,93.002369134680748,93.355055081406306,86.125433780654177,85.369989826878808,90.705826057674386,96.55313410581789,91.481940599473376,97.0714635735131,96.191512254916915,96.31048869176503,89.08725341547327,86.908327192481877,86.188708063485507,86.281966658116815,85.521603004030325,82.605424300099457,77.897703979880262,81.055364417738105,89.016797312563995,87.807724662231323,82.277474174717199,77.679225012052086,78.444202474924111,81.002474474861728,76.434463933468876,75.571104371614908,76.805875201671498,77.435139612245308,81.586846061190045,81.589247505796024,77.661217691868387,80.886638663595221,78.955053918524285,82.810087683937553,82.639432557300708,82.586069418747016,72.533759246977723,78.693151915313052,87.740515152693646,90.548443589391596,91.769018256776405,91.772533964434032,90.612485489852617,90.108738747889987,94.892400782637964,86.433332411516673,93.401044850540899,91.544030374629429,88.435887184961302,84.079935307830041,87.366277946781068,94.498611375505433,93.858597369155035,93.498970054637667,91.594430011377867,88.663650633222716,91.739381680189467,95.476532517678436,91.18518921811588,99.738151624365628,97.658488292858763,93.788900004079736,92.454697375456206,90.920599397908703,94.632878228747828,94.819846692515014,91.703741175710746,88.616385023869796,84.553273073485656,89.9398944514043,96.113381438761792,92.894204743119985,93.909987627014928,94.725650438541464,92.43349773407607,88.9536246758706,88.213078465806532,89.735276755537058,95.473204329415097,93.244303829881147,89.553259028758831,87.537831367483591,92.150560738477481,97.485846520251926,91.941833199208546,97.075458218157209,97.635284593574667,95.381658314639324,87.725194342980075,82.799614163982625,89.148637748224516,93.817274577052601,93.48950228825808,88.565431790715962,88.704884117852473,92.600494641004403,93.9392626845449,91.71495744054674,92.615744289797959,92.094626147112692,92.38744438734679,89.011955760854491,84.949513853729655,89.918366707822031,96.445631965116291,91.457860030121154,92.090631542634213,84.320116761117959,77.086494654937496,93.365772805031924,89.657691996360214,94.161355735155652,95.648242409637035,92.041836261051017,79.378666183784986,82.265449709865237,88.545741557779479,91.108153046819567,90.948775196976513,93.876523739198788,91.763043458404169,88.410294478820632,91.121605248969217,89.918336241822075,87.682832666783384,93.204071372683984,89.960300862152451,78.112307363137589,82.223009150369165,87.583115692623309,92.202865639672552,91.878378142787852,86.543319121303014,75.355992944375259,85.261840917407028,89.025432764857953,86.617627246972191,86.179184102107371,88.519442952895716,"-","-","-","-","-","-","-","-","-","-",87.289815421125567]
[null,"Fuel + Gas",93.335207576472357,94.14325059050914,93.092284138028262,91.049422931484614,90.25530605311792,88.105494176131984,90.34380238196124,92.084491430644604,86.015474753800305,71.510499418180117,74.724658969826308,65.615046530857512,85.795339900955298,69.391567605009541,68.536576300490765,73.477923837821606,72.142294660233844,66.660823134256702,71.254362847408316,71.328467092915389,76.692887951968018,75.814791394973852,76.930894866499472,71.230590474770622,86.981177497036597,73.352700157236484,85.438278756248181,85.673329761791138,85.081180463167627,71.471893380845458,77.840591451377307,79.93685279699254,82.431266424317926,79.966186769852271,85.12657980942555,81.555534352674258,86.776405506855639,85.627335504498603,82.271148366505301,85.635264094362654,86.017468740850603,86.115927715804048,84.217598471733808,77.184186498489808,83.663868067161218,84.906929710405677,84.607714998586033,83.539628892518351,81.511561766832145,76.154122043420699,74.598377945691965,82.33281057987476,75.124053294096854,78.760715865829525,78.740873779306384,80.084422211186507,78.632727204678645,73.781478377337493,77.779017890300636,76.755734732138762,73.35972469768771,67.074764536497923,77.426495657338023,73.337029398274666,75.884679759466309,76.628224398765596,79.934135637614503,79.062126285826764,81.783892977549911,76.878903651822952,80.516283447713391,70.926355241723641,73.496875190045031,76.612633675148075,71.067622246397889,66.770845020205712,75.954313496439312,75.761039405420263,76.442807671751325,76.903380294938032,74.503546844235132,68.232819267087677,74.567106796014599,78.761147862297292,81.755482506737991,82.264856171023595,77.228057632426697,77.749622660738311,45.875924485689708,76.168720920594026,74.418918721123745,87.054323628445687,91.537154662994723,88.681348366102583,90.886078475288258,77.642543512430777,77.286741344524188,77.903074777175618,71.60553092849662,71.459275819639146,77.242154834693977,78.215429952295736,83.571077745457131,81.085250040813364,82.169049044474406,76.690689773000997,81.291306632582049,78.563953901006272,78.688356862783877,80.159216002023186,83.50387301564524,88.171874157453829,87.866557162589515,87.230000629383326,67.249441964673906,59.316302886683317,79.670181065422028,76.04074461707512,90.338469546916002,88.46284453117147,92.338317852891123,92.890782738327275,92.731744681361917,92.577473591043187,77.782286494666636,77.301576447180452,81.573125440554307,88.459074729408883,77.294232096078247,85.507210470693479,74.247301647415256,74.247301647415256,67.373614406592537,43.625395623123332,32.682222243552872,44.255335420338191,64.376996805111816,64.376996805111816,64.376996805111816,64.376996805111816,64.376996805111816,77.790088951689711,60.469325391476815,100,100,100,100,100,100,100,100,100,100,100,84.546950742142954,98.763618493754464,100,100,100,100,100,100,100,100,100,100,100,100,100,100,100,100,78.2291666666667,-5.4001247917767614E-13,-2.7000623958883807E-13,-5.4001247917767614E-13,-5.4001247917767614E-13,-2.7000623958883807E-13,-5.4001247917767614E-13,-2.7000623958883807E-13,-5.4001247917767614E-13,31.075913242008824,-5.4001247917767614E-13,0,-5.4001247917767614E-13,-2.7000623958883807E-13,5.2668128654977977,"-","-","-","-","-","-","-",0.72013993003479015,"-","-","-","-","-","-","-","-","-","-","-","-","-","-","-","-","-","-","-","-","-","-","-","-","-","-"]
[null,"Ciclo combinado","-","-","-","-","-","-","-","-","-","-","-","-","-","-","-",100,100,100,100,98.481856767375447,96.616729019869183,95.08615739496102,86.620055049714935,85.750980562771744,96.252143996284829,94.413333143239896,97.553739682117254,96.619447214025698,91.016374324566925,69.071231571943045,78.690498638044716,96.931262720024307,95.947977092208575,91.369264190096118,98.749614571423265,95.451084311028509,99.636253048932815,99.341722869184352,93.07412635711826,99.153557113297538,99.501265896323162,96.284183032923409,95.681669931307425,91.547091138003225,95.064898671979307,98.728305506800055,89.473621736634882,96.658588597364485,95.465096460992527,93.247468510102351,95.374992599986825,95.234382783748927,94.161263743223984,93.177996308402186,79.700187776446697,82.821021313553587,77.277745075470321,87.83640785101889,93.712579252157198,89.127785761463969,90.846666229273524,91.967827192196665,95.747622822617942,93.938460686067714,89.397123150373034,96.946952038691592,96.697431113484853,97.877835909003508,96.131518714013907,93.164156776547955,94.452889652210018,95.935282598133114,93.255772994764399,93.131381544250218,86.982730605995314,90.420956882914524,91.567394117516514,93.68786361796495,96.884387775588635,93.891465858096069,95.129982696935656,90.114275615899658,91.81687402849704,95.539404790171773,95.664471531795954,93.852449801849787,90.136676805372602,88.127905095620719,87.474818944521857,91.739123590211278,92.339178690244125,94.37495232145119,95.076671202978503,91.21567343396805,91.973437244525385,91.927289953874435,92.981399884974749,93.779201696711013,95.97063100294946,92.615091693625288,87.740605712178137,90.198944305820447,92.74314102932118,92.535686629865566,96.037236731469392,95.857369066728396,90.515177167728297,88.842278973790101,88.499779055872523,97.293031858142982,98.965218673541273,94.025982627892134,86.797580690446182,83.29645447883648,87.012403799977804,96.730387446424572,91.982100747486271,95.928827604079444,95.931170422219239,90.391281529806164,90.956406820559721,79.706868846674993,90.921195123604804,97.328824685798963,93.216700754875177,92.551210503243766,87.582643234711739,88.127647318810872,97.124032863037158,91.604403366278518,97.691344403221819,95.348285678341355,93.636534520978458,93.295588991537272,89.043420238464634,93.09086107060142,98.005151796054705,90.219516369472601,86.390653675553196,84.434475195804325,80.875002032175047,91.960440239602349,91.15893505815329,94.727902796218004,95.608430572040049,78.589327517771039,86.670118514059112,88.901998010784212,91.914654708045788,93.656860950507223,93.52942284411823,97.108189518072322,92.832779114997578,95.243355956984317,98.646258735424681,92.264397949726572,99.299233050041011,99.156861749972748,95.036893046320088,88.977239135041685,90.12405083838965,97.605014091919102,99.14812869461565,95.250859205178145,96.198993204928186,89.944068541277716,94.216701141923281,94.725867463095497,94.946641757998236,94.594828594563651,93.945143616753924,93.542409200796257,89.69336431116362,89.40453287669969,92.90128962719902,93.363394176334381,93.227790692352556,89.738711156773945,86.80988001304425,87.806629435015395,95.113912169985085,91.677102779619815,95.379929898831605,94.497107975446227,86.637813442431238,89.921381670235021,87.466015968282861,93.978720584567299,94.659182337533395,93.576337447512685,92.968556249844667,85.339840827181348,79.052908287974731,88.203770985888596,90.116880994620161,92.501341761625781,92.797108272659287,90.06336957026241,87.210427777962579,86.280087546704152,93.134330769014227,96.783929418204835,93.107589474826625,88.657304227707712,82.720440327126994,89.076366480909186,91.228356730938458,90.290714813962211,92.851527060451303,94.275629503892645,"-","-","-","-","-","-","-","-","-","-",93.5273722878472]
[null,"Disponibilidad",97.300603718334159,96.750775657848365,91.530767328264943,88.89915069208142,90.289165366563353,90.281001394711936,93.897099153085733,93.946623555383965,89.945609801884885,84.715173306425925,89.496895031797138,86.989884052003063,91.139383781369986,88.334765053112093,88.502829175589994,84.432976776227335,82.298419500029638,82.493341889557868,85.217149251918315,86.997132785722101,90.434182909128779,86.779985436154234,87.321457617164441,88.383919669816052,95.069343362933196,87.234075145070094,94.531898594418081,93.251781990653271,86.601686674594092,83.137013142378621,83.993978540968612,86.502502093364598,92.852857065209804,91.694356699508546,88.997819155724898,88.89216412526963,94.539558282322034,95.309892347908558,90.052760653665501,94.005672509198376,95.012380501110755,89.761973841448579,87.441498551579613,83.067289283923714,90.961817266832,94.833265528642556,92.327192160367773,90.634383898991672,88.447062411213281,89.464408238021306,89.858157680856294,90.457506879963461,91.48901050228784,90.834734061185358,82.447374747563259,79.961089973990113,77.528452677803756,80.845484595575556,85.227764867103119,86.861191335986575,90.429034240358462,87.633054060630499,93.217802726173915,91.391839105999821,86.524398919512493,93.014007693875399,92.23691537255101,92.85862139905727,87.639719720424878,85.809869605184858,92.0404148080829,90.200325479126477,90.980951022246657,86.955053525149808,83.742335509169195,88.127739034433674,91.765414468898086,89.568029160293847,93.930692133715354,92.33630971109568,91.561033306459322,86.00937530425341,83.365157565167806,84.334549855030261,87.024889759953012,86.777447613529006,87.360370756509596,84.631770397538503,78.703197511701774,89.797753968699084,87.06171656059864,91.301762749732859,91.217653666298389,88.944546573758316,86.613130079092201,85.828318894928671,86.320045201959644,86.651855671226954,88.624510976820758,86.631606344006201,83.9543661718685,83.835599424566155,88.705636705591203,87.373017702900214,92.095081236103667,89.575105808560622,84.558724509417715,81.850916201022287,81.717320649625833,88.422640199016357,91.821544293843488,93.960477609052361,87.823390015408137,84.185819458107176,84.45646756247929,89.436390153113109,87.49977308978464,91.779773166277707,94.240771652660229,89.570545277662333,89.519211960114973,82.482886810441045,91.506408193667738,96.630164137862181,93.625213412857207,92.320488466356281,89.504087123333022,90.252204454333793,94.160897464812678,91.288263301920125,95.459393296338035,93.527981572626288,90.400265981123127,89.552332371960787,83.553774052386174,91.40628151416982,95.145151068226212,91.381359977437114,87.876326690472467,83.598777164245817,83.519270252947877,91.805930684976857,89.758530832645377,94.502108104743613,96.089749200336257,85.932805306810153,89.34742672755938,87.633424336361685,87.588091901083075,94.376469400277202,94.666200996921035,95.785526336485049,92.510307556481024,91.206312818052496,94.716106538152346,92.015357076000143,96.014866499030887,96.904118854983778,94.996136988904851,87.762856634062643,85.444896928744924,92.902543615141099,96.845407604846685,94.41421167463912,93.272798896678381,87.913366053713432,90.965317727743326,90.743343342356951,92.322516065107791,91.937564529272095,93.445787537046883,93.413650455813723,90.140090978149118,85.299848656037767,86.4296231483995,90.532497548284383,89.059404211897316,89.485747805535865,86.435695950272518,82.987528068689784,91.835218544288608,89.239208802243397,93.637334350737149,93.452226260329212,88.019639137035682,85.863023806309954,81.573392636378458,88.652104081491217,92.87373243786638,93.008958185147108,93.042615800667619,85.070974184518576,80.489327200770077,88.925060948093858,88.698246862918964,89.46497475909193,90.611650823122801,90.707272602424993,86.17709259935647,82.34391793590045,91.409203688283412,95.237753682743374,92.977527230349736,89.10622989163636,82.753953457138124,84.695847143350505,88.574986245201316,88.673008724380026,91.541391276347667,92.907511476491067,"-","-","-","-","-","-","-","-","-","-",92.189719506924192]
[]
[null,"Horas de funcionamiento del equipo térmico mensual peninsular (número de horas)","2001-01-01","2001-02-01","2001-03-01","2001-04-01","2001-05-01","2001-06-01","2001-07-01","2001-08-01","2001-09-01","2001-10-01","2001-11-01","2001-12-01","2001","2002-01-01","2002-02-01","2002-03-01","2002-04-01","2002-05-01","2002-06-01","2002-07-01","2002-08-01","2002-09-01","2002-10-01","2002-11-01","2002-12-01","2002","2003-01-01","2003-02-01","2003-03-01","2003-04-01","2003-05-01","2003-06-01","2003-07-01","2003-08-01","2003-09-01","2003-10-01","2003-11-01","2003-12-01","2003","2004-01-01","2004-02-01","2004-03-01","2004-04-01","2004-05-01","2004-06-01","2004-07-01","2004-08-01","2004-09-01","2004-10-01","2004-11-01","2004-12-01","2004","2005-01-01","2005-02-01","2005-03-01","2005-04-01","2005-05-01","2005-06-01","2005-07-01","2005-08-01","2005-09-01","2005-10-01","2005-11-01","2005-12-01","2005","2006-01-01","2006-02-01","2006-03-01","2006-04-01","2006-05-01","2006-06-01","2006-07-01","2006-08-01","2006-09-01","2006-10-01","2006-11-01","2006-12-01","2006","2007-01-01","2007-02-01","2007-03-01","2007-04-01","2007-05-01","2007-06-01","2007-07-01","2007-08-01","2007-09-01","2007-10-01","2007-11-01","2007-12-01","2007","2008-01-01","2008-02-01","2008-03-01","2008-04-01","2008-05-01","2008-06-01","2008-07-01","2008-08-01","2008-09-01","2008-10-01","2008-11-01","2008-12-01","2008","2009-01-01","2009-02-01","2009-03-01","2009-04-01","2009-05-01","2009-06-01","2009-07-01","2009-08-01","2009-09-01","2009-10-01","2009-11-01","2009-12-01","2009","2010-01-31","2010-02-28","2010-03-31","2010-04-30","2010-05-31","2010-06-30","2010-07-31","2010-08-31","2010-09-30","2010-10-31","2010-11-30","2010-12-31","2010","2011-01-31","2011-02-28","2011-03-31","2011-04-30","2011-05-31","2011-06-30","2011-07-31","2011-08-31","2011-09-30","2011-10-31","2011-11-30","2011-12-31","2011","2012-01-31","2012-02-29","2012-03-31","2012-04-30","2012-05-31","2012-06-30","2012-07-31","2012-08-31","2012-09-30","2012-10-31","2012-11-30","2012-12-31","2012","2013-01-31","2013-02-28","2013-03-31","2013-04-30","2013-05-31","2013-06-30","2013-07-31","2013-08-31","2013-09-30","2013-10-31","2013-11-30","2013-12-31","2013","2014-01-31","2014-02-28","2014-03-31","2014-04-30","2014-05-31","2014-06-30","2014-07-31","2014-08-31","2014-09-30","2014-10-31","2014-11-30","2014-12-31","2014","2015-01-31","2015-02-28","2015-03-31","2015-04-30","2015-05-31","2015-06-30","2015-07-31","2015-08-31","2015-09-30","2015-10-31","2015-11-30","2015-12-31","2015","2016-01-31","2016-02-29","2016-03-31","2016-04-30","2016-05-31","2016-06-30","2016-07-31","2016-08-31","2016-09-30","2016-10-31","2016-11-30","2016-12-31","2016","2017-01-31","2017-02-28","2017-03-31","2017-04-30","2017-05-31","2017-06-30","2017-07-31","2017-08-31","2017-09-30","2017-10-31","2017-11-30","2017-12-31","2017"]
[null,"Nuclear",740.39529449461349,652.71540458411005,634.43993023013638,616.74118764969285,742.65745079662599,699.22026487828327,742.10348188871978,729.30198463757938,644.54374130827512,659.24104833573767,700.19713806683035,737.47233464602743,8298.4420750965019,743.99999999999989,656.28031608635195,592.61438894737523,582.15211005835636,645.95156028645329,686.84472517903328,742.83998128436065,738.49475572191659,632.23614197891891,731.20035611702474,719.35535020340262,742.32441741074319,8214.2941032739363,733.01295798079036,665.69097334603509,632.91664821247684,620.90297595102402,641.75085686542093,613.39377803425771,740.7781916428404,737.42751095139431,584.10609212286556,628.1078600844636,709.75774923499216,730.15438562391068,8037.3097536086671,729.71636825923815,696.00000000000011,667.16284394906563,684.45430195714187,658.69843678978668,692.67338326647041,744,733.67105393174052,634.98476314697348,610.68687311844951,679.89451196616676,689.95824720196572,8222.1903835892572,743.21606292365755,657.58779194659155,617.56693843059634,531.40057757513227,509.94294405366139,520.10477434029019,537.44160015163322,624.8279489501507,711.69504217298834,645.12302034412323,709.03518101215195,740.17646052271346,7548.1190781437581,731.54344186340381,662.08829080934242,684.86186766842877,482.76377203420174,609.16010424406966,669.6979269218491,675.99940715544597,717.64144975977729,616.09576853846386,636.67822221745337,701.99153922297126,739.82007838424363,7922.3028845508998,740.37690427840619,655.87830859570954,681.12414057658827,608.80923549878082,492.87371472105451,436.53745650908451,539.46947923568655,555.22856437728524,683.82986702577136,673.49402729230985,536.53906201797849,700.5556039905681,7304.7163641192228,728.58798376517984,696,728.73397911363043,554.18052519052833,644.42693392063404,630.90811848306907,645.97298801702891,696.30629944283351,614.77830027979041,598.1170090053356,564.58907690615615,679.88702689797435,7782.4882410221599,744,597.0931302460707,537.20209963544073,554.59560222008213,506.19676805828652,488.53218663068463,575.13509344678755,744,612.79110679517896,565.05072710640877,552.72339643595808,547.01753049393881,7024.3376410688379,627.56415060934216,634.75867471075355,671.87166524938357,669.05623841471765,599.66502136654697,639.92529085597641,741.4566787796208,742.98267151184825,697.87310538270242,742.15268443203729,690.22409675105803,649.38845060189976,8106.0209996314197,643.97856659086642,578.61974223823347,598.58440002924578,605.92907231021798,498.4829410848086,646.56303267842668,679.89714469837224,744,700.04914045147098,612.18989300872352,617.58038607713615,646.56625879158753,7571.6462817164038,699.34286861281089,692.82510716294837,738.73123162779405,706.51209495310718,602.28787810759354,487.81138264633717,703.41658721334079,744,720.00000000000011,729.08840844203689,544.82597740796393,586.64178258928928,7955.4833187632221,620.87566720985456,592.86820079814277,697.38836433553683,598.00452421763794,541.72548589780502,591.76936262145796,694.76292360067498,688.66766148393265,646.50379395133496,591.53802534935244,557.1259900852815,540.22361467293842,7361.4536142239494,607.10061960388668,626.41682359248762,697.38836433553683,676.71108129593892,580.04989976995944,470.12818484585176,581.49278713463582,581.79597442351212,654.80204897142062,693.03705474224114,582.42036399747519,640.8602563459217,7392.2034590588664,694.29166281505104,626.4895729064599,697.38836433553683,630.40458866066774,478.66698536033948,514.68021334868695,667.25722673118003,699.26811733913655,663.22317624904599,560.92726389156667,536.08735992224581,661.13289790269619,7429.8174294626142,609.5241199168579,559.25749744472796,697.38836433553683,669.32942141251738,517.29574068547311,655.23375124462223,699.26811733913655,699.26811733913655,676.71108129593892,690.1311600537731,500.68294953635359,589.72432645148672,7563.8146470555603,699.26811733913655,631.59700920954288,"-","-","-","-","-","-","-","-","-","-",1330.8651265486797]
[null,"Carbón",484.2048481853472,416.72749118219662,416.41077613866645,419.86291291168988,508.34476701400757,595.18955753364469,647.95057670158144,646.17099351063803,655.22260482074125,661.03657151537948,660.3599360875603,692.48092302294629,6805.11987289852,693.05291019159051,642.01467368468593,688.89572096595657,640.64960806017996,655.90087966205056,626.03182054351998,646.86800099396828,664.8505270291638,654.27943163078578,636.43685840487899,635.23197565860551,524.25912888940377,7708.7502863947557,566.24860874585329,563.16980811098915,573.82455991124937,514.92732088338073,558.71326591368518,625.18328794590104,680.21711162048064,681.19589348639761,661.0366130319137,681.81728169882717,623.94076748675934,585.18234776834265,7316.1613955028488,610.08978198208297,604.32257477911401,640.61169245489373,526.77685701057112,543.52443712743582,619.82922234836701,679.43201177164519,665.12985596224951,646.50353049691523,649.35869359382207,614.21044896613023,676.66403332883328,7476.3968436188761,697.48009321635379,620.3195151807289,639.67581699109667,558.3361915645803,595.81303597813371,599.52198266538096,676.96299528137592,644.38378417519391,650.1051149591749,679.82362721769846,676.46522993668179,675.19308136785082,7744.7874327678564,690.91152671503835,595.55880193696612,574.9446335234295,409.24253453310513,542.9471069084517,619.13706782127906,677.3432759993774,612.10235987660531,585.58507364316245,556.84275788837726,520.20821929093847,528.40900469595294,6913.3020504746319,656.66360041375628,562.98362549545504,544.0455951623461,612.85167152659835,648.75993280019031,611.12263507482157,640.60430390061003,638.69552626880829,604.93218403958736,589.77775173607142,580.91804736030178,637.17272153734893,7368.6196442139844,567.79985540149119,511.34304016062401,454.10447938543166,413.55028370362174,282.38057551306139,265.02054456357536,447.06426623926905,378.09892597914592,392.67421705169306,478.89114439409008,465.9269481596109,518.56111049703384,5175.3852409638548,534.53753546295252,376.54387273866098,366.47651247190595,233.64592958991923,288.71136748830185,311.33510832320104,421.00554511624472,240.6120776684721,359.51814229394643,411.53366585608472,285.01791938395786,250.28296304483982,4079.2206394384862,223.64746508971658,198.7791137025165,141.89345823661617,95.114852989941411,117.0119754246343,184.55954920599825,305.38174348771224,351.53836278445272,377.85168039212982,282.36275134610696,215.31042813329097,273.02602734057086,2769.2204948523754,327.12582729877829,356.9065645872704,489.50637868254648,378.19708035113592,394.04346330264895,359.88405793185683,573.52844761824986,544.88682105194891,578.28808859276307,553.53603629161887,539.74101242953725,555.16213786960554,4777.6609972269734,551.7508976988106,572.75343926494509,493.46949084919095,290.8449617639298,429.9264972229202,554.40474591244083,526.79685041669552,529.33098094115121,434.53839969190449,464.52546533742645,433.04992407124166,420.14663625115247,5787.0186881752297,414.94671873923471,354.61387397423465,238.51165604969475,177.46577640553537,281.37239606158886,364.6400464828277,653.62429773891006,575.38851614034184,595.43826558357512,556.42913018113404,380.19337779926605,572.49272268544826,4372.9408691685585,280.36384593562713,133.83390211651431,188.66896064887462,193.06748021039789,384.50410488325383,563.96550732612263,613.40342777335161,575.69623004159337,611.45267204304173,489.01658193239973,375.33886064413321,475.06999986625931,4895.2051323937094,561.1174596533059,367.94017302221425,329.16787224327044,348.87795686290252,335.97695170624434,590.58055487093077,654.03121698277232,599.59067330784626,531.74538833513884,505.03626855890622,530.8829195970203,535.60130186988545,5890.5487370104383,329.17327058985359,263.27882420319122,252.32181858005561,153.14527467484379,170.01206706886734,274.61557886170851,465.46364726029179,444.79351857774901,546.01345026725392,525.97746928177514,559.0333257479391,617.65698567618892,4649.3013537307033,611.06947137492421,457.41981591611454,"-","-","-","-","-","-","-","-","-","-",1068.4892872910391]
[null,"Fuel + Gas",189.53191104634621,151.77936558164768,121.29893820417433,58.61538420628569,105.04367642483534,279.0971411552913,348.47668330403843,308.52970661674567,274.90072089368482,241.85552343901657,268.4295898803652,361.22599790991359,2708.7846386623446,421.74248326734232,284.38710741076585,252.84501716476851,233.59322024884264,193.62669886002539,289.39201352971992,342.31590154313528,229.63906928573897,226.19730415718601,222.90152358689565,140.59325140221173,118.0257615944488,2955.1210573333979,176.96679385876831,171.54941573835146,43.933771181070661,21.881602194705572,56.323237753882921,300.78196796201576,312.32365553550176,277.87091001430446,226.26912616749411,190.45060914041187,98.89235464172809,128.92917352838651,2026.7610784219451,135.27740306571704,94.106277292249459,161.66760061817507,42.596571883816637,75.165799105083778,195.40831601205204,284.45026446152281,184.88884229946748,255.0484207184488,158.01421293495386,130.66953384794536,206.84714102210114,1925.9039709360259,254.58903468228914,293.99039604316988,288.52205365216525,95.940460790716386,152.66680115291874,294.17741353109625,351.52089194212806,130.1373094167588,142.46041394554408,133.85375954486088,137.61648497940322,224.68576999397172,2525.4801583065409,204.27379464734253,159.57940445091936,81.920101037375673,90.635956181553311,35.443572289761889,182.81692234753345,385.618095674671,151.99702194062095,278.21018160353668,187.79175091680901,92.837056038380382,47.225236737667039,1898.3490938661714,39.449886340801775,48.666823131216731,39.920609592308082,25.839913767133609,41.357503953908726,42.941193452829246,104.23220796641456,83.570765809330709,90.603024276910347,55.6616804998935,120.41740068984157,105.82732381097705,972.39715479246991,108.74452405176089,83.835203324287178,52.838917891155326,93.807945694414343,58.02524904753168,107.79823873776206,78.926145756329561,134.79009997631573,89.91899741386942,80.571176007598112,103.35783339194593,86.639300572489418,1081.3076682001633,70.250019736889328,56.465302548570698,62.706413173237259,49.315850037918757,49.955717597410526,51.513242854647977,102.70225287620306,59.401377997931966,53.354904089384206,51.131098093250493,70.820783274108337,102.68444518359419,1049.4217694536937,158.59939968280182,129.39056881583718,43.266966388353673,72.400683330493408,94.936853097051284,99.514078301372152,109.85027904829845,85.451298262300739,93.519892390397203,72.838776756698792,98.546580317886608,99.92872029429455,1191.7194503890823,0,0,0,0,0,0,0,0,0,0,0,0,0,0,0,0,0,0,0,0,0,0,0,0,0,0,0,0,0,0,0,0,0,0,0,0,0,0,0,0,0,0,0,0,0,0,0,0,0,0,0,0,0,0,0,0,"-","-","-","-","-","-","-","-","-","-","-","-","-","-","-","-","-","-","-","-","-","-","-","-","-","-","-","-","-","-","-","-","-","-","-"]
[null,"Ciclo combinado","-","-","-","-","-","-","-","-","-","-","-","-","-","-","-","-",0,109.45251915684318,282.35392614505895,383.35073181000007,420.1695857444185,551.19910119753092,550.26899767074065,366.22049817331407,338.9449163380379,2899.2074999904562,374.39557344374066,442.87830880125995,385.43607411425171,202.81274566919114,367.76804707553941,654.95968687796153,611.56671907826069,556.9350780752651,600.62452578419106,581.45010933139838,451.22830051768051,355.50173775748038,5074.8553962644874,454.16740191779547,525.41037054727428,574.23615665943271,457.08157830049367,488.74509253081442,547.01592508761553,561.43621558448274,447.56075604856602,533.71881012889855,508.71086858653757,438.22961692268012,468.42593722711769,4687.6361398051131,481.11366874050179,451.17221174890028,439.23874966868016,429.40948960671005,490.63221422082466,618.592095215825,673.34058776823406,593.77305114653018,510.49170493894081,458.74288483778651,467.94084405334405,445.80363097536178,5147.0520464261863,551.39745551376461,507.19998655375935,465.38935881377921,438.99621369713759,488.50970685325598,523.23454658378068,594.98388296148357,475.09523003617437,553.65564099615256,471.774022326656,427.19062584233041,448.10352749311977,5546.3043250144401,556.33075799397977,395.37781392517354,359.73105410431629,346.8723076969352,383.29467064936131,504.0462534093582,534.52453809768042,420.26627539020728,432.50024743023033,454.63570221387056,517.80229218293812,473.222125258983,4644.7663694399389,506.25202968633533,505.21405824996231,446.6869851508431,450.91539293186929,481.60387160775605,494.36831003050889,557.66667696108721,521.06469553610214,496.34589873294499,469.26358180817442,452.10139669981572,386.41277535636556,5736.7801967987443,400.09894921436319,320.67201260902442,333.63981363009759,347.91085743689734,349.33791288790366,466.34546350217431,525.08197900921039,509.66513123686701,491.9294742823862,429.06807492374872,372.07027826854909,390.92070587790545,4743.5570236803251,348.50366051233556,324.03571188723873,314.00543623062248,295.45145871455497,292.78700641947034,338.17331819806321,409.8386694095546,359.25587692738571,390.69819498972214,339.19988584005841,351.84616162372981,316.98252280797504,3985.9352513526192,328.49549918331633,279.80359748551956,264.46720962373951,190.76043052810863,254.56900183166724,297.67543883945433,300.3921959655151,305.24519292718719,285.35682788790666,262.87330145276934,242.67435059708814,244.26391784111334,3256.6525516292918,260.93280193707938,243.15478965098322,211.70184148390393,162.23987621031256,156.12954159231626,183.69218344970699,214.63865676317079,220.67476088544282,196.08596572921965,225.66520793450826,214.66612520710822,201.65254005277436,2491.7429371272947,175.137844716008,136.93309927043404,122.78651066570841,104.03340346669093,117.29328944420149,106.20508495569334,133.31025693340192,142.53929759484942,147.5291503709158,194.33124082330605,161.94384494608926,191.64661405796366,1733.6896372452625,138.19998108042785,124.4359634611754,123.54148336660958,112.55739304328935,110.13365555395664,116.49333666296428,124.64527445605229,148.34490139575936,177.09703535915725,176.06133188176392,166.35507066580462,178.01060858892455,1695.8760355158847,178.14624107783848,153.2679837147378,153.35985827957759,153.43734755614844,147.57746703004005,142.43752392504163,230.70867907314943,186.23465400231123,184.30424916755882,184.30424916755882,184.93037677606475,188.93016112500908,2067.0170913482634,161.96384598025227,133.03564174828071,133.58660534373698,122.86505655228477,159.90635453113734,159.03089461918549,190.08708374435969,164.96029936214592,162.84752187675744,232.2589355896794,227.69028219423748,217.58545493754738,2065.817976479605,214.92861909970892,132.17757742093366,"-","-","-","-","-","-","-","-","-","-",347.10619652064253]
[null,"Horas de funcionamiento",474.70191997037404,409.83299031366295,395.66539033356707,373.98026876893391,461.39095557552298,535.17479382718398,589.80024584704961,573.86850874355389,543.22494918969937,540.51652457543889,559.83231040336136,610.83151989404053,6069.810400697259,630.31994738111837,543.84758392318406,535.92331540095586,492.33968975762724,503.12459934846765,532.62615923556348,573.43148929471135,553.49899383665388,530.77787572862815,549.51221291817194,508.06280272036599,463.36543337717944,6203.3981735047964,495.31602611521606,480.71094723159945,444.64329508099632,394.04082958844765,442.28465243516189,548.68841352256982,602.82368008975811,587.18710649330183,534.35171599901184,542.77304006336681,503.30703564237064,487.38843793066178,5993.3104696267119,510.8553966615051,501.26170851398342,530.73939861880183,448.19944040717303,460.51109174320572,532.91045047703801,587.74321570936013,533.9548875683206,538.39313527262527,508.23969802834512,490.00820319948753,535.48417286204074,5863.0239637763962,565.16127288958069,520.32182083423481,515.29828918306202,431.55696316500894,465.76005158760512,531.08150700279111,585.29926246163791,531.12623345495842,530.28343573145719,506.88722190903792,522.25436939391386,536.13728734811627,5957.5740273879246,569.7344816104229,505.28818098579177,476.41734328155155,381.18614702319621,451.9973264732663,522.49404060228619,599.23053327700848,506.22660727607172,530.18123943287787,480.50805722748669,450.76747097729947,460.55236161930475,5781.2518569596768,535.78868947930846,434.37177010311723,417.63606949239477,414.83709659954951,420.09255656210377,449.89237518026755,498.43493481907103,451.16129654314091,475.37509934654111,474.67681293699599,486.08381417678089,514.90846505987577,5398.653662374445,521.46560956976793,498.75895190315458,458.92306155449359,425.01919220278239,419.37826371129569,423.84974670560024,499.67900590865548,478.65082328101693,452.08083487523936,456.50577191644396,441.40808061461922,440.43231115424226,5501.9150234269773,460.34512985659501,356.27807646941153,350.5346564808288,326.32760080249824,332.68184876725746,393.17409692347718,468.32011383593618,443.50276453653163,441.23727590396328,415.79754441781023,355.70381327625137,364.08879775319815,4728.8003333928782,355.19792707298467,335.82099965193822,318.15268065214337,297.69078047126499,291.14760213744802,339.73570303031767,425.59472806674893,408.01059099683749,424.44271803415444,379.74331515315731,363.20176975074151,351.2418817814343,4244.6584326626989,367.0269169379589,336.84597736108833,364.12916538873736,297.65868291311506,318.9488179540254,363.68872896116608,423.73108718390159,430.16068863083365,419.95973545764122,386.50151852041819,372.77389768441805,386.20778155354463,4313.9395085666565,403.71072472948072,397.80304220861819,368.15328593203662,284.23999855904873,297.80934141767113,324.12682612236239,371.60316426602157,382.57204137851591,341.15494941759948,366.79114872931262,321.28617768275342,319.22061892727606,4211.7745504029217,308.73633992400056,267.39951893130871,249.21907371360192,206.40692723331884,229.48671904827603,252.07890126954288,355.7169552880203,340.91217585957332,341.32310550556917,349.05684709339806,281.71580601235036,342.52288582547794,3331.9897232067528,252.53941110335504,212.3928139447587,237.53118994375771,228.73256549954644,256.70430564519148,284.4064889203824,320.37036425626354,324.94176277416818,362.75042184144286,339.34562557493791,287.15929500805061,328.02273012057117,3437.9446654847352,358.11306362304708,285.5447016277941,288.60972510353764,281.73561767266762,251.77722362195672,317.1363607920386,410.6912742091979,377.26347139489781,341.30526880447275,328.74903200428224,331.03061855653317,356.52812985669817,3942.7605276876434,281.52047847426428,239.58626812499512,262.01428683724873,228.03423625777435,226.54882685437767,274.58439144230005,344.20883956119621,324.61686088316196,342.25271232561403,381.30097374558216,351.97416835012996,375.30507278838581,3641.5629151591584,391.95969532168408,295.84828120303899,"-","-","-","-","-","-","-","-","-","-",687.80797652472324]
[]
[null,"Indisponibilidad equipo térmico anual peninsular (%)\nTipo permanente",2001,2002,2003,2004,2005,2006,2007,2008,2009,2010,2011,2012,2013,2014,2015,2016,2017,2018,2019,2020,2021,2022,2023,2024]
[null,"Nuclear",{"$f":"O3","v":0},{"$f":"AB3","v":0},{"$f":"AO3","v":0},{"$f":"BB3","v":0},{"$f":"BO3","v":0},{"$f":"CB3","v":0},{"$f":"CO3","v":0},{"$f":"DB3","v":0},{"$f":"DO3","v":0},{"$f":"EB3","v":0},{"$f":"EO3","v":0},{"$f":"FB3","v":0.24640777950854525},{"$f":"FO3","v":6.0123498200084766},{"$f":"GB3","v":6.0123498200084766},{"$f":"GO3","v":6.0123498200084766},{"$f":"HB3","v":6.0123498200084722},{"$f":"HO3","v":6.0123498200084802},"-","-","-","-","-","-","-"]
[null,"Carbón",{"$f":"O4","v":0},{"$f":"AB4","v":0.97044966997218762},{"$f":"AO4","v":1.2038749294335811},{"$f":"BB4","v":1.2047008874924376},{"$f":"BO4","v":0.4123416590261158},{"$f":"CB4","v":0},{"$f":"CO4","v":0.61368827006285709},{"$f":"DB4","v":0.61713466945488205},{"$f":"DO4","v":0.61714748903872363},{"$f":"EB4","v":0.61665788722278814},{"$f":"EO4","v":3.5011364646797737E-2},{"$f":"FB4","v":0.68304513813294931},{"$f":"FO4","v":1.517921031450213},{"$f":"GB4","v":2.4819339078292271},{"$f":"GO4","v":1.9698089992185717},{"$f":"HB4","v":0.18033252516578877},{"$f":"HO4","v":0},"-","-","-","-","-","-","-"]
[null,"Fuel + Gas",4.5485813943273046,7.2059786926034768,7.8627663261707257,7.9755281315633306,9.626202476451013,10.791344318296133,16.318838591625205,8.6191733875491785,8.4876646658826367,4.2454325358351124,35.968444701683573,1.2363815062455383,0,0,0,"-",{"$f":"HO5","v":"-"},"-","-","-","-","-","-","-"]
[null,"Ciclo combinado","-",0,0,0,0,0,0,0,0,0,0,0,0,0,0,0,{"$f":"HO6","v":0},"-","-","-","-","-","-","-"]
[null,"Indisponibilidad permanente",1.3024711057541853,2.3061077844546243,2.3041931008141519,2.1122146490656402,1.8912860340650088,1.7626655021621247,2.500400735949706,0.98286789295277677,0.91758392902724784,0.3636880139089036,1.1991518341542617,0.23412384155597443,1.4124636639092127,1.6451973149779076,1.5319089276306996,1.1201396088563746,{"$f":"HO7","v":1.0825762504232392},"-","-","-","-","-","-","-"]
[]
[null,"Indisponibilidad equipo térmico anual peninsular (%)\nTipo prevista",2001,2002,2003,2004,2005,2006,2007,2008,2009,2010,2011,2012,2013,2014,2015,2016,2017,2018,2019,2020,2021,2022,2023,2024]
[null,"Nuclear",{"$f":"O10","v":4.4782331224372633},{"$f":"AB10","v":5.5758488333101184},{"$f":"AO10","v":5.9159421281085631},{"$f":"BB10","v":4.0263634299632729},{"$f":"BO10","v":5.6866657177374602},{"$f":"CB10","v":4.7942137796150233},{"$f":"CO10","v":13.84668369582505},{"$f":"DB10","v":3.5980455028127052},{"$f":"DO10","v":15.533039838184715},{"$f":"EB10","v":3.9249746357337036},{"$f":"EO10","v":12.556441442285751},{"$f":"FB10","v":8.3062508386058429},{"$f":"FO10","v":6.606036700752405},{"$f":"GB10","v":7.79056873313578},{"$f":"GO10","v":5.6436556746393771},{"$f":"HB10","v":6.0638347635782175},{"$f":"HO10","v":0},"-","-","-","-","-","-","-"]
[null,"Carbón",2.7226692200686196,{"$f":"AB11","v":2.6307514813683452},{"$f":"AO11","v":3.0177077144102782},{"$f":"BB11","v":3.2231194239932552},{"$f":"BO11","v":3.2271609695247601},{"$f":"CB11","v":4.0708668934638972},{"$f":"CO11","v":2.5993979442983406},{"$f":"DB11","v":13.963511314587704},{"$f":"DO11","v":5.8773025367777523},{"$f":"EB11","v":2.1037528236366398},{"$f":"EO11","v":2.0036693200746569},{"$f":"FB11","v":2.7187238615189653},{"$f":"FO11","v":4.3001002899460881},{"$f":"GB11","v":1.6041260474363706},{"$f":"GO11","v":2.4206112844912528},{"$f":"HB11","v":5.8501483767524354},{"$f":"HO11","v":5.8464513463376218},"-","-","-","-","-","-","-"]
[null,"Fuel + Gas",2.0127947319599366,2.2614763582200728,2.4015887873658786,1.2585591039957218,2.4943934552373608,2.3846280542474849,3.329844952705483,5.4011252964452705,4.2702944421240865,0,2.3056556009887745,0,0,0,0,"-",{"$f":"HO12","v":"-"},"-","-","-","-","-","-","-"]
[null,"Ciclo combinado","-",1.8002816870491989,3.0918776423015744,1.451048106104323,2.9370043615998975,1.7632784020925805,1.4389145272773824,2.4974593594691119,2.2603399410375968,4.9141917693290997,6.5414549218692679,5.0414661490887909,3.4421265873922984,5.9987243210593331,6.6862194761845055,4.759930339104228,{"$f":"HO13","v":3.8827219180186798},"-","-","-","-","-","-","-"]
[null,"Indisponibilidad prevista",3.0332762191380467,3.3013709497901194,3.6478260907179307,2.6517754851913047,3.5424965899939096,3.0941872284997136,4.2107836420461702,5.8125156369423188,5.5800041474848392,3.8175784575029801,6.289931584675414,4.9312973474316335,4.1599270691075496,5.1787725186432851,5.4395030704972713,5.2440519036513935,{"$f":"HO14","v":3.6288624644136394},"-","-","-","-","-","-","-"]
[]
[null,"Indisponibilidad equipo térmico anual peninsular (%)\nTipo no prevista",2001,2002,2003,2004,2005,2006,2007,2008,2009,2010,2011,2012,2013,2014,2015,2016,2017,2018,2019,2020,2021,2022,2023,2024]
[null,"Nuclear",{"$f":"O17","v":0.7170349601035485},{"$f":"AB17","v":0.65140683712323644},{"$f":"AO17","v":1.9462399054783344},{"$f":"BB17","v":2.3189182032555062},{"$f":"BO17","v":9.1155505260456309},{"$f":"CB17","v":4.5005857372031652},{"$f":"CO17","v":2.4478833982182864},{"$f":"DB17","v":7.8970324959868803},{"$f":"DO17","v":4.3244212889766054},{"$f":"EB17","v":3.9170897170236372},{"$f":"EO17","v":1.1333354823510995},{"$f":"FB17","v":0.86014161067514072},{"$f":"FO17","v":3.3656049739045248},{"$f":"GB17","v":1.6882101019776004},{"$f":"GO17","v":3.7700661993063433},{"$f":"HB17","v":1.9516485833388026},{"$f":"HO17","v":3.4532370839545835E-2},"-","-","-","-","-","-","-"]
[null,"Carbón",5.05144411284593,{"$f":"AB18","v":5.4778095736523102},{"$f":"AO18","v":3.3340683516690666},{"$f":"BB18","v":5.0814327856026669},{"$f":"BO18","v":5.3272662080019719},{"$f":"CB18","v":4.4471925070627183},{"$f":"CO18","v":8.9791891234074832},{"$f":"DB18","v":6.4643000974331288},{"$f":"DO18","v":7.0722175626668466},{"$f":"EB18","v":6.0944000710246895},{"$f":"EO18","v":5.0671145721585642},{"$f":"FB18","v":4.6563978011395406},{"$f":"FO18","v":2.4670212380569554},{"$f":"GB18","v":6.2562480483741894},{"$f":"GO18","v":5.6912434744680969},{"$f":"HB18","v":7.3518918511095848},{"$f":"HO18","v":6.8637332325368101},"-","-","-","-","-","-","-"]
[null,"Fuel + Gas",7.6432839727574668,17.179844791939963,7.4644965199580966,8.433102184566188,11.994724308845306,11.062988222036122,5.932397734545555,4.8944512751921874,7.5718598265712451,10.247356993471412,1.2565743058508427,0,0,68.924086757991176,99.27986006996521,"-",{"$f":"HO19","v":"-"},"-","-","-","-","-","-","-"]
[null,"Ciclo combinado","-",3.7863851697109077,3.8339960005801692,3.3145691101467589,7.6658724880270714,4.5488579799424746,6.2219067824784968,4.9668540106653172,5.7575593114761299,3.481404864392379,2.2996100199774485,2.6941359011846262,1.6112316546094623,2.3241728993208488,3.1968995291953384,4.9493548469335682,{"$f":"HO20","v":2.589905794134121},"-","-","-","-","-","-","-"]
[null,"Indisponibilidad no prevista",4.5248688937377892,7.158446120685162,3.9952201548024244,4.77850298577959,8.0418184564285813,5.5751181090443156,6.227099061405478,5.8315987672046949,6.0026388337032737,4.5304702266679913,2.7523857485249534,2.8192217350122468,2.1050932018754462,3.93682136413541,4.3303411389530684,4.9627997631122103,{"$f":"HO21","v":3.0988417782389233},"-","-","-","-","-","-","-"]
[]
[null,"Disponibilidad equipo térmico anual peninsular (%)",2001,2002,2003,2004,2005,2006,2007,2008,2009,2010,2011,2012,2013,2014,2015,2016,2017,2018,2019,2020,2021,2022,2023,2024]
[null,"Nuclear",{"$f":"O24","v":94.804731917459193},{"$f":"AB24","v":93.772744329566649},{"$f":"AO24","v":92.137817966413095},{"$f":"BB24","v":93.654718366781225},{"$f":"BO24","v":85.197783756216907},{"$f":"CB24","v":90.705200483181827},{"$f":"CO24","v":83.705432905956656},{"$f":"DB24","v":88.504922001200413},{"$f":"DO24","v":80.142538872838671},{"$f":"EB24","v":92.157935647242667},{"$f":"EO24","v":86.31022307536314},{"$f":"FB24","v":90.587199771210479},{"$f":"FO24","v":84.016008505334597},{"$f":"GB24","v":84.508871344878145},{"$f":"GO24","v":84.573928306045801},{"$f":"HB24","v":85.97216683307451},{"$f":"HO24","v":93.953117809151976},"-","-","-","-","-","-","-"]
[null,"Carbón",92.225886667085447,90.920989275007159,92.44434900448708,90.490746902911638,91.033231163447155,91.481940599473376,87.807724662231323,78.955053918524285,86.433332411516673,91.18518921811588,92.894204743119985,91.941833199208546,91.71495744054674,89.657691996360214,89.918336241822075,86.617627246972191,{"$f":"HO25","v":87.289815421125567},"-","-","-","-","-","-","-"]
[null,"Fuel + Gas",85.795339900955298,73.352700157236484,82.271148366505301,82.33281057987476,75.884679759466309,75.761039405420263,74.418918721123745,81.085250040813364,79.670181065422028,85.507210470693479,60.469325391476815,98.763618493754464,100,31.075913242008824,0.72013993003479015,"-",{"$f":"HO26","v":"-"},"-","-","-","-","-","-","-"]
[null,"Ciclo combinado","-",94.413333143239896,93.07412635711826,95.234382783748927,89.397123150373034,93.68786361796495,92.339178690244125,92.535686629865566,91.982100747486271,91.604403366278518,91.15893505815329,92.264397949726572,94.946641757998236,91.677102779619815,90.116880994620161,90.290714813962211,{"$f":"HO27","v":93.5273722878472},"-","-","-","-","-","-","-"]
[null,"Disponibilidad",91.139383781369986,87.234075145070094,90.052760653665501,90.457506879963461,86.524398919512493,89.568029160293847,87.06171656059864,87.373017702900214,87.49977308978464,91.288263301920125,89.758530832645377,92.015357076000143,92.322516065107791,89.239208802243397,88.698246862918964,88.673008724380026,{"$f":"HO28","v":92.189719506924192},"-","-","-","-","-","-","-"]
[]
[null,"Horas de funcionamiento del equipo térmico anual peninsular (número de horas)",2001,2002,2003,2004,2005,2006,2007,2008,2009,2010,2011,2012,2013,2014,2015,2016,2017,2018,2019,2020,2021,2022,2023,2024]
[null,"Nuclear",{"$f":"O31","v":8298.4420750965019},{"$f":"AB31","v":8214.2941032739363},{"$f":"AO31","v":8037.3097536086671},{"$f":"BB31","v":8222.1903835892572},{"$f":"BO31","v":7548.1190781437581},{"$f":"CB31","v":7922.3028845508998},{"$f":"CO31","v":7304.7163641192228},{"$f":"DB31","v":7782.4882410221599},{"$f":"DO31","v":7024.3376410688379},{"$f":"EB31","v":8106.0209996314197},{"$f":"EO31","v":7571.6462817164038},{"$f":"FB31","v":7955.4833187632221},{"$f":"FO31","v":7361.4536142239494},{"$f":"GB31","v":7392.2034590588664},{"$f":"GO31","v":7429.8174294626142},{"$f":"HB31","v":7563.8146470555603},{"$f":"HO31","v":1330.8651265486797},"-","-","-","-","-","-","-"]
[null,"Carbón",6805.11987289852,7708.7502863947557,7316.1613955028488,7476.3968436188761,7744.7874327678564,6913.3020504746319,7368.6196442139844,5175.3852409638548,4079.2206394384862,2769.2204948523754,4777.6609972269734,5787.0186881752297,4372.9408691685585,4895.2051323937094,5890.5487370104383,{"$f":"HB32","v":4649.3013537307033},{"$f":"HO32","v":1068.4892872910391},"-","-","-","-","-","-","-"]
[null,"Fuel + Gas",2708.7846386623446,2955.1210573333979,2026.7610784219451,1925.9039709360259,2525.4801583065409,1898.3490938661714,972.39715479246991,1081.3076682001633,1049.4217694536937,1191.7194503890823,0,0,0,0,"-","-",{"$f":"HO33","v":"-"},"-","-","-","-","-","-","-"]
[null,"Ciclo combinado","-",2899.2074999904562,5074.8553962644874,4687.6361398051131,5147.0520464261863,5546.3043250144401,4644.7663694399389,5736.7801967987443,4743.5570236803251,3985.9352513526192,3256.6525516292918,2491.7429371272947,1733.6896372452625,1695.8760355158847,2067.0170913482634,2065.817976479605,{"$f":"HO34","v":347.10619652064253},"-","-","-","-","-","-","-"]
[null,"Horas de funcionamiento",6069.810400697259,6203.3981735047964,5993.3104696267119,5863.0239637763962,5957.5740273879246,5781.2518569596768,5398.653662374445,5501.9150234269773,4728.8003333928782,4244.6584326626989,4313.9395085666565,4211.7745504029217,3331.9897232067528,3437.9446654847352,3942.7605276876434,3641.5629151591584,{"$f":"HO35","v":687.80797652472324},"-","-","-","-","-","-","-"]

{"sheet":"Año","index":12,"n_rows":29,"n_cols":26,"rows_kept":29,"cut":false,"hidden":true,"merged":[]}
[null,null,null,null,null,null,null,null,null,null,null,null,null,null,null,null,null,null,null,null,null,null,null,1,null,1]
["Permanente ",1990,"1990-1997","2001-2008",null,null,null,null,null,null,null,null,null,"Indisponibilidad permanente",null,"Mensual"]
["Prevista",1991,"1998-2005","2009-2016",null,null,null,null,null,null,null,null,null,"Indisponibilidad prevista",null,"Anual"]
["No prevista",1992,"2006-2013","2017-2024",null,null,null,null,null,null,null,null,null,"Indisponibilidad no prevista"]
[null,1993,"2014-2021",null,null,null,null,null,null,null,null,null,null,"Disponibilidad"]
[null,1994,null,null,null,null,null,null,null,null,null,null,null,"Horas de funcionamiento"]
[null,1995]
[null,1996]
[null,1997]
[null,1998]
[null,1999]
[null,2000]
[null,2001]
[null,2002]
[null,2003]
[null,2004]
[null,2005]
[null,2006]
[null,2007]
[null,2008]
[null,2009]
[null,2010]
[null,2011]
[null,2012]
[null,2013]
[null,2014]
[null,2015]
[null,2016]
[null,2017]